{"text_format":"1","workbook":"xlsx","n_sheets":7,"sheets":["Latest Data Fine Aggregate","Latest Data Coarse Aggregate","Historical Data CoarseAggregate","Historical Data FineAggregate","Coord.","CHEMSTONE","CHEMSAND"],"not_rendered":{"charts":0,"images":0,"macros":1,"external_links":0,"defined_names":2,"comments":0,"pivot_tables":0},"unopened":[],"bounds":{"document_bytes":16777216,"sheet_cells":100000,"rows_first":2000,"rows_last":500,"rows_between":2000,"halvings":0,"cell_chars":16384,"cell_head_chars":4096},"cells_cut":0,"cells_raw":0,"read":"whole","date_system":"1900"}

{"sheet":"Latest Data Fine Aggregate","index":0,"n_rows":189,"n_cols":19,"rows_kept":189,"cut":false,"hidden":false,"merged":[]}
["Producer Name","Facility Name","Sample Date","Material Description","Facility ID","Direction","Latitude","Direction2","Longitude","Sample ID","Sampled By","Resistivity [ohm-cm]:","pH Units:","Chloride [ppm]:","Sulfate [ppm]:","Geosynthetic Spec","Steel Spec","SO4","Cl"]
["Martin Marietta","Arrowood Quarry - Charlotte","2019-09-18","Miscellaneous Material for Electrochemical","CA31",{"$f":"VLOOKUP(Table57[[#This Row],[Facility ID]],'Coord.'!$A$1:$E$818,2,FALSE)","v":"N"},{"$f":"VLOOKUP(Table57[[#This Row],[Facility ID]],'Coord.'!$A$1:$E$818,3,FALSE)","v":35.111865000000002},{"$f":"VLOOKUP(Table57[[#This Row],[Facility ID]],'Coord.'!$A$1:$E$818,4,FALSE)","v":"W"},{"$f":"VLOOKUP(Table57[[#This Row],[Facility ID]],'Coord.'!$A$1:$E$818,5,FALSE)","v":-80.921875},983528,"Smith, Michael L",3535,7.92,"<32","<186.704",{"$f":"IF(ISBLANK(M2),\"N/A\",IF(AND(4.5<=$M2,$M2<=9),IF($L2>=3000,IF($S2<=100,IF($R2<=200,\"MEETS\",\"DOES NOT MEET\"),\"DOES NOT MEET\"),\"DOES NOT MEET\"),\"DOES NOT MEET\"))","v":"MEETS"},{"$f":"IF(ISBLANK(M2), \"N/A\", IF(AND(5 <= $M2, $M2 <= 10),IF($L2>=3000,IF($S2<=100,IF($R2<=200,\"MEETS\",\"DOES NOT MEET\"),\"DOES NOT MEET\"),\"DOES NOT MEET\"),\"DOES NOT MEET\"))","v":"MEETS"},{"$f":"IF(LEFT(O2, 1)=\"<\", VALUE(RIGHT(O2,LEN(O2)-1)), O2)","v":186.70400000000001},{"$f":"IF(LEFT(N2, 1)=\"<\", VALUE(RIGHT(N2,LEN(N2)-1)), N2)","v":32}]
["Martin Marietta","Bakers Quarry - Monroe","2019-11-27","Miscellaneous Material for Electrochemical","CA32",{"$f":"VLOOKUP(Table57[[#This Row],[Facility ID]],'Coord.'!$A$1:$E$818,2,FALSE)","v":"N"},{"$f":"VLOOKUP(Table57[[#This Row],[Facility ID]],'Coord.'!$A$1:$E$818,3,FALSE)","v":35.027617999999997},{"$f":"VLOOKUP(Table57[[#This Row],[Facility ID]],'Coord.'!$A$1:$E$818,4,FALSE)","v":"W"},{"$f":"VLOOKUP(Table57[[#This Row],[Facility ID]],'Coord.'!$A$1:$E$818,5,FALSE)","v":-80.603740999999999},993355,"Smith, Michael L",11890,8.8800000000000008,"<30","<55.509","MEETS","MEETS",55.509,30]
["Sloan Construction Co.","Blacksburg Quarry - Blacksburg, SC","2019-08-22","Miscellaneous Material for Electrochemical","CA382",{"$f":"VLOOKUP(Table57[[#This Row],[Facility ID]],'Coord.'!$A$1:$E$818,2,FALSE)","v":"N"},{"$f":"VLOOKUP(Table57[[#This Row],[Facility ID]],'Coord.'!$A$1:$E$818,3,FALSE)","v":35.136633000000003},{"$f":"VLOOKUP(Table57[[#This Row],[Facility ID]],'Coord.'!$A$1:$E$818,4,FALSE)","v":"W"},{"$f":"VLOOKUP(Table57[[#This Row],[Facility ID]],'Coord.'!$A$1:$E$818,5,FALSE)","v":81.528683000000001},979542,"Brinson, Joseph",27180,8.14,"<29","<24.283","MEETS","MEETS",24.283000000000001,29]
["Appalachian Aggregates, LLC","Bluefield Plant","2017-03-22","Miscellaneous Material for Electrochemical","CA307",{"$f":"VLOOKUP(Table57[[#This Row],[Facility ID]],'Coord.'!$A$1:$E$818,2,FALSE)","v":"N"},{"$f":"VLOOKUP(Table57[[#This Row],[Facility ID]],'Coord.'!$A$1:$E$818,3,FALSE)","v":37.236153999999999},{"$f":"VLOOKUP(Table57[[#This Row],[Facility ID]],'Coord.'!$A$1:$E$818,4,FALSE)","v":"W"},{"$f":"VLOOKUP(Table57[[#This Row],[Facility ID]],'Coord.'!$A$1:$E$818,5,FALSE)","v":-81.319535000000002},850415,"Church, Tracy G",5817,8.8000000000000007,8.9,103.9,"MEETS","MEETS",103.9,8.9]
["Vulcan Materials Co.","Boone Quarry - Boone","2018-05-11","Miscellaneous Material for Electrochemical","CA21",{"$f":"VLOOKUP(Table57[[#This Row],[Facility ID]],'Coord.'!$A$1:$E$818,2,FALSE)","v":"N"},{"$f":"VLOOKUP(Table57[[#This Row],[Facility ID]],'Coord.'!$A$1:$E$818,3,FALSE)","v":36.205551},{"$f":"VLOOKUP(Table57[[#This Row],[Facility ID]],'Coord.'!$A$1:$E$818,4,FALSE)","v":"W"},{"$f":"VLOOKUP(Table57[[#This Row],[Facility ID]],'Coord.'!$A$1:$E$818,5,FALSE)","v":-81.718419999999995},911785,"Bumgarner, Dan F",26702,9.1999999999999993,0,"<21.68",{"$f":"IF(ISBLANK(M6),\"N/A\",IF(AND(4.5<=$M6,Table57[[#Headers],[Producer Name]]<=9),IF($L6>=3000,IF($S6<=100,IF($R6<=200,\"MEETS\",\"DOES NOT MEET\"),\"DOES NOT MEET\"),\"DOES NOT MEET\"),\"DOES NOT MEET\"))","v":"DOES NOT MEET"},"MEETS",21.68,0]
["Vulcan Materials Co.","Cabarrus Quarry - Concord","2019-09-24","Miscellaneous Material for Electrochemical","CA186",{"$f":"VLOOKUP(Table57[[#This Row],[Facility ID]],'Coord.'!$A$1:$E$818,2,FALSE)","v":"N"},{"$f":"VLOOKUP(Table57[[#This Row],[Facility ID]],'Coord.'!$A$1:$E$818,3,FALSE)","v":35.404029999999999},{"$f":"VLOOKUP(Table57[[#This Row],[Facility ID]],'Coord.'!$A$1:$E$818,4,FALSE)","v":"W"},{"$f":"VLOOKUP(Table57[[#This Row],[Facility ID]],'Coord.'!$A$1:$E$818,5,FALSE)","v":-80.704829000000004},985125,"Cero, Kevin M",6884,9.08,"<32","<95.874","DOES NOT MEET","MEETS",95.873999999999995,32]
["Salem Stone Corp.","Cardinal Quarries - Smethport Quarry - W. Jefferson","2016-08-02","Miscellaneous Material for Electrochemical","CA123",{"$f":"VLOOKUP(Table57[[#This Row],[Facility ID]],'Coord.'!$A$1:$E$818,2,FALSE)","v":"N"},{"$f":"VLOOKUP(Table57[[#This Row],[Facility ID]],'Coord.'!$A$1:$E$818,3,FALSE)","v":36.439355999999997},{"$f":"VLOOKUP(Table57[[#This Row],[Facility ID]],'Coord.'!$A$1:$E$818,4,FALSE)","v":"W"},{"$f":"VLOOKUP(Table57[[#This Row],[Facility ID]],'Coord.'!$A$1:$E$818,5,FALSE)","v":-81.488720000000001},819964,"Church, Tracy G",3880,8,0,73,"MEETS","MEETS",73,0]
["Salem Stone Corp.","Cardinal Realty - Galax Quarry - Galax, VA","2016-03-07","Miscellaneous Material for Electrochemical","CA11",{"$f":"VLOOKUP(Table57[[#This Row],[Facility ID]],'Coord.'!$A$1:$E$818,2,FALSE)","v":"N"},{"$f":"VLOOKUP(Table57[[#This Row],[Facility ID]],'Coord.'!$A$1:$E$818,3,FALSE)","v":36.574818999999998},{"$f":"VLOOKUP(Table57[[#This Row],[Facility ID]],'Coord.'!$A$1:$E$818,4,FALSE)","v":"W"},{"$f":"VLOOKUP(Table57[[#This Row],[Facility ID]],'Coord.'!$A$1:$E$818,5,FALSE)","v":-80.929176999999996},797296,"Whitley, Christopher D",4916,9.5,0,28,"DOES NOT MEET","MEETS",28,0]
["Martin Marietta","Charlotte Quarry - Charlotte","2016-04-14","Miscellaneous Material for Electrochemical","CA41",{"$f":"VLOOKUP(Table57[[#This Row],[Facility ID]],'Coord.'!$A$1:$E$818,2,FALSE)","v":"N"},{"$f":"VLOOKUP(Table57[[#This Row],[Facility ID]],'Coord.'!$A$1:$E$818,3,FALSE)","v":35.297229000000002},{"$f":"VLOOKUP(Table57[[#This Row],[Facility ID]],'Coord.'!$A$1:$E$818,4,FALSE)","v":"W"},{"$f":"VLOOKUP(Table57[[#This Row],[Facility ID]],'Coord.'!$A$1:$E$818,5,FALSE)","v":-80.863066000000003},802309,"Adair, Mildred (Millie) L",9970,7.7,0,8.6,"MEETS","MEETS",8.6,0]
{"$rows_left_out":180}
{"sheet":"Latest Data Coarse Aggregate","index":1,"n_rows":299,"n_cols":22,"rows_kept":299,"cut":false,"hidden":false,"merged":[]}
["Producer Name","Facility Name","Sample Date","Material Description","Facility ID","Direction","Latitude","Direction2","Longitude","Sample ID","Sampled By","Resistivity [ohm-cm]:","pH Units:","Chloride [ppm]:","Sulfate [ppm]:","Geosynthetic Spec","Steel Spec","Coastal Plain Geosynthetic Spec","Coastal Plain Steel Spec","SO4","Cl"," Coastal Plain Aggregates"]
["Martin Marietta","Statesville Quarry - Statesville","2003-11-20","Stone for Erosion Control (#57)","CA54",{"$f":"VLOOKUP(Table16[[#This Row],[Facility ID]],'Coord.'!$A$1:$E$818,2,FALSE)","v":"N"},{"$f":"VLOOKUP(Table16[[#This Row],[Facility ID]],'Coord.'!$A$1:$E$818,3,FALSE)","v":35.804465999999998},{"$f":"VLOOKUP(Table16[[#This Row],[Facility ID]],'Coord.'!$A$1:$E$818,4,FALSE)","v":"W"},{"$f":"VLOOKUP(Table16[[#This Row],[Facility ID]],'Coord.'!$A$1:$E$818,5,FALSE)","v":-80.913083999999998},320107,"Leatherman, Barbara L",21950,6.3,26,"",{"$f":"IF(AND(4.5 <= $M2, $M2 <= 9), \"MEETS\", \"DOES NOT MEET\")","v":"MEETS"},{"$f":"IF(AND(5 <= $M2, $M2 <= 10), \"MEETS\", \"DOES NOT MEET\")","v":"MEETS"},{"$f":"IF(OR(ISBLANK(L2), NOT(ISNUMBER(MATCH($E2, Coastal,0)))), \"N/A\", IF(AND(4.5 <= $M2, $M2 <= 9),IF($L2>=5000,IF($U2<=100,IF($T2<=200,\"MEETS\",\"DOES NOT MEET\"),\"DOES NOT MEET\"),\"DOES NOT MEET\"),\"DOES NOT MEET\"))","v":"N/A"},{"$f":"IF(OR(ISBLANK(M2), NOT(ISNUMBER(MATCH($E2, Coastal, 0)))), \"N/A\", IF(AND(5 <= $M2, $M2 <= 10),IF($L2>=5000,IF($U2<=100,IF($T2<=200,\"MEETS\",\"DOES NOT MEET\"),\"DOES NOT MEET\"),\"DOES NOT MEET\"),\"DOES NOT MEET\"))","v":"N/A"},{"$f":"IF(LEFT(O2, 1)=\"<\", VALUE(RIGHT(O2,LEN(O2)-1)), O2)","v":""},{"$f":"IF(LEFT(N2, 1)=\"<\", VALUE(RIGHT(N2,LEN(N2)-1)), N2)","v":26},"CA345"]
["Radford Quarries Of Boone, Inc.","Bamboo Quarry","2019-04-26","Select Material, Class VI","CA122",{"$f":"VLOOKUP(Table16[[#This Row],[Facility ID]],'Coord.'!$A$1:$E$818,2,FALSE)","v":"N"},{"$f":"VLOOKUP(Table16[[#This Row],[Facility ID]],'Coord.'!$A$1:$E$818,3,FALSE)","v":36.215747},{"$f":"VLOOKUP(Table16[[#This Row],[Facility ID]],'Coord.'!$A$1:$E$818,4,FALSE)","v":"W"},{"$f":"VLOOKUP(Table16[[#This Row],[Facility ID]],'Coord.'!$A$1:$E$818,5,FALSE)","v":-81.636511999999996},960975,"Winkler, Jeffrey D",21960,9.6,"<30","<30.055","DOES NOT MEET","MEETS","N/A","N/A",30.055,30,"CA224"]
["Salem Stone Corp.","Cardinal Quarries - Smethport Quarry - W. Jefferson","2019-06-25","Select Material, Class VI","CA123",{"$f":"VLOOKUP(Table16[[#This Row],[Facility ID]],'Coord.'!$A$1:$E$818,2,FALSE)","v":"N"},{"$f":"VLOOKUP(Table16[[#This Row],[Facility ID]],'Coord.'!$A$1:$E$818,3,FALSE)","v":36.439355999999997},{"$f":"VLOOKUP(Table16[[#This Row],[Facility ID]],'Coord.'!$A$1:$E$818,4,FALSE)","v":"W"},{"$f":"VLOOKUP(Table16[[#This Row],[Facility ID]],'Coord.'!$A$1:$E$818,5,FALSE)","v":-81.488720000000001},970103,"Murray, Brandi S",13030,9.11,"<29","<50.652","DOES NOT MEET","MEETS","N/A","N/A",50.652000000000001,29,"CA137"]
["Rogers Group, Inc.","Mitchell County Stone","2015-07-22","Select Material, Class VI","CA315",{"$f":"VLOOKUP(Table16[[#This Row],[Facility ID]],'Coord.'!$A$1:$E$818,2,FALSE)","v":"N"},{"$f":"VLOOKUP(Table16[[#This Row],[Facility ID]],'Coord.'!$A$1:$E$818,3,FALSE)","v":35.899016000000003},{"$f":"VLOOKUP(Table16[[#This Row],[Facility ID]],'Coord.'!$A$1:$E$818,4,FALSE)","v":"W"},{"$f":"VLOOKUP(Table16[[#This Row],[Facility ID]],'Coord.'!$A$1:$E$818,5,FALSE)","v":-82.100712000000001},767763,"Radcliff, Roger Keith",50865,7.2,0,0,"MEETS","MEETS","N/A","N/A",0,0,"CA337"]
["Vulcan Materials Co.","Spruce Pine Quarry - Bakersville","2015-07-22","Select Material, Class VI","CA111",{"$f":"VLOOKUP(Table16[[#This Row],[Facility ID]],'Coord.'!$A$1:$E$818,2,FALSE)","v":"N"},{"$f":"VLOOKUP(Table16[[#This Row],[Facility ID]],'Coord.'!$A$1:$E$818,3,FALSE)","v":35.583199999999998},{"$f":"VLOOKUP(Table16[[#This Row],[Facility ID]],'Coord.'!$A$1:$E$818,4,FALSE)","v":"W"},{"$f":"VLOOKUP(Table16[[#This Row],[Facility ID]],'Coord.'!$A$1:$E$818,5,FALSE)","v":-82.054100000000005},767762,"Radcliff, Roger Keith",25374,8.1999999999999993,0,0,"MEETS","MEETS","N/A","N/A",0,0,"CA216"]
["Maymead Materials, Inc.","Turnip Patch Quarry - Mountain City, TN","2019-06-25","Select Material, Class VI","CA153",{"$f":"VLOOKUP(Table16[[#This Row],[Facility ID]],'Coord.'!$A$1:$E$818,2,FALSE)","v":"N"},{"$f":"VLOOKUP(Table16[[#This Row],[Facility ID]],'Coord.'!$A$1:$E$818,3,FALSE)","v":36.426709000000002},{"$f":"VLOOKUP(Table16[[#This Row],[Facility ID]],'Coord.'!$A$1:$E$818,4,FALSE)","v":"W"},{"$f":"VLOOKUP(Table16[[#This Row],[Facility ID]],'Coord.'!$A$1:$E$818,5,FALSE)","v":-81.773808000000002},970106,"Murray, Brandi S",22950,9.4600000000000009,"<29","<28.758","DOES NOT MEET","MEETS","N/A","N/A",28.757999999999999,29,"CA55"]
["Wake Stone Corp.","Knightdale Quarry - Knightdale","2012-06-13","Select Material, Class II, Type 1","CA98",{"$f":"VLOOKUP(Table16[[#This Row],[Facility ID]],'Coord.'!$A$1:$E$818,2,FALSE)","v":"N"},{"$f":"VLOOKUP(Table16[[#This Row],[Facility ID]],'Coord.'!$A$1:$E$818,3,FALSE)","v":35.797772999999999},{"$f":"VLOOKUP(Table16[[#This Row],[Facility ID]],'Coord.'!$A$1:$E$818,4,FALSE)","v":"W"},{"$f":"VLOOKUP(Table16[[#This Row],[Facility ID]],'Coord.'!$A$1:$E$818,5,FALSE)","v":-78.502251000000001},630833,"Carter, PE, Sean C",9800,8.8000000000000007,"","","MEETS","MEETS","N/A","N/A","","","CA371"]
["Vulcan Materials Co.","Havre De Grace Quarry - Havre De Grace, MD","2020-09-21","Miscellaneous Material for Electrochemical","CA345",{"$f":"VLOOKUP(Table16[[#This Row],[Facility ID]],'Coord.'!$A$1:$E$818,2,FALSE)","v":"N"},{"$f":"VLOOKUP(Table16[[#This Row],[Facility ID]],'Coord.'!$A$1:$E$818,3,FALSE)","v":35.584989999999998},{"$f":"VLOOKUP(Table16[[#This Row],[Facility ID]],'Coord.'!$A$1:$E$818,4,FALSE)","v":"W"},{"$f":"VLOOKUP(Table16[[#This Row],[Facility ID]],'Coord.'!$A$1:$E$818,5,FALSE)","v":-76.103046000000006},1021092,"Bonds, Maria M",21050,8.7799999999999994,"<30","<31.354","MEETS","MEETS",{"$f":"IF(ISBLANK(L9), \"N/A\", IF(AND(4.5 <= $M9, $M9 <= 9),IF($L9>=5000,IF($U9<=100,IF($T9<=200,\"MEETS\",\"DOES NOT MEET\"),\"DOES NOT MEET\"),\"DOES NOT MEET\"),\"DOES NOT MEET\"))","v":"MEETS"},{"$f":"IF(ISBLANK(M9), \"N/A\", IF(AND(5 <= $M9, $M9 <= 10),IF($L9>=5000,IF($U9<=100,IF($T9<=200,\"MEETS\",\"DOES NOT MEET\"),\"DOES NOT MEET\"),\"DOES NOT MEET\"),\"DOES NOT MEET\"))","v":"MEETS"},31.353999999999999,30,"CA288"]
["Hanson Aggregates Southeast, Inc.","Princeton Quarry","2013-06-12","Miscellaneous Material for Electrochemical","CA64",{"$f":"VLOOKUP(Table16[[#This Row],[Facility ID]],'Coord.'!$A$1:$E$818,2,FALSE)","v":"N"},{"$f":"VLOOKUP(Table16[[#This Row],[Facility ID]],'Coord.'!$A$1:$E$818,3,FALSE)","v":35.472107000000001},{"$f":"VLOOKUP(Table16[[#This Row],[Facility ID]],'Coord.'!$A$1:$E$818,4,FALSE)","v":"W"},{"$f":"VLOOKUP(Table16[[#This Row],[Facility ID]],'Coord.'!$A$1:$E$818,5,FALSE)","v":-78.137972000000005},669957,"Gardner, Joseph Tyler",23809,7.8,0,0,"MEETS","MEETS",{"$f":"IF(OR(ISBLANK(L10), NOT(ISNUMBER(MATCH($E10, Coastal,0)))), \"N/A\", IF(AND(4.5 <= $M10, $M10 <= 9),IF($L10>=5000,IF($U10<=100,IF($T10<=200,\"MEETS\",\"DOES NOT MEET\"),\"DOES NOT MEET\"),\"DOES NOT MEET\"),\"DOES NOT MEET\"))","v":"MEETS"},{"$f":"IF(OR(ISBLANK(M10), NOT(ISNUMBER(MATCH($E10, Coastal, 0)))), \"N/A\", IF(AND(5 <= $M10, $M10 <= 10),IF($L10>=5000,IF($U10<=100,IF($T10<=200,\"MEETS\",\"DOES NOT MEET\"),\"DOES NOT MEET\"),\"DOES NOT MEET\"),\"DOES NOT MEET\"))","v":"MEETS"},0,0,"CA42"]
{"$rows_left_out":290}
{"sheet":"Historical Data CoarseAggregate","index":2,"n_rows":945,"n_cols":20,"rows_kept":945,"cut":false,"hidden":false,"merged":[]}
["Producer Name","Facility Name","Sample Date","Material Description","Facility ID","Sample ID","Sampled By","Resistivity [ohm-cm]:","pH Units:","Chloride [ppm]:","Sulfate [ppm]:","Geosynthetic Spec","Steel Spec","Coastal Plain Geosynthetic Spec","Coastal Plain Steel Spec","SO4","Cl",null,null," Coastal Plain Aggregates"]
["Wake Stone Corp.","Moncure Quarry - Moncure","2020-10-14","#57 Stone for Electrochemical","CA100",1023283,"Braly, James R",18550,9.49,"<30","<35.58",{"$f":"IF(AND(4.5 <= $I2, $I2 <= 9), \"MEETS\", \"DOES NOT MEET\")","v":"DOES NOT MEET"},{"$f":"IF(AND(5 <= $I2, $I2 <= 10), \"MEETS\", \"DOES NOT MEET\")","v":"MEETS"},{"$f":"IF(OR(ISBLANK(H2), NOT(ISNUMBER(MATCH($E2, Coastal,0)))), \"N/A\", IF(AND(4.5 <= $I2, $I2 <= 9),IF($H2>=5000,IF($Q2<=100,IF($P2<=200,\"MEETS\",\"DOES NOT MEET\"),\"DOES NOT MEET\"),\"DOES NOT MEET\"),\"DOES NOT MEET\"))","v":"N/A"},{"$f":"IF(OR(ISBLANK(I2), NOT(ISNUMBER(MATCH($E2, Coastal, 0)))), \"N/A\", IF(AND(5 <= $I2, $I2 <= 10),IF($H2>=5000,IF($Q2<=100,IF($P2<=200,\"MEETS\",\"DOES NOT MEET\"),\"DOES NOT MEET\"),\"DOES NOT MEET\"),\"DOES NOT MEET\"))","v":"N/A"},{"$f":"IF(LEFT(K2, 1)=\"<\", VALUE(RIGHT(K2,LEN(K2)-1)), K2)","v":35.58},{"$f":"IF(LEFT(J2, 1)=\"<\", VALUE(RIGHT(J2,LEN(J2)-1)), J2)","v":30},null,null,"CA345"]
["Wake Stone Corp.","Moncure Quarry - Moncure","2020-10-14","#78-M Stone for Electrochemical","CA100",1023300,"Braly, James R",14920,9.1999999999999993,"<30","<44.236","DOES NOT MEET","MEETS","N/A","N/A",44.235999999999997,30,null,null,"CA224"]
["Martin Marietta","Fountain Quarry - Fountain","2020-09-25","#57 Stone for Electrochemical","CA42",1021240,"Cobb, James R",22540,9.2200000000000006,"<30","<29.281","DOES NOT MEET","MEETS","DOES NOT MEET","MEETS",29.280999999999999,30,null,null,"CA137"]
["Martin Marietta","Fountain Quarry - Fountain","2020-09-25","#78-M Stone for Electrochemical","CA42",1021241,"Cobb, James R",14210,9.44,"<30","<46.446","DOES NOT MEET","MEETS","DOES NOT MEET","MEETS",46.445999999999998,30,null,null,"CA337"]
["Vulcan Materials Co.","Jack Quarry - Petersburg, VA","2020-09-21","#78-M Stone for Electrochemical","CA137",1021105,"Bonds, Maria M",10330,9.51,"<30","<63.892","DOES NOT MEET","MEETS","DOES NOT MEET","MEETS",63.892000000000003,30,null,null,"CA411"]
["Vulcan Materials Co.","Jack Quarry - Petersburg, VA","2020-09-21","#67 Stone for Electrochemical","CA137",1021106,"Bonds, Maria M",19570,9.52,"<30","<33.725","DOES NOT MEET","MEETS","DOES NOT MEET","MEETS",33.725000000000001,30,null,null,"CA216"]
["Vulcan Materials Co.","Havre De Grace Quarry - Havre De Grace, MD","2020-09-21","Miscellaneous Material for Electrochemical","CA345",1021092,"Bonds, Maria M",21050,8.7799999999999994,"<30","<31.354","MEETS","MEETS","MEETS","MEETS",31.353999999999999,30,null,null,"CA55"]
["Vulcan Materials Co.","Havre De Grace Quarry - Havre De Grace, MD","2020-09-21","#67 Stone for Electrochemical","CA345",1021094,"Bonds, Maria M",13710,9.31,"<30","<48.140","DOES NOT MEET","MEETS","DOES NOT MEET","MEETS",48.14,30,null,null,"CA223"]
["Vulcan Materials Co.","Puddledock Quarry - Prince George, VA","2020-09-21","#78-M Stone for Electrochemical","CA224",1021102,"Bonds, Maria M",38360,4.87,"<30","<17.205","MEETS","DOES NOT MEET","MEETS","DOES NOT MEET",17.204999999999998,30,null,null,"CA371"]
{"$rows_left_out":936}
{"sheet":"Historical Data FineAggregate","index":3,"n_rows":335,"n_cols":15,"rows_kept":335,"cut":false,"hidden":false,"merged":[]}
["Producer Name","Facility Name","Sample Date","Material Description","Facility ID","Sample ID","Sampled By","Resistivity [ohm-cm]:","pH Units:","Chloride [ppm]:","Sulfate [ppm]:","Geosynthetic Spec","Steel Spec","SO4","Cl"]
["Martin Marietta","Edmund Pit - Lexington, SC","2000-07-14","Yearly Quality Check for Fine Aggregate (Strength, Soundness, etc.)","FA265",143321,"Keyes, Terry L",null,null,35.4,null,{"$f":"IF(ISBLANK(I2),\"N/A\",IF(AND(4.5<=$I2,$I2<=9),IF($H2>=3000,IF($O2<=100,IF($N2<=200,\"MEETS\",\"DOES NOT MEET\"),\"DOES NOT MEET\"),\"DOES NOT MEET\"),\"DOES NOT MEET\"))","v":"N/A"},{"$f":"IF(ISBLANK(I2), \"N/A\", IF(AND(5 <= $I2, $I2 <= 10),IF($H2>=3000,IF($O2<=100,IF($N2<=200,\"MEETS\",\"DOES NOT MEET\"),\"DOES NOT MEET\"),\"DOES NOT MEET\"),\"DOES NOT MEET\"))","v":"N/A"},{"$f":"IF(LEFT(K2, 1)=\"<\", VALUE(RIGHT(K2,LEN(K2)-1)), K2)","v":0},{"$f":"IF(LEFT(J2, 1)=\"<\", VALUE(RIGHT(J2,LEN(J2)-1)), J2)","v":35.4}]
["Martin Marietta","Woodleaf Quarry - Salisbury","2000-07-26","Sand, 2MS - Chemistry Check","FA100",145927,"Wrenn, Kevin O",null,null,null,null,"N/A","N/A",0,0]
["Cardinal Stone Company","Carolina Sand Pee Dee Pit","2001-01-31","Sand, 2MS - Chemistry Check","FA22152",175117,"Allen, Daniel W",null,null,7,null,"N/A","N/A",0,7]
["Cardinal Stone Company","Carolina Sand Pee Dee Pit","2001-01-31","Sand, 2MS - Chemistry Check","FA22152",175118,"Allen, Daniel W",null,null,7,null,"N/A","N/A",0,7]
["Hanson Aggregates Southeast, Inc.","Marlboro S&G - Bennettsville","2001-03-08","Sand, 2S - Chemistry Check","FA10",179786,"Chavis, Raymond S",null,null,null,null,"N/A","N/A",0,0]
["Hanson Aggregates Southeast, Inc.","Hasskamp Pit - Horatio, SC","2001-03-20","Sand, 2S","FA117",182599,"Chavis, Raymond S",null,null,null,null,"N/A","N/A",0,0]
["GS Materials, Inc.","Hall Pit - Lemon Springs","2001-04-24","Sand, 2S - Chemistry Check","FA122",187477,"Chavis, Raymond S",null,null,null,null,"N/A","N/A",0,0]
["APAC-Atlantic - Thompson-Arthur","Candor Pit","2001-05-07","Sand, 2S - Chemistry Check","FA60",189728,"Chavis, Raymond S",null,null,null,null,"N/A","N/A",0,0]
["Hedrick Industries","Norman Sand Pit (D&J) - Candor, NC","2001-05-07","Sand, 2S - Chemistry Check","FA111",189730,"Chavis, Raymond S",null,null,null,null,"N/A","N/A",0,0]
{"$rows_left_out":326}
{"sheet":"Coord.","index":4,"n_rows":818,"n_cols":5,"rows_kept":818,"cut":false,"hidden":false,"merged":[]}
["Plant ID","Facility Type Latitude Dir","Facility Type Latitude","Facility Type Longitude Dir","Facility Type Longitude"]
["CA1","N",35.440697,"W",-83.007457000000002]
["CA100","N",35.616160000000001,"W",-79.103876]
["CA101","N",35.115856000000001,"W",-80.896596000000002]
["CA10129"]
["CA10133"]
["CA102","N",35.853850000000001,"W",-80.160167999999999]
["CA1022"]
["CA104","N",36.586725000000001,"W",-82.277083000000005]
["CA1041"]
{"$rows_left_out":809}
{"sheet":"CHEMSTONE","index":5,"n_rows":3003,"n_cols":10,"rows_kept":3003,"cut":false,"hidden":true,"merged":[]}
["Producer Name","Location","Sample Date","Sample ID","Material Description","Sampled By","Resistivity [ohm-cm]:","pH","Chloride [ppm]:","Sulfate [ppm]:"]
["Aggregates USA","Abingdon Quarry","2016-09-28",828584,"#57 Stone for Electrochemical","Church, Tracy G",8741,7.7,0,14.2]
["Aggregates USA","Elizabethton Quarry","2016-09-28",828607,"#57 Stone for Electrochemical","Church, Tracy G",15265,7.3,0,9.6999999999999993]
["Aggregates USA","Watauga Quarry","2016-09-28",828603,"#57 Stone for Electrochemical","Church, Tracy G",16139,6.7,0,6.1]
["Ararat Rock Products","Eden Quarry - Cascade, VA","2016-02-09",793258,"#78-M Stone for Electrochemical","Westmoreland, Braxton J",11488,8.6,0,9.6]
["Ararat Rock Products","Eden Quarry - Cascade, VA","2016-02-09",793259,"#57 Stone for Electrochemical","Westmoreland, Braxton J",14265,8.8000000000000007,0,10.199999999999999]
["Ararat Rock Products","Mt. Airy Quarry - Mt. Airy","2016-01-11",790443,"#57 Stone for Electrochemical","Whitley, Christopher D",14205,8.6,10,0]
["Ararat Rock Products","Mt. Airy Quarry - Mt. Airy","2016-01-11",790444,"Miscellaneous Material for Electrochemical","Whitley, Christopher D",1655,7.7,10,0]
["Ararat Rock Products","Mt. Airy Quarry - Mt. Airy","2016-03-01",795846,"#78-M Stone for Electrochemical","Whitley, Christopher D",15858,7.9,0,10.1]
["Ararat Rock Products","Mt. Airy Quarry - Mt. Airy","2017-01-31",843861,"#78-M Stone for Electrochemical","Whitley, Christopher D",11582,8.3000000000000007,0,50.8]
{"$rows_left_out":2994}
{"sheet":"CHEMSAND","index":6,"n_rows":68,"n_cols":10,"rows_kept":68,"cut":false,"hidden":true,"merged":[]}
["Producer Name","Location","Sample Date","Sample ID","Material Description","Sampled By","Resistivity [ohm-cm]:","pH","Chloride [ppm]:","Sulfate [ppm]:"]
["American Materials Co., LLC","Bailey Mine","2015-05-04",756586,"Sand, 2S - Chemistry Check","Russell, Jonathan T",79491,6.8,0,0]
["American Materials Co., LLC","Bailey Mine","2015-05-05",756587,"Sand, 2S - Chemistry Check","Russell, Jonathan T",81967,5.0999999999999996,0,0]
["American Materials Co., LLC","Bailey Mine","2015-06-17",763246,"Sand, 2S - Chemistry Check","Russell, Jonathan T",49432,6,0,0]
["American Materials Co., LLC","Bailey Mine","2015-07-16",766765,"Sand, 2S - Chemistry Check","Russell, Jonathan T",52521,5.8,0,200]
["American Materials Co., LLC","Bailey Mine","2015-08-24",773443,"Sand, 2S - Chemistry Check","Russell, Jonathan T",69013,6.2,0,0]
["American Materials Co., LLC","Bailey Mine","2015-08-26",773446,"Sand, 2S - Chemistry Check","Russell, Jonathan T",60132,5.7,0,0]
["American Materials Co., LLC","Bailey Mine","2015-08-27",773447,"Sand, 2S - Chemistry Check","Russell, Jonathan T",60350,5.4,0,0]
["American Materials Co., LLC","Dupree Mine","2016-03-29",799594,"Sand, 2S - Chemistry Check","Cobb, James R",21245,4.8,0,16.3]
["American Materials Co., LLC","Wade Pit","2016-05-10",805958,"Sand, 2S - Chemistry Check","Murphy, Billy J",91075,5.8,0,7.3]
{"$rows_left_out":58}