{"text_format":"1","workbook":"xlsx","n_sheets":7,"sheets":["Latest Data Fine Aggregate","Latest Data Coarse Aggregate","Historical Data CoarseAggregate","Historical Data FineAggregate","Coord.","CHEMSTONE","CHEMSAND"],"not_rendered":{"charts":0,"images":0,"macros":1,"external_links":0,"defined_names":2,"comments":0,"pivot_tables":0},"unopened":[],"bounds":{"document_bytes":16777216,"sheet_cells":100000,"rows_first":2000,"rows_last":500,"rows_between":2000,"halvings":0,"cell_chars":16384,"cell_head_chars":4096},"cells_cut":0,"cells_raw":0,"read":"whole","date_system":"1900"}

{"sheet":"Latest Data Fine Aggregate","index":0,"n_rows":189,"n_cols":19,"rows_kept":189,"cut":false,"hidden":false,"merged":[]}
["Producer Name","Facility Name","Sample Date","Material Description","Facility ID","Direction","Latitude","Direction2","Longitude","Sample ID","Sampled By","Resistivity [ohm-cm]:","pH Units:","Chloride [ppm]:","Sulfate [ppm]:","Geosynthetic Spec","Steel Spec","SO4","Cl"]
["Martin Marietta","Arrowood Quarry - Charlotte","2019-09-18","Miscellaneous Material for Electrochemical","CA31",{"$f":"VLOOKUP(Table57[[#This Row],[Facility ID]],'Coord.'!$A$1:$E$818,2,FALSE)","v":"N"},{"$f":"VLOOKUP(Table57[[#This Row],[Facility ID]],'Coord.'!$A$1:$E$818,3,FALSE)","v":35.111865000000002},{"$f":"VLOOKUP(Table57[[#This Row],[Facility ID]],'Coord.'!$A$1:$E$818,4,FALSE)","v":"W"},{"$f":"VLOOKUP(Table57[[#This Row],[Facility ID]],'Coord.'!$A$1:$E$818,5,FALSE)","v":-80.921875},983528,"Smith, Michael L",3535,7.92,"<32","<186.704",{"$f":"IF(ISBLANK(M2),\"N/A\",IF(AND(4.5<=$M2,$M2<=9),IF($L2>=3000,IF($S2<=100,IF($R2<=200,\"MEETS\",\"DOES NOT MEET\"),\"DOES NOT MEET\"),\"DOES NOT MEET\"),\"DOES NOT MEET\"))","v":"MEETS"},{"$f":"IF(ISBLANK(M2), \"N/A\", IF(AND(5 <= $M2, $M2 <= 10),IF($L2>=3000,IF($S2<=100,IF($R2<=200,\"MEETS\",\"DOES NOT MEET\"),\"DOES NOT MEET\"),\"DOES NOT MEET\"),\"DOES NOT MEET\"))","v":"MEETS"},{"$f":"IF(LEFT(O2, 1)=\"<\", VALUE(RIGHT(O2,LEN(O2)-1)), O2)","v":186.70400000000001},{"$f":"IF(LEFT(N2, 1)=\"<\", VALUE(RIGHT(N2,LEN(N2)-1)), N2)","v":32}]
["Martin Marietta","Bakers Quarry - Monroe","2019-11-27","Miscellaneous Material for Electrochemical","CA32",{"$f":"VLOOKUP(Table57[[#This Row],[Facility ID]],'Coord.'!$A$1:$E$818,2,FALSE)","v":"N"},{"$f":"VLOOKUP(Table57[[#This Row],[Facility ID]],'Coord.'!$A$1:$E$818,3,FALSE)","v":35.027617999999997},{"$f":"VLOOKUP(Table57[[#This Row],[Facility ID]],'Coord.'!$A$1:$E$818,4,FALSE)","v":"W"},{"$f":"VLOOKUP(Table57[[#This Row],[Facility ID]],'Coord.'!$A$1:$E$818,5,FALSE)","v":-80.603740999999999},993355,"Smith, Michael L",11890,8.8800000000000008,"<30","<55.509","MEETS","MEETS",55.509,30]
["Sloan Construction Co.","Blacksburg Quarry - Blacksburg, SC","2019-08-22","Miscellaneous Material for Electrochemical","CA382",{"$f":"VLOOKUP(Table57[[#This Row],[Facility ID]],'Coord.'!$A$1:$E$818,2,FALSE)","v":"N"},{"$f":"VLOOKUP(Table57[[#This Row],[Facility ID]],'Coord.'!$A$1:$E$818,3,FALSE)","v":35.136633000000003},{"$f":"VLOOKUP(Table57[[#This Row],[Facility ID]],'Coord.'!$A$1:$E$818,4,FALSE)","v":"W"},{"$f":"VLOOKUP(Table57[[#This Row],[Facility ID]],'Coord.'!$A$1:$E$818,5,FALSE)","v":81.528683000000001},979542,"Brinson, Joseph",27180,8.14,"<29","<24.283","MEETS","MEETS",24.283000000000001,29]
["Appalachian Aggregates, LLC","Bluefield Plant","2017-03-22","Miscellaneous Material for Electrochemical","CA307",{"$f":"VLOOKUP(Table57[[#This Row],[Facility ID]],'Coord.'!$A$1:$E$818,2,FALSE)","v":"N"},{"$f":"VLOOKUP(Table57[[#This Row],[Facility ID]],'Coord.'!$A$1:$E$818,3,FALSE)","v":37.236153999999999},{"$f":"VLOOKUP(Table57[[#This Row],[Facility ID]],'Coord.'!$A$1:$E$818,4,FALSE)","v":"W"},{"$f":"VLOOKUP(Table57[[#This Row],[Facility ID]],'Coord.'!$A$1:$E$818,5,FALSE)","v":-81.319535000000002},850415,"Church, Tracy G",5817,8.8000000000000007,8.9,103.9,"MEETS","MEETS",103.9,8.9]
["Vulcan Materials Co.","Boone Quarry - Boone","2018-05-11","Miscellaneous Material for Electrochemical","CA21",{"$f":"VLOOKUP(Table57[[#This Row],[Facility ID]],'Coord.'!$A$1:$E$818,2,FALSE)","v":"N"},{"$f":"VLOOKUP(Table57[[#This Row],[Facility ID]],'Coord.'!$A$1:$E$818,3,FALSE)","v":36.205551},{"$f":"VLOOKUP(Table57[[#This Row],[Facility ID]],'Coord.'!$A$1:$E$818,4,FALSE)","v":"W"},{"$f":"VLOOKUP(Table57[[#This Row],[Facility ID]],'Coord.'!$A$1:$E$818,5,FALSE)","v":-81.718419999999995},911785,"Bumgarner, Dan F",26702,9.1999999999999993,0,"<21.68",{"$f":"IF(ISBLANK(M6),\"N/A\",IF(AND(4.5<=$M6,Table57[[#Headers],[Producer Name]]<=9),IF($L6>=3000,IF($S6<=100,IF($R6<=200,\"MEETS\",\"DOES NOT MEET\"),\"DOES NOT MEET\"),\"DOES NOT MEET\"),\"DOES NOT MEET\"))","v":"DOES NOT MEET"},"MEETS",21.68,0]
["Vulcan Materials Co.","Cabarrus Quarry - Concord","2019-09-24","Miscellaneous Material for Electrochemical","CA186",{"$f":"VLOOKUP(Table57[[#This Row],[Facility ID]],'Coord.'!$A$1:$E$818,2,FALSE)","v":"N"},{"$f":"VLOOKUP(Table57[[#This Row],[Facility ID]],'Coord.'!$A$1:$E$818,3,FALSE)","v":35.404029999999999},{"$f":"VLOOKUP(Table57[[#This Row],[Facility ID]],'Coord.'!$A$1:$E$818,4,FALSE)","v":"W"},{"$f":"VLOOKUP(Table57[[#This Row],[Facility ID]],'Coord.'!$A$1:$E$818,5,FALSE)","v":-80.704829000000004},985125,"Cero, Kevin M",6884,9.08,"<32","<95.874","DOES NOT MEET","MEETS",95.873999999999995,32]
["Salem Stone Corp.","Cardinal Quarries - Smethport Quarry - W. Jefferson","2016-08-02","Miscellaneous Material for Electrochemical","CA123",{"$f":"VLOOKUP(Table57[[#This Row],[Facility ID]],'Coord.'!$A$1:$E$818,2,FALSE)","v":"N"},{"$f":"VLOOKUP(Table57[[#This Row],[Facility ID]],'Coord.'!$A$1:$E$818,3,FALSE)","v":36.439355999999997},{"$f":"VLOOKUP(Table57[[#This Row],[Facility ID]],'Coord.'!$A$1:$E$818,4,FALSE)","v":"W"},{"$f":"VLOOKUP(Table57[[#This Row],[Facility ID]],'Coord.'!$A$1:$E$818,5,FALSE)","v":-81.488720000000001},819964,"Church, Tracy G",3880,8,0,73,"MEETS","MEETS",73,0]
["Salem Stone Corp.","Cardinal Realty - Galax Quarry - Galax, VA","2016-03-07","Miscellaneous Material for Electrochemical","CA11",{"$f":"VLOOKUP(Table57[[#This Row],[Facility ID]],'Coord.'!$A$1:$E$818,2,FALSE)","v":"N"},{"$f":"VLOOKUP(Table57[[#This Row],[Facility ID]],'Coord.'!$A$1:$E$818,3,FALSE)","v":36.574818999999998},{"$f":"VLOOKUP(Table57[[#This Row],[Facility ID]],'Coord.'!$A$1:$E$818,4,FALSE)","v":"W"},{"$f":"VLOOKUP(Table57[[#This Row],[Facility ID]],'Coord.'!$A$1:$E$818,5,FALSE)","v":-80.929176999999996},797296,"Whitley, Christopher D",4916,9.5,0,28,"DOES NOT MEET","MEETS",28,0]
["Martin Marietta","Charlotte Quarry - Charlotte","2016-04-14","Miscellaneous Material for Electrochemical","CA41",{"$f":"VLOOKUP(Table57[[#This Row],[Facility ID]],'Coord.'!$A$1:$E$818,2,FALSE)","v":"N"},{"$f":"VLOOKUP(Table57[[#This Row],[Facility ID]],'Coord.'!$A$1:$E$818,3,FALSE)","v":35.297229000000002},{"$f":"VLOOKUP(Table57[[#This Row],[Facility ID]],'Coord.'!$A$1:$E$818,4,FALSE)","v":"W"},{"$f":"VLOOKUP(Table57[[#This Row],[Facility ID]],'Coord.'!$A$1:$E$818,5,FALSE)","v":-80.863066000000003},802309,"Adair, Mildred (Millie) L",9970,7.7,0,8.6,"MEETS","MEETS",8.6,0]
["Martin Marietta","Clarks Quarry - New Bern","2016-08-03","Miscellaneous Material for Electrochemical","CA189",{"$f":"VLOOKUP(Table57[[#This Row],[Facility ID]],'Coord.'!$A$1:$E$818,2,FALSE)","v":"N"},{"$f":"VLOOKUP(Table57[[#This Row],[Facility ID]],'Coord.'!$A$1:$E$818,3,FALSE)","v":35.150663999999999},{"$f":"VLOOKUP(Table57[[#This Row],[Facility ID]],'Coord.'!$A$1:$E$818,4,FALSE)","v":"W"},{"$f":"VLOOKUP(Table57[[#This Row],[Facility ID]],'Coord.'!$A$1:$E$818,5,FALSE)","v":-77.151770999999997},819245,"Maynard, William BJ T",8163,8.4,0,31.8,"MEETS","MEETS",31.8,0]
["Vulcan Materials Co.","Clear Creek Q. - Charlotte","2020-02-04","Miscellaneous Material for Electrochemical","CA249",{"$f":"VLOOKUP(Table57[[#This Row],[Facility ID]],'Coord.'!$A$1:$E$818,2,FALSE)","v":"N"},{"$f":"VLOOKUP(Table57[[#This Row],[Facility ID]],'Coord.'!$A$1:$E$818,3,FALSE)","v":35.220500000000001},{"$f":"VLOOKUP(Table57[[#This Row],[Facility ID]],'Coord.'!$A$1:$E$818,4,FALSE)","v":"W"},{"$f":"VLOOKUP(Table57[[#This Row],[Facility ID]],'Coord.'!$A$1:$E$818,5,FALSE)","v":-80.647542000000001},998654,"Pegues, Jr., Henderson",5334,8.91,"<30","<123.735","MEETS","MEETS",123.735,30]
["Vulcan Materials Co.","Havre De Grace Quarry - Havre De Grace, MD","2019-08-26","Miscellaneous Material for Electrochemical","CA345",{"$f":"VLOOKUP(Table57[[#This Row],[Facility ID]],'Coord.'!$A$1:$E$818,2,FALSE)","v":"N"},{"$f":"VLOOKUP(Table57[[#This Row],[Facility ID]],'Coord.'!$A$1:$E$818,3,FALSE)","v":35.584989999999998},{"$f":"VLOOKUP(Table57[[#This Row],[Facility ID]],'Coord.'!$A$1:$E$818,4,FALSE)","v":"W"},{"$f":"VLOOKUP(Table57[[#This Row],[Facility ID]],'Coord.'!$A$1:$E$818,5,FALSE)","v":-76.103046000000006},980139,"Bonds, Maria M",17270,9.18,"<29","<38.217","DOES NOT MEET","MEETS",38.216999999999999,29]
["Hanson Aggregates Southeast, Inc.","Jefferson Quarry - Jefferson, SC","2016-12-14","Miscellaneous Material for Electrochemical","CA120",{"$f":"VLOOKUP(Table57[[#This Row],[Facility ID]],'Coord.'!$A$1:$E$818,2,FALSE)","v":"N"},{"$f":"VLOOKUP(Table57[[#This Row],[Facility ID]],'Coord.'!$A$1:$E$818,3,FALSE)","v":34.699689999999997},{"$f":"VLOOKUP(Table57[[#This Row],[Facility ID]],'Coord.'!$A$1:$E$818,4,FALSE)","v":"W"},{"$f":"VLOOKUP(Table57[[#This Row],[Facility ID]],'Coord.'!$A$1:$E$818,5,FALSE)","v":-80.332674999999995},838779,"Jordan, Daniel H",14691,8.1,0,0,"MEETS","MEETS",0,0]
["Vulcan Materials Co.","Lenior Quarry - Lenoir","2016-06-24","Miscellaneous Material for Electrochemical","CA91",{"$f":"VLOOKUP(Table57[[#This Row],[Facility ID]],'Coord.'!$A$1:$E$818,2,FALSE)","v":"N"},{"$f":"VLOOKUP(Table57[[#This Row],[Facility ID]],'Coord.'!$A$1:$E$818,3,FALSE)","v":35.935250000000003},{"$f":"VLOOKUP(Table57[[#This Row],[Facility ID]],'Coord.'!$A$1:$E$818,4,FALSE)","v":"W"},{"$f":"VLOOKUP(Table57[[#This Row],[Facility ID]],'Coord.'!$A$1:$E$818,5,FALSE)","v":-81.488753000000003},815310,"Church, Tracy G",11291,8.5,2.1,25,"MEETS","MEETS",25,2.1]
["Georgia Stone Products","Lynches River Quarry - Jefferson, SC","2015-06-29","Miscellaneous Material for Electrochemical","CA325",{"$f":"VLOOKUP(Table57[[#This Row],[Facility ID]],'Coord.'!$A$1:$E$818,2,FALSE)","v":"N"},{"$f":"VLOOKUP(Table57[[#This Row],[Facility ID]],'Coord.'!$A$1:$E$818,3,FALSE)","v":34.703234999999999},{"$f":"VLOOKUP(Table57[[#This Row],[Facility ID]],'Coord.'!$A$1:$E$818,4,FALSE)","v":"W"},{"$f":"VLOOKUP(Table57[[#This Row],[Facility ID]],'Coord.'!$A$1:$E$818,5,FALSE)","v":-80.461099000000004},764178,"Jordan, Daniel H",16875,8.4,0,200,"MEETS","MEETS",200,0]
["Martin Marietta","Mallard Creek Quarry - Charlotte","2014-01-02","Miscellaneous Material for Electrochemical","CA188",{"$f":"VLOOKUP(Table57[[#This Row],[Facility ID]],'Coord.'!$A$1:$E$818,2,FALSE)","v":"N"},{"$f":"VLOOKUP(Table57[[#This Row],[Facility ID]],'Coord.'!$A$1:$E$818,3,FALSE)","v":35.318085000000004},{"$f":"VLOOKUP(Table57[[#This Row],[Facility ID]],'Coord.'!$A$1:$E$818,4,FALSE)","v":"W"},{"$f":"VLOOKUP(Table57[[#This Row],[Facility ID]],'Coord.'!$A$1:$E$818,5,FALSE)","v":-80.728077999999996},694428,"Adair, Mildred (Millie) L",11794,8.1999999999999993,0,0,"MEETS","MEETS",0,0]
["Martin Marietta","Matthews Quarry - Matthews","2019-12-03","Miscellaneous Material for Electrochemical","CA37",{"$f":"VLOOKUP(Table57[[#This Row],[Facility ID]],'Coord.'!$A$1:$E$818,2,FALSE)","v":0},{"$f":"VLOOKUP(Table57[[#This Row],[Facility ID]],'Coord.'!$A$1:$E$818,3,FALSE)","v":35.131262999999997},{"$f":"VLOOKUP(Table57[[#This Row],[Facility ID]],'Coord.'!$A$1:$E$818,4,FALSE)","v":"W"},{"$f":"VLOOKUP(Table57[[#This Row],[Facility ID]],'Coord.'!$A$1:$E$818,5,FALSE)","v":-80.720371999999998},993338,"Smith, Michael L",9169,8.9499999999999993,"<30","<71.982","MEETS","MEETS",71.981999999999999,30]
["Wake Stone Corp.","Moncure Quarry - Moncure","2019-02-05","Miscellaneous Material for Electrochemical","CA100",{"$f":"VLOOKUP(Table57[[#This Row],[Facility ID]],'Coord.'!$A$1:$E$818,2,FALSE)","v":"N"},{"$f":"VLOOKUP(Table57[[#This Row],[Facility ID]],'Coord.'!$A$1:$E$818,3,FALSE)","v":35.616160000000001},{"$f":"VLOOKUP(Table57[[#This Row],[Facility ID]],'Coord.'!$A$1:$E$818,4,FALSE)","v":"W"},{"$f":"VLOOKUP(Table57[[#This Row],[Facility ID]],'Coord.'!$A$1:$E$818,5,FALSE)","v":-79.103876},948576,"Jordan, Daniel H",13360,9.1999999999999993,0,"<49.401","DOES NOT MEET","MEETS",49.401000000000003,0]
["Ararat Rock Products","Mt. Airy Quarry - Mt. Airy","2017-01-31","Miscellaneous Material for Electrochemical","CA3",{"$f":"VLOOKUP(Table57[[#This Row],[Facility ID]],'Coord.'!$A$1:$E$818,2,FALSE)","v":"N"},{"$f":"VLOOKUP(Table57[[#This Row],[Facility ID]],'Coord.'!$A$1:$E$818,3,FALSE)","v":36.461475999999998},{"$f":"VLOOKUP(Table57[[#This Row],[Facility ID]],'Coord.'!$A$1:$E$818,4,FALSE)","v":"W"},{"$f":"VLOOKUP(Table57[[#This Row],[Facility ID]],'Coord.'!$A$1:$E$818,5,FALSE)","v":-80.593323999999996},843862,"Whitley, Christopher D",9355,7.7,0,64.400000000000006,"MEETS","MEETS",64.400000000000006,0]
["Vulcan Materials Co.","Pineville Quarry - Charlotte","2019-08-21","Miscellaneous Material for Electrochemical","CA101",{"$f":"VLOOKUP(Table57[[#This Row],[Facility ID]],'Coord.'!$A$1:$E$818,2,FALSE)","v":"N"},{"$f":"VLOOKUP(Table57[[#This Row],[Facility ID]],'Coord.'!$A$1:$E$818,3,FALSE)","v":35.115856000000001},{"$f":"VLOOKUP(Table57[[#This Row],[Facility ID]],'Coord.'!$A$1:$E$818,4,FALSE)","v":"W"},{"$f":"VLOOKUP(Table57[[#This Row],[Facility ID]],'Coord.'!$A$1:$E$818,5,FALSE)","v":-80.896596000000002},979255,"Smith, Michael L",2661,7.78,"<32","<248.027","DOES NOT MEET","DOES NOT MEET",248.02699999999999,32]
["Luck Stone Corporation","Pittsboro Quarry - Moncure","2016-03-29","Miscellaneous Material for Electrochemical","CA292",{"$f":"VLOOKUP(Table57[[#This Row],[Facility ID]],'Coord.'!$A$1:$E$818,2,FALSE)","v":"N"},{"$f":"VLOOKUP(Table57[[#This Row],[Facility ID]],'Coord.'!$A$1:$E$818,3,FALSE)","v":35.660415999999998},{"$f":"VLOOKUP(Table57[[#This Row],[Facility ID]],'Coord.'!$A$1:$E$818,4,FALSE)","v":"W"},{"$f":"VLOOKUP(Table57[[#This Row],[Facility ID]],'Coord.'!$A$1:$E$818,5,FALSE)","v":-79.176833000000002},799661,"Jackson, Brandon M",3383,7.3,0,123,"MEETS","MEETS",123,0]
["Martin Marietta","Rock Hill Quarry - Rock Hill, SC","2019-09-10","Miscellaneous Material for Electrochemical","CA271",{"$f":"VLOOKUP(Table57[[#This Row],[Facility ID]],'Coord.'!$A$1:$E$818,2,FALSE)","v":"N"},{"$f":"VLOOKUP(Table57[[#This Row],[Facility ID]],'Coord.'!$A$1:$E$818,3,FALSE)","v":34.894787000000001},{"$f":"VLOOKUP(Table57[[#This Row],[Facility ID]],'Coord.'!$A$1:$E$818,4,FALSE)","v":"W"},{"$f":"VLOOKUP(Table57[[#This Row],[Facility ID]],'Coord.'!$A$1:$E$818,5,FALSE)","v":-80.999021999999997},982312,"Adair, Mildred (Millie) L",9347,9.23,"<32","<70.611","DOES NOT MEET","MEETS",70.611000000000004,32]
["Vulcan Materials Co.","Rockingham Quarry - Rockingham","2018-05-11","Miscellaneous Material for Electrochemical","CA94",{"$f":"VLOOKUP(Table57[[#This Row],[Facility ID]],'Coord.'!$A$1:$E$818,2,FALSE)","v":"N"},{"$f":"VLOOKUP(Table57[[#This Row],[Facility ID]],'Coord.'!$A$1:$E$818,3,FALSE)","v":34.938706000000003},{"$f":"VLOOKUP(Table57[[#This Row],[Facility ID]],'Coord.'!$A$1:$E$818,4,FALSE)","v":"W"},{"$f":"VLOOKUP(Table57[[#This Row],[Facility ID]],'Coord.'!$A$1:$E$818,5,FALSE)","v":-79.823207999999994},911061,"Jordan, Daniel H",5811,9.1999999999999993,0,99,"DOES NOT MEET","MEETS",99,0]
["Martin Marietta","Statesville Quarry - Statesville","2016-09-09","Miscellaneous Material for Electrochemical","CA54",{"$f":"VLOOKUP(Table57[[#This Row],[Facility ID]],'Coord.'!$A$1:$E$818,2,FALSE)","v":"N"},{"$f":"VLOOKUP(Table57[[#This Row],[Facility ID]],'Coord.'!$A$1:$E$818,3,FALSE)","v":35.804465999999998},{"$f":"VLOOKUP(Table57[[#This Row],[Facility ID]],'Coord.'!$A$1:$E$818,4,FALSE)","v":"W"},{"$f":"VLOOKUP(Table57[[#This Row],[Facility ID]],'Coord.'!$A$1:$E$818,5,FALSE)","v":-80.913083999999998},825461,"Whitley, Christopher D",2408,7.3,0,192,"DOES NOT MEET","DOES NOT MEET",192,0]
["Hedrick Industries","Aquadale Quarry - Norwood","2017-03-21","Sand, 2MS","FA479",{"$f":"VLOOKUP(Table57[[#This Row],[Facility ID]],'Coord.'!$A$1:$E$818,2,FALSE)","v":"N"},{"$f":"VLOOKUP(Table57[[#This Row],[Facility ID]],'Coord.'!$A$1:$E$818,3,FALSE)","v":35.236497999999997},{"$f":"VLOOKUP(Table57[[#This Row],[Facility ID]],'Coord.'!$A$1:$E$818,4,FALSE)","v":"W"},{"$f":"VLOOKUP(Table57[[#This Row],[Facility ID]],'Coord.'!$A$1:$E$818,5,FALSE)","v":-80.239287000000004},850263,"Thomas, Mark D",2023,8,0,96.6,"DOES NOT MEET","DOES NOT MEET",96.6,0]
["Martin Marietta","Bonds Quarry - Concord","2019-04-09","Sand, 2MS","FA392",{"$f":"VLOOKUP(Table57[[#This Row],[Facility ID]],'Coord.'!$A$1:$E$818,2,FALSE)","v":"N"},{"$f":"VLOOKUP(Table57[[#This Row],[Facility ID]],'Coord.'!$A$1:$E$818,3,FALSE)","v":35.379275},{"$f":"VLOOKUP(Table57[[#This Row],[Facility ID]],'Coord.'!$A$1:$E$818,4,FALSE)","v":"W"},{"$f":"VLOOKUP(Table57[[#This Row],[Facility ID]],'Coord.'!$A$1:$E$818,5,FALSE)","v":-80.698134999999994},958526,"Pegues, Jr., Henderson",7606,8.6999999999999993,"<30","<86.774","MEETS","MEETS",86.774000000000001,30]
["Hedrick Industries","Piedmont (Pageland #3) - Pageland, SC","2016-03-18","Sand, 2MS","FA239",{"$f":"VLOOKUP(Table57[[#This Row],[Facility ID]],'Coord.'!$A$1:$E$818,2,FALSE)","v":"N"},{"$f":"VLOOKUP(Table57[[#This Row],[Facility ID]],'Coord.'!$A$1:$E$818,3,FALSE)","v":34.756193000000003},{"$f":"VLOOKUP(Table57[[#This Row],[Facility ID]],'Coord.'!$A$1:$E$818,4,FALSE)","v":"W"},{"$f":"VLOOKUP(Table57[[#This Row],[Facility ID]],'Coord.'!$A$1:$E$818,5,FALSE)","v":-80.313792000000007},798283,"Jordan, Daniel H",25530,6.8,0,12.8,"MEETS","MEETS",12.8,0]
["Vulcan Materials Co.","115 Quarry - N. Wilkesboro","2002-06-27","Sand, 2MS - Chemistry Check","FA173",{"$f":"VLOOKUP(Table57[[#This Row],[Facility ID]],'Coord.'!$A$1:$E$818,2,FALSE)","v":"N"},{"$f":"VLOOKUP(Table57[[#This Row],[Facility ID]],'Coord.'!$A$1:$E$818,3,FALSE)","v":36.106464000000003},{"$f":"VLOOKUP(Table57[[#This Row],[Facility ID]],'Coord.'!$A$1:$E$818,4,FALSE)","v":"W"},{"$f":"VLOOKUP(Table57[[#This Row],[Facility ID]],'Coord.'!$A$1:$E$818,5,FALSE)","v":-81.099030999999997},264750,"Hamby Jr, Kenneth R",null,null,"","","N/A","N/A","",""]
["Maymead Materials, Inc.","421 Quarry - Mountain City, TN","2002-06-27","Sand, 2MS - Chemistry Check","FA164",{"$f":"VLOOKUP(Table57[[#This Row],[Facility ID]],'Coord.'!$A$1:$E$818,2,FALSE)","v":"N"},{"$f":"VLOOKUP(Table57[[#This Row],[Facility ID]],'Coord.'!$A$1:$E$818,3,FALSE)","v":36.426709000000002},{"$f":"VLOOKUP(Table57[[#This Row],[Facility ID]],'Coord.'!$A$1:$E$818,4,FALSE)","v":"W"},{"$f":"VLOOKUP(Table57[[#This Row],[Facility ID]],'Coord.'!$A$1:$E$818,5,FALSE)","v":-81.773808000000002},264749,"Hamby Jr, Kenneth R",null,null,"","","N/A","N/A","",""]
["Blue Water Industries","Abingdon Quarry","2002-10-03","Sand, 2MS - Chemistry Check","FA88",{"$f":"VLOOKUP(Table57[[#This Row],[Facility ID]],'Coord.'!$A$1:$E$818,2,FALSE)","v":"N"},{"$f":"VLOOKUP(Table57[[#This Row],[Facility ID]],'Coord.'!$A$1:$E$818,3,FALSE)","v":36.695328000000003},{"$f":"VLOOKUP(Table57[[#This Row],[Facility ID]],'Coord.'!$A$1:$E$818,4,FALSE)","v":"W"},{"$f":"VLOOKUP(Table57[[#This Row],[Facility ID]],'Coord.'!$A$1:$E$818,5,FALSE)","v":-81.982737},279423,"Hamby Jr, Kenneth R",null,null,"","","N/A","N/A","",""]
["Martin Marietta","Arrowood Quarry - Charlotte","2016-12-06","Sand, 2MS - Chemistry Check","FA203",{"$f":"VLOOKUP(Table57[[#This Row],[Facility ID]],'Coord.'!$A$1:$E$818,2,FALSE)","v":"N"},{"$f":"VLOOKUP(Table57[[#This Row],[Facility ID]],'Coord.'!$A$1:$E$818,3,FALSE)","v":35.111862000000002},{"$f":"VLOOKUP(Table57[[#This Row],[Facility ID]],'Coord.'!$A$1:$E$818,4,FALSE)","v":"W"},{"$f":"VLOOKUP(Table57[[#This Row],[Facility ID]],'Coord.'!$A$1:$E$818,5,FALSE)","v":-80.921875},837865,"Adair, Mildred (Millie) L",3339,7.3,8.9,8.5,"MEETS","MEETS",8.5,8.9]
["Austinville Limestone Co.","Austinville Limestone","2001-08-28","Sand, 2MS - Chemistry Check","FA337",{"$f":"VLOOKUP(Table57[[#This Row],[Facility ID]],'Coord.'!$A$1:$E$818,2,FALSE)","v":"N"},{"$f":"VLOOKUP(Table57[[#This Row],[Facility ID]],'Coord.'!$A$1:$E$818,3,FALSE)","v":0},{"$f":"VLOOKUP(Table57[[#This Row],[Facility ID]],'Coord.'!$A$1:$E$818,4,FALSE)","v":"W"},{"$f":"VLOOKUP(Table57[[#This Row],[Facility ID]],'Coord.'!$A$1:$E$818,5,FALSE)","v":0},228420,"Wagoner, Roy M",null,null,"","","N/A","N/A","",""]
["American Materials Co.","Black Creek Plant - Mt. Croghan, SC","2019-06-12","Sand, 2MS - Chemistry Check","FA422",{"$f":"VLOOKUP(Table57[[#This Row],[Facility ID]],'Coord.'!$A$1:$E$818,2,FALSE)","v":"N"},{"$f":"VLOOKUP(Table57[[#This Row],[Facility ID]],'Coord.'!$A$1:$E$818,3,FALSE)","v":34.717706999999997},{"$f":"VLOOKUP(Table57[[#This Row],[Facility ID]],'Coord.'!$A$1:$E$818,4,FALSE)","v":"W"},{"$f":"VLOOKUP(Table57[[#This Row],[Facility ID]],'Coord.'!$A$1:$E$818,5,FALSE)","v":-80.284664000000006},968053,"Jordan, Daniel H",23730,7.54,"<30","<27.813",{"$f":"IF(ISBLANK(M34),\"N/A\",IF(AND(4.5<=$M34,$M34<=9),IF($L34>=3000,IF($S34<=100,IF($R34<=200,\"MEETS\",\"DOES NOT MEET\"),\"DOES NOT MEET\"),\"DOES NOT MEET\"),\"DOES NOT MEET\"))","v":"MEETS"},{"$f":"IF(ISBLANK(M34), \"N/A\", IF(AND(5 <= $M34, $M34 <= 10),IF($L34>=3000,IF($S34<=100,IF($R34<=200,\"MEETS\",\"DOES NOT MEET\"),\"DOES NOT MEET\"),\"DOES NOT MEET\"),\"DOES NOT MEET\"))","v":"MEETS"},{"$f":"IF(LEFT(O34, 1)=\"<\", VALUE(RIGHT(O34,LEN(O34)-1)), O34)","v":27.812999999999999},{"$f":"IF(LEFT(N34, 1)=\"<\", VALUE(RIGHT(N34,LEN(N34)-1)), N34)","v":30}]
["Sloan Construction Co.","Blacksburg Quarry - Blacksburg, SC","2019-08-22","Sand, 2MS - Chemistry Check","FA476",{"$f":"VLOOKUP(Table57[[#This Row],[Facility ID]],'Coord.'!$A$1:$E$818,2,FALSE)","v":"N"},{"$f":"VLOOKUP(Table57[[#This Row],[Facility ID]],'Coord.'!$A$1:$E$818,3,FALSE)","v":35.158248999999998},{"$f":"VLOOKUP(Table57[[#This Row],[Facility ID]],'Coord.'!$A$1:$E$818,4,FALSE)","v":"W"},{"$f":"VLOOKUP(Table57[[#This Row],[Facility ID]],'Coord.'!$A$1:$E$818,5,FALSE)","v":-81.453967000000006},979544,"Brinson, Joseph",14950,8.3000000000000007,"<29","<44.147","MEETS","MEETS",44.146999999999998,29]
["Boxley Materials Company","Blue Ridge Quarry - Blue Ridge, VA","2019-03-05","Sand, 2MS - Chemistry Check","FA362",{"$f":"VLOOKUP(Table57[[#This Row],[Facility ID]],'Coord.'!$A$1:$E$818,2,FALSE)","v":"N"},{"$f":"VLOOKUP(Table57[[#This Row],[Facility ID]],'Coord.'!$A$1:$E$818,3,FALSE)","v":37.391289},{"$f":"VLOOKUP(Table57[[#This Row],[Facility ID]],'Coord.'!$A$1:$E$818,4,FALSE)","v":"W"},{"$f":"VLOOKUP(Table57[[#This Row],[Facility ID]],'Coord.'!$A$1:$E$818,5,FALSE)","v":-79.796707999999995},953113,"Westmoreland, Braxton J",4005,8.8000000000000007,"<30","<164.794","MEETS","MEETS",164.79400000000001,30]
["Martin Marietta","Bonds Quarry - Concord","2018-09-10","Sand, 2MS - Chemistry Check","FA392",{"$f":"VLOOKUP(Table57[[#This Row],[Facility ID]],'Coord.'!$A$1:$E$818,2,FALSE)","v":"N"},{"$f":"VLOOKUP(Table57[[#This Row],[Facility ID]],'Coord.'!$A$1:$E$818,3,FALSE)","v":35.379275},{"$f":"VLOOKUP(Table57[[#This Row],[Facility ID]],'Coord.'!$A$1:$E$818,4,FALSE)","v":"W"},{"$f":"VLOOKUP(Table57[[#This Row],[Facility ID]],'Coord.'!$A$1:$E$818,5,FALSE)","v":-80.698134999999994},930605,"Pegues, Jr., Henderson",4721,8.3000000000000007,0,83.6,"MEETS","MEETS",83.6,0]
["Vulcan Materials Co.","Boone Quarry - Boone","2001-07-30","Sand, 2MS - Chemistry Check","FA236",{"$f":"VLOOKUP(Table57[[#This Row],[Facility ID]],'Coord.'!$A$1:$E$818,2,FALSE)","v":"N"},{"$f":"VLOOKUP(Table57[[#This Row],[Facility ID]],'Coord.'!$A$1:$E$818,3,FALSE)","v":36.205551},{"$f":"VLOOKUP(Table57[[#This Row],[Facility ID]],'Coord.'!$A$1:$E$818,4,FALSE)","v":"W"},{"$f":"VLOOKUP(Table57[[#This Row],[Facility ID]],'Coord.'!$A$1:$E$818,5,FALSE)","v":-81.718419999999995},223852,"Hamby Jr, Kenneth R",null,null,"","","N/A","N/A","",""]
["Hanson Aggregates Southeast, Inc.","Brewer (Pageland #1) - Jefferson, SC","2019-06-12","Sand, 2MS - Chemistry Check","FA64",{"$f":"VLOOKUP(Table57[[#This Row],[Facility ID]],'Coord.'!$A$1:$E$818,2,FALSE)","v":"N"},{"$f":"VLOOKUP(Table57[[#This Row],[Facility ID]],'Coord.'!$A$1:$E$818,3,FALSE)","v":34.699778000000002},{"$f":"VLOOKUP(Table57[[#This Row],[Facility ID]],'Coord.'!$A$1:$E$818,4,FALSE)","v":"W"},{"$f":"VLOOKUP(Table57[[#This Row],[Facility ID]],'Coord.'!$A$1:$E$818,5,FALSE)","v":-80.334434999999999},968057,"Jordan, Daniel H",34930,6.41,"<30","<18.895","MEETS","MEETS",18.895,30]
["Vulcan Materials Co.","Bristol Quarry - Bristol, TN","2002-10-03","Sand, 2MS - Chemistry Check","FA66",{"$f":"VLOOKUP(Table57[[#This Row],[Facility ID]],'Coord.'!$A$1:$E$818,2,FALSE)","v":"N"},{"$f":"VLOOKUP(Table57[[#This Row],[Facility ID]],'Coord.'!$A$1:$E$818,3,FALSE)","v":36.586728000000001},{"$f":"VLOOKUP(Table57[[#This Row],[Facility ID]],'Coord.'!$A$1:$E$818,4,FALSE)","v":"W"},{"$f":"VLOOKUP(Table57[[#This Row],[Facility ID]],'Coord.'!$A$1:$E$818,5,FALSE)","v":-82.277083000000005},279424,"Hamby Jr, Kenneth R",null,null,"","","N/A","N/A","",""]
["Carolina Sunrock LLC","Butner Quarry - Butner","2019-03-25","Sand, 2MS - Chemistry Check","FA171",{"$f":"VLOOKUP(Table57[[#This Row],[Facility ID]],'Coord.'!$A$1:$E$818,2,FALSE)","v":"N"},{"$f":"VLOOKUP(Table57[[#This Row],[Facility ID]],'Coord.'!$A$1:$E$818,3,FALSE)","v":36.121972},{"$f":"VLOOKUP(Table57[[#This Row],[Facility ID]],'Coord.'!$A$1:$E$818,4,FALSE)","v":"W"},{"$f":"VLOOKUP(Table57[[#This Row],[Facility ID]],'Coord.'!$A$1:$E$818,5,FALSE)","v":-78.772541000000004},955937,"Skinner, III, John L",6505,10.3,"<30","<101.46","DOES NOT MEET","DOES NOT MEET",101.46,30]
["Vulcan Materials Co.","Cabarrus Quarry -- Concord","2018-10-18","Sand, 2MS - Chemistry Check","FA339",{"$f":"VLOOKUP(Table57[[#This Row],[Facility ID]],'Coord.'!$A$1:$E$818,2,FALSE)","v":"N"},{"$f":"VLOOKUP(Table57[[#This Row],[Facility ID]],'Coord.'!$A$1:$E$818,3,FALSE)","v":35.406385},{"$f":"VLOOKUP(Table57[[#This Row],[Facility ID]],'Coord.'!$A$1:$E$818,4,FALSE)","v":"W"},{"$f":"VLOOKUP(Table57[[#This Row],[Facility ID]],'Coord.'!$A$1:$E$818,5,FALSE)","v":-80.704421999999994},935931,"Cero, Kevin M",7516,9,0,"<87.8","MEETS","MEETS",87.8,0]
["Cardinal Stone Company","Carolina Sand Pee Dee Pit","2001-01-31","Sand, 2MS - Chemistry Check","FA22152",{"$f":"VLOOKUP(Table57[[#This Row],[Facility ID]],'Coord.'!$A$1:$E$818,2,FALSE)","v":0},{"$f":"VLOOKUP(Table57[[#This Row],[Facility ID]],'Coord.'!$A$1:$E$818,3,FALSE)","v":0},{"$f":"VLOOKUP(Table57[[#This Row],[Facility ID]],'Coord.'!$A$1:$E$818,4,FALSE)","v":0},{"$f":"VLOOKUP(Table57[[#This Row],[Facility ID]],'Coord.'!$A$1:$E$818,5,FALSE)","v":0},175117,"Allen, Daniel W",null,null,7,"","N/A","N/A","",7]
["Cardinal Stone Company","Carolina Sand Pee Dee Pit","2001-01-31","Sand, 2MS - Chemistry Check","FA22152",{"$f":"VLOOKUP(Table57[[#This Row],[Facility ID]],'Coord.'!$A$1:$E$818,2,FALSE)","v":0},{"$f":"VLOOKUP(Table57[[#This Row],[Facility ID]],'Coord.'!$A$1:$E$818,3,FALSE)","v":0},{"$f":"VLOOKUP(Table57[[#This Row],[Facility ID]],'Coord.'!$A$1:$E$818,4,FALSE)","v":0},{"$f":"VLOOKUP(Table57[[#This Row],[Facility ID]],'Coord.'!$A$1:$E$818,5,FALSE)","v":0},175118,"Allen, Daniel W",null,null,7,"","N/A","N/A","",7]
["Martin Marietta","Charlotte Quarry - Charlotte","2016-09-08","Sand, 2MS - Chemistry Check","FA562",{"$f":"VLOOKUP(Table57[[#This Row],[Facility ID]],'Coord.'!$A$1:$E$818,2,FALSE)","v":"N"},{"$f":"VLOOKUP(Table57[[#This Row],[Facility ID]],'Coord.'!$A$1:$E$818,3,FALSE)","v":35.295997},{"$f":"VLOOKUP(Table57[[#This Row],[Facility ID]],'Coord.'!$A$1:$E$818,4,FALSE)","v":"W"},{"$f":"VLOOKUP(Table57[[#This Row],[Facility ID]],'Coord.'!$A$1:$E$818,5,FALSE)","v":-80.860733999999994},825585,"Adair, Mildred (Millie) L",6112,7.5,0,50.7,"MEETS","MEETS",50.7,0]
["Martin Marietta","Clarks Quarry - New Bern","2019-09-25","Sand, 2MS - Chemistry Check","FA214",{"$f":"VLOOKUP(Table57[[#This Row],[Facility ID]],'Coord.'!$A$1:$E$818,2,FALSE)","v":"N"},{"$f":"VLOOKUP(Table57[[#This Row],[Facility ID]],'Coord.'!$A$1:$E$818,3,FALSE)","v":35.150666999999999},{"$f":"VLOOKUP(Table57[[#This Row],[Facility ID]],'Coord.'!$A$1:$E$818,4,FALSE)","v":"W"},{"$f":"VLOOKUP(Table57[[#This Row],[Facility ID]],'Coord.'!$A$1:$E$818,5,FALSE)","v":-77.151770999999997},984815,"Cobb, James R",1669,7.92,"<32","<395.446","DOES NOT MEET","DOES NOT MEET",395.44600000000003,32]
["Martin Marietta","Denver Quarry - Denver","2019-09-20","Sand, 2MS - Chemistry Check","FA377",{"$f":"VLOOKUP(Table57[[#This Row],[Facility ID]],'Coord.'!$A$1:$E$818,2,FALSE)","v":"N"},{"$f":"VLOOKUP(Table57[[#This Row],[Facility ID]],'Coord.'!$A$1:$E$818,3,FALSE)","v":35.527092000000003},{"$f":"VLOOKUP(Table57[[#This Row],[Facility ID]],'Coord.'!$A$1:$E$818,4,FALSE)","v":"W"},{"$f":"VLOOKUP(Table57[[#This Row],[Facility ID]],'Coord.'!$A$1:$E$818,5,FALSE)","v":-81.026443999999998},983982,"Myers, Jesse J",5025,7.89,"<32","<131.343","MEETS","MEETS",131.34299999999999,32]
["Vulcan Materials Co.","East Forsyth Quarry - Kernersville","2013-05-30","Sand, 2MS - Chemistry Check","FA158",{"$f":"VLOOKUP(Table57[[#This Row],[Facility ID]],'Coord.'!$A$1:$E$818,2,FALSE)","v":"N"},{"$f":"VLOOKUP(Table57[[#This Row],[Facility ID]],'Coord.'!$A$1:$E$818,3,FALSE)","v":36.024619999999999},{"$f":"VLOOKUP(Table57[[#This Row],[Facility ID]],'Coord.'!$A$1:$E$818,4,FALSE)","v":"W"},{"$f":"VLOOKUP(Table57[[#This Row],[Facility ID]],'Coord.'!$A$1:$E$818,5,FALSE)","v":-80.060130000000001},668582,"Vincent, Timothy L",9852,7.6,0,0,"MEETS","MEETS",0,0]
["Vulcan Materials Co.","Enka Quarry - Enka","2013-05-29","Sand, 2MS - Chemistry Check","CA69",{"$f":"VLOOKUP(Table57[[#This Row],[Facility ID]],'Coord.'!$A$1:$E$818,2,FALSE)","v":"N"},{"$f":"VLOOKUP(Table57[[#This Row],[Facility ID]],'Coord.'!$A$1:$E$818,3,FALSE)","v":35.323700000000002},{"$f":"VLOOKUP(Table57[[#This Row],[Facility ID]],'Coord.'!$A$1:$E$818,4,FALSE)","v":"W"},{"$f":"VLOOKUP(Table57[[#This Row],[Facility ID]],'Coord.'!$A$1:$E$818,5,FALSE)","v":-82.400899999999993},668686,"Rhymer, Robert C",4277,5.4,0,0,"MEETS","MEETS",0,0]
["Boxley Materials Company","Fieldale Quarry - Martinsville, VA","2019-03-05","Sand, 2MS - Chemistry Check","FA373",{"$f":"VLOOKUP(Table57[[#This Row],[Facility ID]],'Coord.'!$A$1:$E$818,2,FALSE)","v":"N"},{"$f":"VLOOKUP(Table57[[#This Row],[Facility ID]],'Coord.'!$A$1:$E$818,3,FALSE)","v":36.688298000000003},{"$f":"VLOOKUP(Table57[[#This Row],[Facility ID]],'Coord.'!$A$1:$E$818,4,FALSE)","v":"W"},{"$f":"VLOOKUP(Table57[[#This Row],[Facility ID]],'Coord.'!$A$1:$E$818,5,FALSE)","v":-79.938883000000004},953150,"Westmoreland, Braxton J",6135,8,0,"<107.579","MEETS","MEETS",107.57899999999999,0]
["Martin Marietta","Franklin Quarry - Franklinton","2019-03-27","Sand, 2MS - Chemistry Check","FA349",{"$f":"VLOOKUP(Table57[[#This Row],[Facility ID]],'Coord.'!$A$1:$E$818,2,FALSE)","v":"N"},{"$f":"VLOOKUP(Table57[[#This Row],[Facility ID]],'Coord.'!$A$1:$E$818,3,FALSE)","v":36.070531000000003},{"$f":"VLOOKUP(Table57[[#This Row],[Facility ID]],'Coord.'!$A$1:$E$818,4,FALSE)","v":"W"},{"$f":"VLOOKUP(Table57[[#This Row],[Facility ID]],'Coord.'!$A$1:$E$818,5,FALSE)","v":-78.485541999999995},956774,"Skinner, III, John L",14320,8.6999999999999993,"<30","<46.089","MEETS","MEETS",46.088999999999999,30]
["Martin Marietta","Garner Quarry - Garner","2016-02-09","Sand, 2MS - Chemistry Check","FA382",{"$f":"VLOOKUP(Table57[[#This Row],[Facility ID]],'Coord.'!$A$1:$E$818,2,FALSE)","v":"N"},{"$f":"VLOOKUP(Table57[[#This Row],[Facility ID]],'Coord.'!$A$1:$E$818,3,FALSE)","v":35.702160999999997},{"$f":"VLOOKUP(Table57[[#This Row],[Facility ID]],'Coord.'!$A$1:$E$818,4,FALSE)","v":"W"},{"$f":"VLOOKUP(Table57[[#This Row],[Facility ID]],'Coord.'!$A$1:$E$818,5,FALSE)","v":-78.577136999999993},793219,"Skinner, III, John L",18765,8.1999999999999993,5,2.4,"MEETS","MEETS",2.4,5]
["Vulcan Materials Co.","Greystone Quarry - Henderson","2019-04-01","Sand, 2MS - Chemistry Check","FA183",{"$f":"VLOOKUP(Table57[[#This Row],[Facility ID]],'Coord.'!$A$1:$E$818,2,FALSE)","v":"N"},{"$f":"VLOOKUP(Table57[[#This Row],[Facility ID]],'Coord.'!$A$1:$E$818,3,FALSE)","v":36.355217000000003},{"$f":"VLOOKUP(Table57[[#This Row],[Facility ID]],'Coord.'!$A$1:$E$818,4,FALSE)","v":"W"},{"$f":"VLOOKUP(Table57[[#This Row],[Facility ID]],'Coord.'!$A$1:$E$818,5,FALSE)","v":-78.348459000000005},957256,"Skinner, III, John L",14610,9.1,"<30","<45.175","DOES NOT MEET","MEETS",45.174999999999997,30]
["L.B.M. Industries","Hewitt Quarry - Topton","2011-01-05","Sand, 2MS - Chemistry Check","FA247",{"$f":"VLOOKUP(Table57[[#This Row],[Facility ID]],'Coord.'!$A$1:$E$818,2,FALSE)","v":"N"},{"$f":"VLOOKUP(Table57[[#This Row],[Facility ID]],'Coord.'!$A$1:$E$818,3,FALSE)","v":35.18432},{"$f":"VLOOKUP(Table57[[#This Row],[Facility ID]],'Coord.'!$A$1:$E$818,4,FALSE)","v":"W"},{"$f":"VLOOKUP(Table57[[#This Row],[Facility ID]],'Coord.'!$A$1:$E$818,5,FALSE)","v":-83.389529999999993},529435,"Rhymer, Robert C",11000,7.7,0,0,"MEETS","MEETS",0,0]
["Martin Marietta","Jamestown Quarry - Jamestown","2019-06-04","Sand, 2MS - Chemistry Check","FA251",{"$f":"VLOOKUP(Table57[[#This Row],[Facility ID]],'Coord.'!$A$1:$E$818,2,FALSE)","v":"N"},{"$f":"VLOOKUP(Table57[[#This Row],[Facility ID]],'Coord.'!$A$1:$E$818,3,FALSE)","v":35.964759000000001},{"$f":"VLOOKUP(Table57[[#This Row],[Facility ID]],'Coord.'!$A$1:$E$818,4,FALSE)","v":"W"},{"$f":"VLOOKUP(Table57[[#This Row],[Facility ID]],'Coord.'!$A$1:$E$818,5,FALSE)","v":-79.920193999999995},966795,"Waller, John M",13850,9.17,"<30","<47.653","DOES NOT MEET","MEETS",47.652999999999999,30]
["Carolina Sunrock LLC","Kittrell Quarry - Kittrell","2019-02-01","Sand, 2MS - Chemistry Check","FA397",{"$f":"VLOOKUP(Table57[[#This Row],[Facility ID]],'Coord.'!$A$1:$E$818,2,FALSE)","v":"N"},{"$f":"VLOOKUP(Table57[[#This Row],[Facility ID]],'Coord.'!$A$1:$E$818,3,FALSE)","v":36.169710000000002},{"$f":"VLOOKUP(Table57[[#This Row],[Facility ID]],'Coord.'!$A$1:$E$818,4,FALSE)","v":"W"},{"$f":"VLOOKUP(Table57[[#This Row],[Facility ID]],'Coord.'!$A$1:$E$818,5,FALSE)","v":-78.444863999999995},948023,"Skinner, III, John L",6444,10.6,0,"<102.421","DOES NOT MEET","DOES NOT MEET",102.42100000000001,0]
["Wake Stone Corp.","Knightdale Quarry - Knightdale","2019-01-15","Sand, 2MS - Chemistry Check","FA481",{"$f":"VLOOKUP(Table57[[#This Row],[Facility ID]],'Coord.'!$A$1:$E$818,2,FALSE)","v":"N"},{"$f":"VLOOKUP(Table57[[#This Row],[Facility ID]],'Coord.'!$A$1:$E$818,3,FALSE)","v":35.797772999999999},{"$f":"VLOOKUP(Table57[[#This Row],[Facility ID]],'Coord.'!$A$1:$E$818,4,FALSE)","v":"W"},{"$f":"VLOOKUP(Table57[[#This Row],[Facility ID]],'Coord.'!$A$1:$E$818,5,FALSE)","v":-78.502251000000001},945620,"Skinner, III, John L",15920,9.1,0,"<41.457","DOES NOT MEET","MEETS",41.457000000000001,0]
["Hedrick Industries","Lake Norman Quarry","2019-07-12","Sand, 2MS - Chemistry Check","FA226",{"$f":"VLOOKUP(Table57[[#This Row],[Facility ID]],'Coord.'!$A$1:$E$818,2,FALSE)","v":"N"},{"$f":"VLOOKUP(Table57[[#This Row],[Facility ID]],'Coord.'!$A$1:$E$818,3,FALSE)","v":35.428623999999999},{"$f":"VLOOKUP(Table57[[#This Row],[Facility ID]],'Coord.'!$A$1:$E$818,4,FALSE)","v":"W"},{"$f":"VLOOKUP(Table57[[#This Row],[Facility ID]],'Coord.'!$A$1:$E$818,5,FALSE)","v":-81.017241999999996},972394,"Gosnell, Jimmy L",4117,8.24,"<29","<160.311","MEETS","MEETS",160.31100000000001,29]
["Georgia Stone Products","Lynches River Quarry - Jefferson, SC","2016-02-11","Sand, 2MS - Chemistry Check","FA425",{"$f":"VLOOKUP(Table57[[#This Row],[Facility ID]],'Coord.'!$A$1:$E$818,2,FALSE)","v":"N"},{"$f":"VLOOKUP(Table57[[#This Row],[Facility ID]],'Coord.'!$A$1:$E$818,3,FALSE)","v":34.730891},{"$f":"VLOOKUP(Table57[[#This Row],[Facility ID]],'Coord.'!$A$1:$E$818,4,FALSE)","v":"W"},{"$f":"VLOOKUP(Table57[[#This Row],[Facility ID]],'Coord.'!$A$1:$E$818,5,FALSE)","v":-80.452881000000005},793639,"Jordan, Daniel H",23154,7.3,0,9.1999999999999993,"MEETS","MEETS",9.1999999999999993,0]
["Martin Marietta","Mallard Creek Quarry - Charlotte","2019-11-06","Sand, 2MS - Chemistry Check","FA423",{"$f":"VLOOKUP(Table57[[#This Row],[Facility ID]],'Coord.'!$A$1:$E$818,2,FALSE)","v":"N"},{"$f":"VLOOKUP(Table57[[#This Row],[Facility ID]],'Coord.'!$A$1:$E$818,3,FALSE)","v":35.318081999999997},{"$f":"VLOOKUP(Table57[[#This Row],[Facility ID]],'Coord.'!$A$1:$E$818,4,FALSE)","v":"W"},{"$f":"VLOOKUP(Table57[[#This Row],[Facility ID]],'Coord.'!$A$1:$E$818,5,FALSE)","v":-80.728077999999996},990709,"Pegues, Jr., Henderson",8025,8.94,"<32","<82.243","MEETS","MEETS",82.242999999999995,32]
["Martin Marietta","Matthews Quarry - Matthews","2015-11-12","Sand, 2MS - Chemistry Check","CA37",{"$f":"VLOOKUP(Table57[[#This Row],[Facility ID]],'Coord.'!$A$1:$E$818,2,FALSE)","v":0},{"$f":"VLOOKUP(Table57[[#This Row],[Facility ID]],'Coord.'!$A$1:$E$818,3,FALSE)","v":35.131262999999997},{"$f":"VLOOKUP(Table57[[#This Row],[Facility ID]],'Coord.'!$A$1:$E$818,4,FALSE)","v":"W"},{"$f":"VLOOKUP(Table57[[#This Row],[Facility ID]],'Coord.'!$A$1:$E$818,5,FALSE)","v":-80.720371999999998},783957,"Adair, Mildred (Millie) L",3383,7.6,5,300,"DOES NOT MEET","DOES NOT MEET",300,5]
["Blue Water Industries","Midway Quarry - Mascot, TN","2017-02-20","Sand, 2MS - Chemistry Check","FA168",{"$f":"VLOOKUP(Table57[[#This Row],[Facility ID]],'Coord.'!$A$1:$E$818,2,FALSE)","v":"N"},{"$f":"VLOOKUP(Table57[[#This Row],[Facility ID]],'Coord.'!$A$1:$E$818,3,FALSE)","v":36.066125},{"$f":"VLOOKUP(Table57[[#This Row],[Facility ID]],'Coord.'!$A$1:$E$818,4,FALSE)","v":"W"},{"$f":"VLOOKUP(Table57[[#This Row],[Facility ID]],'Coord.'!$A$1:$E$818,5,FALSE)","v":-83.728346999999999},845874,"Rhymer, Robert C",4405,9.4,8.9,37.4,"DOES NOT MEET","MEETS",37.4,8.9]
["Wake Stone Corp.","Nash County Quarry - Battleboro","2016-03-11","Sand, 2MS - Chemistry Check","FA480",{"$f":"VLOOKUP(Table57[[#This Row],[Facility ID]],'Coord.'!$A$1:$E$818,2,FALSE)","v":"N"},{"$f":"VLOOKUP(Table57[[#This Row],[Facility ID]],'Coord.'!$A$1:$E$818,3,FALSE)","v":36.060037000000001},{"$f":"VLOOKUP(Table57[[#This Row],[Facility ID]],'Coord.'!$A$1:$E$818,4,FALSE)","v":"W"},{"$f":"VLOOKUP(Table57[[#This Row],[Facility ID]],'Coord.'!$A$1:$E$818,5,FALSE)","v":-77.83229},797388,"Raines, James R",8361,8.5,0,12.1,"MEETS","MEETS",12.1,0]
["Hanson Aggregates Southeast, Inc.","Neverson Quarry - Sims","2016-03-15","Sand, 2MS - Chemistry Check","CA66",{"$f":"VLOOKUP(Table57[[#This Row],[Facility ID]],'Coord.'!$A$1:$E$818,2,FALSE)","v":"N"},{"$f":"VLOOKUP(Table57[[#This Row],[Facility ID]],'Coord.'!$A$1:$E$818,3,FALSE)","v":35.766500999999998},{"$f":"VLOOKUP(Table57[[#This Row],[Facility ID]],'Coord.'!$A$1:$E$818,4,FALSE)","v":"W"},{"$f":"VLOOKUP(Table57[[#This Row],[Facility ID]],'Coord.'!$A$1:$E$818,5,FALSE)","v":-78.084275000000005},798235,"Raines, James R",25867,7.9,0,4.5,"MEETS","MEETS",4.5,0]
["Vulcan Materials Co.","North Quarry - Winston Salem","2016-03-23","Sand, 2MS - Chemistry Check","CA72",{"$f":"VLOOKUP(Table57[[#This Row],[Facility ID]],'Coord.'!$A$1:$E$818,2,FALSE)","v":"N"},{"$f":"VLOOKUP(Table57[[#This Row],[Facility ID]],'Coord.'!$A$1:$E$818,3,FALSE)","v":36.176855000000003},{"$f":"VLOOKUP(Table57[[#This Row],[Facility ID]],'Coord.'!$A$1:$E$818,4,FALSE)","v":"W"},{"$f":"VLOOKUP(Table57[[#This Row],[Facility ID]],'Coord.'!$A$1:$E$818,5,FALSE)","v":-80.268285000000006},798945,"Wallace, Weston G",24278,8,0,7.1,"MEETS","MEETS",7.1,0]
["Vulcan Materials Co.","Pacolet Quarry - Pacolet, SC","2019-08-01","Sand, 2MS - Chemistry Check","FA212",{"$f":"VLOOKUP(Table57[[#This Row],[Facility ID]],'Coord.'!$A$1:$E$818,2,FALSE)","v":"N"},{"$f":"VLOOKUP(Table57[[#This Row],[Facility ID]],'Coord.'!$A$1:$E$818,3,FALSE)","v":34.907637000000001},{"$f":"VLOOKUP(Table57[[#This Row],[Facility ID]],'Coord.'!$A$1:$E$818,4,FALSE)","v":"W"},{"$f":"VLOOKUP(Table57[[#This Row],[Facility ID]],'Coord.'!$A$1:$E$818,5,FALSE)","v":-81.784471999999994},975600,"Gosnell, Jimmy L",1466,7.41,"<29",">400<800",{"$f":"IF(ISBLANK(M66),\"N/A\",IF(AND(4.5<=$M66,$M66<=9),IF($L66>=3000,IF($S66<=100,IF($R66<=200,\"MEETS\",\"DOES NOT MEET\"),\"DOES NOT MEET\"),\"DOES NOT MEET\"),\"DOES NOT MEET\"))","v":"DOES NOT MEET"},{"$f":"IF(ISBLANK(M66), \"N/A\", IF(AND(5 <= $M66, $M66 <= 10),IF($L66>=3000,IF($S66<=100,IF($R66<=200,\"MEETS\",\"DOES NOT MEET\"),\"DOES NOT MEET\"),\"DOES NOT MEET\"),\"DOES NOT MEET\"))","v":"DOES NOT MEET"},{"$f":"IF(LEFT(O66, 1)=\"<\", VALUE(RIGHT(O66,LEN(O66)-1)), O66)","v":">400<800"},{"$f":"IF(LEFT(N66, 1)=\"<\", VALUE(RIGHT(N66,LEN(N66)-1)), N66)","v":29}]
["Hedrick Industries","Piedmont (Pageland #3) - Pageland, SC","2019-06-12","Sand, 2MS - Chemistry Check","FA239",{"$f":"VLOOKUP(Table57[[#This Row],[Facility ID]],'Coord.'!$A$1:$E$818,2,FALSE)","v":"N"},{"$f":"VLOOKUP(Table57[[#This Row],[Facility ID]],'Coord.'!$A$1:$E$818,3,FALSE)","v":34.756193000000003},{"$f":"VLOOKUP(Table57[[#This Row],[Facility ID]],'Coord.'!$A$1:$E$818,4,FALSE)","v":"W"},{"$f":"VLOOKUP(Table57[[#This Row],[Facility ID]],'Coord.'!$A$1:$E$818,5,FALSE)","v":-80.313792000000007},968059,"Jordan, Daniel H",40530,6.44,"<30","<16.284","MEETS","MEETS",16.283999999999999,30]
["Martin Marietta","Pomona Quarry - Greensboro","2019-05-28","Sand, 2MS - Chemistry Check","FA163",{"$f":"VLOOKUP(Table57[[#This Row],[Facility ID]],'Coord.'!$A$1:$E$818,2,FALSE)","v":0},{"$f":"VLOOKUP(Table57[[#This Row],[Facility ID]],'Coord.'!$A$1:$E$818,3,FALSE)","v":36.060400000000001},{"$f":"VLOOKUP(Table57[[#This Row],[Facility ID]],'Coord.'!$A$1:$E$818,4,FALSE)","v":0},{"$f":"VLOOKUP(Table57[[#This Row],[Facility ID]],'Coord.'!$A$1:$E$818,5,FALSE)","v":-79.925364999999999},965380,"Waller, John M",10610,8.9,"<30","<62.205","MEETS","MEETS",62.204999999999998,30]
["Vulcan Materials Co.","Rockingham Quarry - Rockingham","2016-06-09","Sand, 2MS - Chemistry Check","FA374",{"$f":"VLOOKUP(Table57[[#This Row],[Facility ID]],'Coord.'!$A$1:$E$818,2,FALSE)","v":"N"},{"$f":"VLOOKUP(Table57[[#This Row],[Facility ID]],'Coord.'!$A$1:$E$818,3,FALSE)","v":34.938709000000003},{"$f":"VLOOKUP(Table57[[#This Row],[Facility ID]],'Coord.'!$A$1:$E$818,4,FALSE)","v":"W"},{"$f":"VLOOKUP(Table57[[#This Row],[Facility ID]],'Coord.'!$A$1:$E$818,5,FALSE)","v":-79.823207999999994},810588,"Tucker, Rusty J",9407,8.9,2.1,16.7,"MEETS","MEETS",16.7,2.1]
["Hanson Aggregates Southeast, Inc.","Rocky Mount Quarry (#2)","2016-04-14","Sand, 2MS - Chemistry Check","FA491",{"$f":"VLOOKUP(Table57[[#This Row],[Facility ID]],'Coord.'!$A$1:$E$818,2,FALSE)","v":"N"},{"$f":"VLOOKUP(Table57[[#This Row],[Facility ID]],'Coord.'!$A$1:$E$818,3,FALSE)","v":35.891002999999998},{"$f":"VLOOKUP(Table57[[#This Row],[Facility ID]],'Coord.'!$A$1:$E$818,4,FALSE)","v":"W"},{"$f":"VLOOKUP(Table57[[#This Row],[Facility ID]],'Coord.'!$A$1:$E$818,5,FALSE)","v":-77.865480000000005},802199,"Raines, James R",19135,8.4,0,38.799999999999997,"MEETS","MEETS",38.799999999999997,0]
["Hanson Aggregates Southeast, Inc.","Rougemont Quarry","2019-01-11","Sand, 2MS - Chemistry Check","FA464",{"$f":"VLOOKUP(Table57[[#This Row],[Facility ID]],'Coord.'!$A$1:$E$818,2,FALSE)","v":"N"},{"$f":"VLOOKUP(Table57[[#This Row],[Facility ID]],'Coord.'!$A$1:$E$818,3,FALSE)","v":36.224885},{"$f":"VLOOKUP(Table57[[#This Row],[Facility ID]],'Coord.'!$A$1:$E$818,4,FALSE)","v":"W"},{"$f":"VLOOKUP(Table57[[#This Row],[Facility ID]],'Coord.'!$A$1:$E$818,5,FALSE)","v":-78.951487999999998},945248,"Skinner, III, John L",19060,9.4,0,"<34.627","DOES NOT MEET","MEETS",34.627000000000002,0]
["Martin Marietta","Salem Stone Quarry - Kernersville","2013-08-20","Sand, 2MS - Chemistry Check","FA305",{"$f":"VLOOKUP(Table57[[#This Row],[Facility ID]],'Coord.'!$A$1:$E$818,2,FALSE)","v":"N"},{"$f":"VLOOKUP(Table57[[#This Row],[Facility ID]],'Coord.'!$A$1:$E$818,3,FALSE)","v":36.035983000000002},{"$f":"VLOOKUP(Table57[[#This Row],[Facility ID]],'Coord.'!$A$1:$E$818,4,FALSE)","v":"W"},{"$f":"VLOOKUP(Table57[[#This Row],[Facility ID]],'Coord.'!$A$1:$E$818,5,FALSE)","v":-80.106778000000006},677612,"Vincent, Timothy L",7413,7.3,0,0,"MEETS","MEETS",0,0]
["Hanson Aggregates Southeast, Inc.","Sandy Flats Quarry - Taylors, SC","2016-12-14","Sand, 2MS - Chemistry Check","FA438",{"$f":"VLOOKUP(Table57[[#This Row],[Facility ID]],'Coord.'!$A$1:$E$818,2,FALSE)","v":"N"},{"$f":"VLOOKUP(Table57[[#This Row],[Facility ID]],'Coord.'!$A$1:$E$818,3,FALSE)","v":35.008493999999999},{"$f":"VLOOKUP(Table57[[#This Row],[Facility ID]],'Coord.'!$A$1:$E$818,4,FALSE)","v":"W"},{"$f":"VLOOKUP(Table57[[#This Row],[Facility ID]],'Coord.'!$A$1:$E$818,5,FALSE)","v":-82.345754999999997},839146,"Wood, Dean Michael M",14616,7.8,0,5.6,"MEETS","MEETS",5.6,0]
["Vulcan Materials Co.","Smith Grove Q. - Mocksville","2016-04-26","Sand, 2MS - Chemistry Check","FA76",{"$f":"VLOOKUP(Table57[[#This Row],[Facility ID]],'Coord.'!$A$1:$E$818,2,FALSE)","v":"N"},{"$f":"VLOOKUP(Table57[[#This Row],[Facility ID]],'Coord.'!$A$1:$E$818,3,FALSE)","v":35.967188},{"$f":"VLOOKUP(Table57[[#This Row],[Facility ID]],'Coord.'!$A$1:$E$818,4,FALSE)","v":"W"},{"$f":"VLOOKUP(Table57[[#This Row],[Facility ID]],'Coord.'!$A$1:$E$818,5,FALSE)","v":-80.530692999999999},803859,"Wallace, Weston G",6254,6.2,0,49,"MEETS","MEETS",49,0]
["Vulcan Materials Co.","Spruce Pine Quarry - Bakersville","2015-08-11","Sand, 2MS - Chemistry Check","CA111",{"$f":"VLOOKUP(Table57[[#This Row],[Facility ID]],'Coord.'!$A$1:$E$818,2,FALSE)","v":"N"},{"$f":"VLOOKUP(Table57[[#This Row],[Facility ID]],'Coord.'!$A$1:$E$818,3,FALSE)","v":35.583199999999998},{"$f":"VLOOKUP(Table57[[#This Row],[Facility ID]],'Coord.'!$A$1:$E$818,4,FALSE)","v":"W"},{"$f":"VLOOKUP(Table57[[#This Row],[Facility ID]],'Coord.'!$A$1:$E$818,5,FALSE)","v":-82.054100000000005},770808,"Rhymer, Robert C",931966,7.2,0,300,"DOES NOT MEET","DOES NOT MEET",300,0]
["Wake Stone Corp.","Triangle Quarry - Cary","2012-03-12","Sand, 2MS - Chemistry Check","CA157",{"$f":"VLOOKUP(Table57[[#This Row],[Facility ID]],'Coord.'!$A$1:$E$818,2,FALSE)","v":"N"},{"$f":"VLOOKUP(Table57[[#This Row],[Facility ID]],'Coord.'!$A$1:$E$818,3,FALSE)","v":35.838397000000001},{"$f":"VLOOKUP(Table57[[#This Row],[Facility ID]],'Coord.'!$A$1:$E$818,4,FALSE)","v":"W"},{"$f":"VLOOKUP(Table57[[#This Row],[Facility ID]],'Coord.'!$A$1:$E$818,5,FALSE)","v":-78.767809},617977,"Gowl, Adam L",7052,7.8,0,0,"MEETS","MEETS",0,0]
["Blue Water Industries","Watauga Quarry","2002-10-03","Sand, 2MS - Chemistry Check","FA78",{"$f":"VLOOKUP(Table57[[#This Row],[Facility ID]],'Coord.'!$A$1:$E$818,2,FALSE)","v":"N"},{"$f":"VLOOKUP(Table57[[#This Row],[Facility ID]],'Coord.'!$A$1:$E$818,3,FALSE)","v":36.370567999999999},{"$f":"VLOOKUP(Table57[[#This Row],[Facility ID]],'Coord.'!$A$1:$E$818,4,FALSE)","v":"W"},{"$f":"VLOOKUP(Table57[[#This Row],[Facility ID]],'Coord.'!$A$1:$E$818,5,FALSE)","v":-82.296366000000006},279422,"Hamby Jr, Kenneth R",null,null,"","","N/A","N/A","",""]
["LBM Industries","Whitewater Falls - Sapphire","2016-05-24","Sand, 2MS - Chemistry Check","FA162",{"$f":"VLOOKUP(Table57[[#This Row],[Facility ID]],'Coord.'!$A$1:$E$818,2,FALSE)","v":"N"},{"$f":"VLOOKUP(Table57[[#This Row],[Facility ID]],'Coord.'!$A$1:$E$818,3,FALSE)","v":35.056310000000003},{"$f":"VLOOKUP(Table57[[#This Row],[Facility ID]],'Coord.'!$A$1:$E$818,4,FALSE)","v":"W"},{"$f":"VLOOKUP(Table57[[#This Row],[Facility ID]],'Coord.'!$A$1:$E$818,5,FALSE)","v":-82.582790000000003},808253,"Wood, Dean Michael M",12303,7.9,2.1,24.8,"MEETS","MEETS",24.8,2.1]
["Martin Marietta","Woodleaf Quarry - Salisbury","2000-07-26","Sand, 2MS - Chemistry Check","FA100",{"$f":"VLOOKUP(Table57[[#This Row],[Facility ID]],'Coord.'!$A$1:$E$818,2,FALSE)","v":"N"},{"$f":"VLOOKUP(Table57[[#This Row],[Facility ID]],'Coord.'!$A$1:$E$818,3,FALSE)","v":35.773536},{"$f":"VLOOKUP(Table57[[#This Row],[Facility ID]],'Coord.'!$A$1:$E$818,4,FALSE)","v":"W"},{"$f":"VLOOKUP(Table57[[#This Row],[Facility ID]],'Coord.'!$A$1:$E$818,5,FALSE)","v":-80.598793000000001},145927,"Wrenn, Kevin O",null,null,"","","N/A","N/A","",""]
["Carolina Sunrock LLC","Woodsdale Quarry - Roxboro","2019-01-11","Sand, 2MS - Chemistry Check","FA440",{"$f":"VLOOKUP(Table57[[#This Row],[Facility ID]],'Coord.'!$A$1:$E$818,2,FALSE)","v":"N"},{"$f":"VLOOKUP(Table57[[#This Row],[Facility ID]],'Coord.'!$A$1:$E$818,3,FALSE)","v":36.516779},{"$f":"VLOOKUP(Table57[[#This Row],[Facility ID]],'Coord.'!$A$1:$E$818,4,FALSE)","v":"W"},{"$f":"VLOOKUP(Table57[[#This Row],[Facility ID]],'Coord.'!$A$1:$E$818,5,FALSE)","v":-78.963525000000004},945252,"Skinner, III, John L",13210,9.1,0,"<49.962","DOES NOT MEET","MEETS",49.962000000000003,0]
["Hanson Aggregates Southeast, Inc.","Hasskamp Pit - Horatio, SC","2001-03-20","Sand, 2S","FA117",{"$f":"VLOOKUP(Table57[[#This Row],[Facility ID]],'Coord.'!$A$1:$E$818,2,FALSE)","v":0},{"$f":"VLOOKUP(Table57[[#This Row],[Facility ID]],'Coord.'!$A$1:$E$818,3,FALSE)","v":0},{"$f":"VLOOKUP(Table57[[#This Row],[Facility ID]],'Coord.'!$A$1:$E$818,4,FALSE)","v":0},{"$f":"VLOOKUP(Table57[[#This Row],[Facility ID]],'Coord.'!$A$1:$E$818,5,FALSE)","v":0},182599,"Chavis, Raymond S",null,null,"","","N/A","N/A","",""]
["Oldcastle Stone Products - Bonsal Mining","Lilesville Pit","2016-03-23","Sand, 2S","FA6",{"$f":"VLOOKUP(Table57[[#This Row],[Facility ID]],'Coord.'!$A$1:$E$818,2,FALSE)","v":"N"},{"$f":"VLOOKUP(Table57[[#This Row],[Facility ID]],'Coord.'!$A$1:$E$818,3,FALSE)","v":34.953809999999997},{"$f":"VLOOKUP(Table57[[#This Row],[Facility ID]],'Coord.'!$A$1:$E$818,4,FALSE)","v":"W"},{"$f":"VLOOKUP(Table57[[#This Row],[Facility ID]],'Coord.'!$A$1:$E$818,5,FALSE)","v":-79.942446000000004},799217,"Jackson, Brandon M",139121,6.8,0,6.1,"MEETS","MEETS",6.1,0]
["Dawson Contracting Inc","Ashley Heights Sand","2016-02-03","Sand, 2S - Chemistry Check","FA494",{"$f":"VLOOKUP(Table57[[#This Row],[Facility ID]],'Coord.'!$A$1:$E$818,2,FALSE)","v":"N"},{"$f":"VLOOKUP(Table57[[#This Row],[Facility ID]],'Coord.'!$A$1:$E$818,3,FALSE)","v":35.076430000000002},{"$f":"VLOOKUP(Table57[[#This Row],[Facility ID]],'Coord.'!$A$1:$E$818,4,FALSE)","v":"W"},{"$f":"VLOOKUP(Table57[[#This Row],[Facility ID]],'Coord.'!$A$1:$E$818,5,FALSE)","v":-79.389662000000001},792505,"Jordan, Daniel H",90498,6.5,0,6.9,"MEETS","MEETS",6.9,0]
["Hedrick Industries","B.V. Hedrick Gravel & Sand - Lilesville","2019-06-25","Sand, 2S - Chemistry Check","FA221",{"$f":"VLOOKUP(Table57[[#This Row],[Facility ID]],'Coord.'!$A$1:$E$818,2,FALSE)","v":"N"},{"$f":"VLOOKUP(Table57[[#This Row],[Facility ID]],'Coord.'!$A$1:$E$818,3,FALSE)","v":34.953819000000003},{"$f":"VLOOKUP(Table57[[#This Row],[Facility ID]],'Coord.'!$A$1:$E$818,4,FALSE)","v":"W"},{"$f":"VLOOKUP(Table57[[#This Row],[Facility ID]],'Coord.'!$A$1:$E$818,5,FALSE)","v":-79.928801000000007},969726,"Jordan, Daniel H",130300,5.84,"<29","<5.065","MEETS","MEETS",5.0650000000000004,29]
["American Materials Co.","Bailey Mine - Linden","2015-08-27","Sand, 2S - Chemistry Check","FA483",{"$f":"VLOOKUP(Table57[[#This Row],[Facility ID]],'Coord.'!$A$1:$E$818,2,FALSE)","v":"N"},{"$f":"VLOOKUP(Table57[[#This Row],[Facility ID]],'Coord.'!$A$1:$E$818,3,FALSE)","v":35.207301999999999},{"$f":"VLOOKUP(Table57[[#This Row],[Facility ID]],'Coord.'!$A$1:$E$818,4,FALSE)","v":"W"},{"$f":"VLOOKUP(Table57[[#This Row],[Facility ID]],'Coord.'!$A$1:$E$818,5,FALSE)","v":-78.764446000000007},773447,"Russell, Jonathan T",60350,5.4,0,0,"MEETS","MEETS",0,0]
["Bent River Materials","Bent River Pit","2019-07-02","Sand, 2S - Chemistry Check","FA460",{"$f":"VLOOKUP(Table57[[#This Row],[Facility ID]],'Coord.'!$A$1:$E$818,2,FALSE)","v":"N"},{"$f":"VLOOKUP(Table57[[#This Row],[Facility ID]],'Coord.'!$A$1:$E$818,3,FALSE)","v":36.095441000000001},{"$f":"VLOOKUP(Table57[[#This Row],[Facility ID]],'Coord.'!$A$1:$E$818,4,FALSE)","v":"W"},{"$f":"VLOOKUP(Table57[[#This Row],[Facility ID]],'Coord.'!$A$1:$E$818,5,FALSE)","v":-77.256911000000002},970953,"Thomas, Grady Q",23650,4.9800000000000004,"<29","<27.907","MEETS","DOES NOT MEET",27.907,29]
["GS Materials, Inc.","Blue Water Sand & Gravel - Mill Creek Pit","2016-04-15","Sand, 2S - Chemistry Check","FA489",{"$f":"VLOOKUP(Table57[[#This Row],[Facility ID]],'Coord.'!$A$1:$E$818,2,FALSE)","v":"N"},{"$f":"VLOOKUP(Table57[[#This Row],[Facility ID]],'Coord.'!$A$1:$E$818,3,FALSE)","v":35.352075999999997},{"$f":"VLOOKUP(Table57[[#This Row],[Facility ID]],'Coord.'!$A$1:$E$818,4,FALSE)","v":"W"},{"$f":"VLOOKUP(Table57[[#This Row],[Facility ID]],'Coord.'!$A$1:$E$818,5,FALSE)","v":-78.194147999999998},803132,"Raines, James R",46729,4.9000000000000004,0,8,"MEETS","DOES NOT MEET",8,0]
["Titan Mid-Atlantic Aggregates LLC","Branchville Sand Plant - Sebrell Farms","2020-01-22","Sand, 2S - Chemistry Check","FA613",{"$f":"VLOOKUP(Table57[[#This Row],[Facility ID]],'Coord.'!$A$1:$E$818,2,FALSE)","v":"N"},{"$f":"VLOOKUP(Table57[[#This Row],[Facility ID]],'Coord.'!$A$1:$E$818,3,FALSE)","v":36.573937999999998},{"$f":"VLOOKUP(Table57[[#This Row],[Facility ID]],'Coord.'!$A$1:$E$818,4,FALSE)","v":"W"},{"$f":"VLOOKUP(Table57[[#This Row],[Facility ID]],'Coord.'!$A$1:$E$818,5,FALSE)","v":-77.294353999999998},997214,"Bonds, Maria M",36700,6.25,"<30","<17.894","MEETS","MEETS",17.893999999999998,30]
["Best Sand & Gravel, Inc.","Brooks Pit - Goldsboro","2016-04-07","Sand, 2S - Chemistry Check","FA340",{"$f":"VLOOKUP(Table57[[#This Row],[Facility ID]],'Coord.'!$A$1:$E$818,2,FALSE)","v":"N"},{"$f":"VLOOKUP(Table57[[#This Row],[Facility ID]],'Coord.'!$A$1:$E$818,3,FALSE)","v":35.302289999999999},{"$f":"VLOOKUP(Table57[[#This Row],[Facility ID]],'Coord.'!$A$1:$E$818,4,FALSE)","v":"W"},{"$f":"VLOOKUP(Table57[[#This Row],[Facility ID]],'Coord.'!$A$1:$E$818,5,FALSE)","v":-77.936389000000005},801024,"Raines, James R",16537,7.3,0,0,"MEETS","MEETS",0,0]
["Carolina Sand","Burke County Pit","2016-12-14","Sand, 2S - Chemistry Check","FA334",{"$f":"VLOOKUP(Table57[[#This Row],[Facility ID]],'Coord.'!$A$1:$E$818,2,FALSE)","v":"N"},{"$f":"VLOOKUP(Table57[[#This Row],[Facility ID]],'Coord.'!$A$1:$E$818,3,FALSE)","v":35.4617},{"$f":"VLOOKUP(Table57[[#This Row],[Facility ID]],'Coord.'!$A$1:$E$818,4,FALSE)","v":"W"},{"$f":"VLOOKUP(Table57[[#This Row],[Facility ID]],'Coord.'!$A$1:$E$818,5,FALSE)","v":-81.410499999999999},839021,"Ausley, Jeff A",35486,6.7,0,4.5999999999999996,"MEETS","MEETS",4.5999999999999996,0]
["APAC-Atlantic - Thompson-Arthur","Candor Pit","2019-08-12","Sand, 2S - Chemistry Check","FA60",{"$f":"VLOOKUP(Table57[[#This Row],[Facility ID]],'Coord.'!$A$1:$E$818,2,FALSE)","v":"N"},{"$f":"VLOOKUP(Table57[[#This Row],[Facility ID]],'Coord.'!$A$1:$E$818,3,FALSE)","v":35.212105000000001},{"$f":"VLOOKUP(Table57[[#This Row],[Facility ID]],'Coord.'!$A$1:$E$818,4,FALSE)","v":"W"},{"$f":"VLOOKUP(Table57[[#This Row],[Facility ID]],'Coord.'!$A$1:$E$818,5,FALSE)","v":-79.726963999999995},977381,"Jackson, Brandon M",68040,5.0999999999999996,"<29","<9.7002","MEETS","MEETS",9.7002000000000006,29]
["Westside Minerals LLC","Dempsey Wood Pit - LaGrange","2020-09-24","Sand, 2S - Chemistry Check","FA403",{"$f":"VLOOKUP(Table57[[#This Row],[Facility ID]],'Coord.'!$A$1:$E$818,2,FALSE)","v":"N"},{"$f":"VLOOKUP(Table57[[#This Row],[Facility ID]],'Coord.'!$A$1:$E$818,3,FALSE)","v":35.228448},{"$f":"VLOOKUP(Table57[[#This Row],[Facility ID]],'Coord.'!$A$1:$E$818,4,FALSE)","v":"W"},{"$f":"VLOOKUP(Table57[[#This Row],[Facility ID]],'Coord.'!$A$1:$E$818,5,FALSE)","v":-77.722069000000005},1021168,"Cobb, James R",80040,4.88,"<30","<18.739","MEETS","DOES NOT MEET",18.739000000000001,30]
["American Materials Co.","Dupree Mine - Greenville","2020-09-22","Sand, 2S - Chemistry Check","FA478",{"$f":"VLOOKUP(Table57[[#This Row],[Facility ID]],'Coord.'!$A$1:$E$818,2,FALSE)","v":"N"},{"$f":"VLOOKUP(Table57[[#This Row],[Facility ID]],'Coord.'!$A$1:$E$818,3,FALSE)","v":35.703060999999998},{"$f":"VLOOKUP(Table57[[#This Row],[Facility ID]],'Coord.'!$A$1:$E$818,4,FALSE)","v":"W"},{"$f":"VLOOKUP(Table57[[#This Row],[Facility ID]],'Coord.'!$A$1:$E$818,5,FALSE)","v":-77.480889000000005},1020735,"Harris, Kevin T",100050,4.91,"<30","<19.125","MEETS","DOES NOT MEET",19.125,30]
["Martin Marietta","Edmund Pit - Lexington, SC","2013-10-03","Sand, 2S - Chemistry Check","FA265",{"$f":"VLOOKUP(Table57[[#This Row],[Facility ID]],'Coord.'!$A$1:$E$818,2,FALSE)","v":"N"},{"$f":"VLOOKUP(Table57[[#This Row],[Facility ID]],'Coord.'!$A$1:$E$818,3,FALSE)","v":33.855843},{"$f":"VLOOKUP(Table57[[#This Row],[Facility ID]],'Coord.'!$A$1:$E$818,4,FALSE)","v":"W"},{"$f":"VLOOKUP(Table57[[#This Row],[Facility ID]],'Coord.'!$A$1:$E$818,5,FALSE)","v":-81.204701999999997},683832,"Rhymer, Robert C",43178,7.1,0,0,"MEETS","MEETS",0,0]
["GS Materials, Inc.","Emery Pit - Jackson Springs","2019-08-12","Sand, 2S - Chemistry Check","FA113",{"$f":"VLOOKUP(Table57[[#This Row],[Facility ID]],'Coord.'!$A$1:$E$818,2,FALSE)","v":"N"},{"$f":"VLOOKUP(Table57[[#This Row],[Facility ID]],'Coord.'!$A$1:$E$818,3,FALSE)","v":35.247394},{"$f":"VLOOKUP(Table57[[#This Row],[Facility ID]],'Coord.'!$A$1:$E$818,4,FALSE)","v":"W"},{"$f":"VLOOKUP(Table57[[#This Row],[Facility ID]],'Coord.'!$A$1:$E$818,5,FALSE)","v":-79.722059000000002},977380,"Jackson, Brandon M",48450,4.88,"<29","<13.622","MEETS","DOES NOT MEET",13.622,29]
["Wade Moore Equipment Co.","Fleming Pit - Louisburg","2019-02-01","Sand, 2S - Chemistry Check","FA165",{"$f":"VLOOKUP(Table57[[#This Row],[Facility ID]],'Coord.'!$A$1:$E$818,2,FALSE)","v":"N"},{"$f":"VLOOKUP(Table57[[#This Row],[Facility ID]],'Coord.'!$A$1:$E$818,3,FALSE)","v":36.076608999999998},{"$f":"VLOOKUP(Table57[[#This Row],[Facility ID]],'Coord.'!$A$1:$E$818,4,FALSE)","v":"W"},{"$f":"VLOOKUP(Table57[[#This Row],[Facility ID]],'Coord.'!$A$1:$E$818,5,FALSE)","v":-78.268575999999996},948020,"Skinner, III, John L",79110,6.7,0,"<8.343","MEETS","MEETS",8.343,0]
["PGS Aggregates, LLC","Great Pit","2016-04-18","Sand, 2S - Chemistry Check","FA254",{"$f":"VLOOKUP(Table57[[#This Row],[Facility ID]],'Coord.'!$A$1:$E$818,2,FALSE)","v":"N"},{"$f":"VLOOKUP(Table57[[#This Row],[Facility ID]],'Coord.'!$A$1:$E$818,3,FALSE)","v":35.966748000000003},{"$f":"VLOOKUP(Table57[[#This Row],[Facility ID]],'Coord.'!$A$1:$E$818,4,FALSE)","v":"W"},{"$f":"VLOOKUP(Table57[[#This Row],[Facility ID]],'Coord.'!$A$1:$E$818,5,FALSE)","v":-77.685067000000004},803141,"Raines, James R",49727,5.0999999999999996,0,7.1,"MEETS","MEETS",7.1,0]
["GS Materials, Inc.","Hall Pit - Lemon Springs","2016-03-08","Sand, 2S - Chemistry Check","FA122",{"$f":"VLOOKUP(Table57[[#This Row],[Facility ID]],'Coord.'!$A$1:$E$818,2,FALSE)","v":"N"},{"$f":"VLOOKUP(Table57[[#This Row],[Facility ID]],'Coord.'!$A$1:$E$818,3,FALSE)","v":35.410108999999999},{"$f":"VLOOKUP(Table57[[#This Row],[Facility ID]],'Coord.'!$A$1:$E$818,4,FALSE)","v":"W"},{"$f":"VLOOKUP(Table57[[#This Row],[Facility ID]],'Coord.'!$A$1:$E$818,5,FALSE)","v":-79.199066000000002},796684,"Murphy, Billy J",117385,5.4,0,6.1,{"$f":"IF(ISBLANK(M98),\"N/A\",IF(AND(4.5<=$M98,$M98<=9),IF($L98>=3000,IF($S98<=100,IF($R98<=200,\"MEETS\",\"DOES NOT MEET\"),\"DOES NOT MEET\"),\"DOES NOT MEET\"),\"DOES NOT MEET\"))","v":"MEETS"},{"$f":"IF(ISBLANK(M98), \"N/A\", IF(AND(5 <= $M98, $M98 <= 10),IF($L98>=3000,IF($S98<=100,IF($R98<=200,\"MEETS\",\"DOES NOT MEET\"),\"DOES NOT MEET\"),\"DOES NOT MEET\"),\"DOES NOT MEET\"))","v":"MEETS"},6.1,0]
["Vulcan Materials Co.","Kitty Hawk Sales Yard","2020-09-21","Sand, 2S - Chemistry Check","FA338",{"$f":"VLOOKUP(Table57[[#This Row],[Facility ID]],'Coord.'!$A$1:$E$818,2,FALSE)","v":"N"},{"$f":"VLOOKUP(Table57[[#This Row],[Facility ID]],'Coord.'!$A$1:$E$818,3,FALSE)","v":36.054642999999999},{"$f":"VLOOKUP(Table57[[#This Row],[Facility ID]],'Coord.'!$A$1:$E$818,4,FALSE)","v":"W"},{"$f":"VLOOKUP(Table57[[#This Row],[Facility ID]],'Coord.'!$A$1:$E$818,5,FALSE)","v":-75.720911999999998},1021098,"Bonds, Maria M",43355,4.3099999999999996,"<30","<30.192","DOES NOT MEET","DOES NOT MEET"]
["Martin Marietta","Loamy Sand and Gravel - Bethune, SC","2019-06-21","Sand, 2S - Chemistry Check","FA429",{"$f":"VLOOKUP(Table57[[#This Row],[Facility ID]],'Coord.'!$A$1:$E$818,2,FALSE)","v":"N"},{"$f":"VLOOKUP(Table57[[#This Row],[Facility ID]],'Coord.'!$A$1:$E$818,3,FALSE)","v":34.524980999999997},{"$f":"VLOOKUP(Table57[[#This Row],[Facility ID]],'Coord.'!$A$1:$E$818,4,FALSE)","v":"W"},{"$f":"VLOOKUP(Table57[[#This Row],[Facility ID]],'Coord.'!$A$1:$E$818,5,FALSE)","v":-80.373751999999996},969545,"Jordan, Daniel H",82960,5.48,"<29","<7.956","MEETS","MEETS",{"$f":"IF(LEFT(O100, 1)=\"<\", VALUE(RIGHT(O100,LEN(O100)-1)), O100)","v":7.9560000000000004},{"$f":"IF(LEFT(N100, 1)=\"<\", VALUE(RIGHT(N100,LEN(N100)-1)), N100)","v":29}]
["Hanson Aggregates Southeast, Inc.","Marlboro S&G - Bennettsville","2019-06-19","Sand, 2S - Chemistry Check","FA10",{"$f":"VLOOKUP(Table57[[#This Row],[Facility ID]],'Coord.'!$A$1:$E$818,2,FALSE)","v":"N"},{"$f":"VLOOKUP(Table57[[#This Row],[Facility ID]],'Coord.'!$A$1:$E$818,3,FALSE)","v":34.584905999999997},{"$f":"VLOOKUP(Table57[[#This Row],[Facility ID]],'Coord.'!$A$1:$E$818,4,FALSE)","v":"W"},{"$f":"VLOOKUP(Table57[[#This Row],[Facility ID]],'Coord.'!$A$1:$E$818,5,FALSE)","v":-79.748661999999996},968878,"Jordan, Daniel H",142100,5.07,"<29","<4.645","MEETS","MEETS",{"$f":"IF(LEFT(O101, 1)=\"<\", VALUE(RIGHT(O101,LEN(O101)-1)), O101)","v":4.6449999999999996},{"$f":"IF(LEFT(N101, 1)=\"<\", VALUE(RIGHT(N101,LEN(N101)-1)), N101)","v":29}]
["Mar-Mac Sand and Gravel, LLC","Mar-Mac Sand & Gravel - Goldsboro","2016-04-15","Sand, 2S - Chemistry Check","FA336",{"$f":"VLOOKUP(Table57[[#This Row],[Facility ID]],'Coord.'!$A$1:$E$818,2,FALSE)","v":"N"},{"$f":"VLOOKUP(Table57[[#This Row],[Facility ID]],'Coord.'!$A$1:$E$818,3,FALSE)","v":35.342328999999999},{"$f":"VLOOKUP(Table57[[#This Row],[Facility ID]],'Coord.'!$A$1:$E$818,4,FALSE)","v":"W"},{"$f":"VLOOKUP(Table57[[#This Row],[Facility ID]],'Coord.'!$A$1:$E$818,5,FALSE)","v":-78.034531999999999},803130,"Raines, James R",1812,3.1,8.6,146,"DOES NOT MEET","DOES NOT MEET",{"$f":"IF(LEFT(O102, 1)=\"<\", VALUE(RIGHT(O102,LEN(O102)-1)), O102)","v":146},{"$f":"IF(LEFT(N102, 1)=\"<\", VALUE(RIGHT(N102,LEN(N102)-1)), N102)","v":8.6}]
["Mid-East Services, Inc.","Massengill Mine","2016-04-05","Sand, 2S - Chemistry Check","FA384",{"$f":"VLOOKUP(Table57[[#This Row],[Facility ID]],'Coord.'!$A$1:$E$818,2,FALSE)","v":"N"},{"$f":"VLOOKUP(Table57[[#This Row],[Facility ID]],'Coord.'!$A$1:$E$818,3,FALSE)","v":35.373412000000002},{"$f":"VLOOKUP(Table57[[#This Row],[Facility ID]],'Coord.'!$A$1:$E$818,4,FALSE)","v":"W"},{"$f":"VLOOKUP(Table57[[#This Row],[Facility ID]],'Coord.'!$A$1:$E$818,5,FALSE)","v":-78.310283999999996},801022,"Raines, James R",87108,7.4,0,5.2,"MEETS","MEETS",{"$f":"IF(LEFT(O103, 1)=\"<\", VALUE(RIGHT(O103,LEN(O103)-1)), O103)","v":5.2},{"$f":"IF(LEFT(N103, 1)=\"<\", VALUE(RIGHT(N103,LEN(N103)-1)), N103)","v":0}]
["Matthews Sand and Gravel","Matthews 3 Pit","2016-04-05","Sand, 2S - Chemistry Check","FA472",{"$f":"VLOOKUP(Table57[[#This Row],[Facility ID]],'Coord.'!$A$1:$E$818,2,FALSE)","v":"N"},{"$f":"VLOOKUP(Table57[[#This Row],[Facility ID]],'Coord.'!$A$1:$E$818,3,FALSE)","v":35.396352999999998},{"$f":"VLOOKUP(Table57[[#This Row],[Facility ID]],'Coord.'!$A$1:$E$818,4,FALSE)","v":"W"},{"$f":"VLOOKUP(Table57[[#This Row],[Facility ID]],'Coord.'!$A$1:$E$818,5,FALSE)","v":-78.306456999999995},801023,"Raines, James R",71531,7.3,0,0,"MEETS","MEETS",{"$f":"IF(LEFT(O104, 1)=\"<\", VALUE(RIGHT(O104,LEN(O104)-1)), O104)","v":0},{"$f":"IF(LEFT(N104, 1)=\"<\", VALUE(RIGHT(N104,LEN(N104)-1)), N104)","v":0}]
["Matthews Sand and Gravel","Matthews Pit #4 - Princeton","2020-10-14","Sand, 2S - Chemistry Check","FA616",{"$f":"VLOOKUP(Table57[[#This Row],[Facility ID]],'Coord.'!$A$1:$E$818,2,FALSE)","v":"N"},{"$f":"VLOOKUP(Table57[[#This Row],[Facility ID]],'Coord.'!$A$1:$E$818,3,FALSE)","v":35.350309000000003},{"$f":"VLOOKUP(Table57[[#This Row],[Facility ID]],'Coord.'!$A$1:$E$818,4,FALSE)","v":"W"},{"$f":"VLOOKUP(Table57[[#This Row],[Facility ID]],'Coord.'!$A$1:$E$818,5,FALSE)","v":-78.188156000000006},1023373,"Calestru, Steliana",113390,5.51,"<30","<14.502","MEETS","MEETS"]
["Commercial Ready Mix Products","Newsome Pit #2 - Pendleton","2020-07-09","Sand, 2S - Chemistry Check","FA317",{"$f":"VLOOKUP(Table57[[#This Row],[Facility ID]],'Coord.'!$A$1:$E$818,2,FALSE)","v":"N"},{"$f":"VLOOKUP(Table57[[#This Row],[Facility ID]],'Coord.'!$A$1:$E$818,3,FALSE)","v":36.508727},{"$f":"VLOOKUP(Table57[[#This Row],[Facility ID]],'Coord.'!$A$1:$E$818,4,FALSE)","v":"W"},{"$f":"VLOOKUP(Table57[[#This Row],[Facility ID]],'Coord.'!$A$1:$E$818,5,FALSE)","v":-77.151347999999999},1013570,"Thomas, Grady Q",260130,6.33,"<30","<2.537","MEETS","MEETS",{"$f":"IF(LEFT(O106, 1)=\"<\", VALUE(RIGHT(O106,LEN(O106)-1)), O106)","v":2.5369999999999999},{"$f":"IF(LEFT(N106, 1)=\"<\", VALUE(RIGHT(N106,LEN(N106)-1)), N106)","v":30}]
["Hedrick Industries","Norman Sand Pit (D&J) - Candor, NC","2019-07-12","Sand, 2S - Chemistry Check","FA111",{"$f":"VLOOKUP(Table57[[#This Row],[Facility ID]],'Coord.'!$A$1:$E$818,2,FALSE)","v":"N"},{"$f":"VLOOKUP(Table57[[#This Row],[Facility ID]],'Coord.'!$A$1:$E$818,3,FALSE)","v":35.198165000000003},{"$f":"VLOOKUP(Table57[[#This Row],[Facility ID]],'Coord.'!$A$1:$E$818,4,FALSE)","v":"W"},{"$f":"VLOOKUP(Table57[[#This Row],[Facility ID]],'Coord.'!$A$1:$E$818,5,FALSE)","v":-79.752889999999994},972349,"Jackson, Brandon M",44790,4.88,"<29","<14.735","MEETS","DOES NOT MEET",14.734999999999999,29]
["Osprey Minerals","Osprey Sand Pit - Mt. Croghan","2019-06-12","Sand, 2S - Chemistry Check","FA603",{"$f":"VLOOKUP(Table57[[#This Row],[Facility ID]],'Coord.'!$A$1:$E$818,2,FALSE)","v":"N"},{"$f":"VLOOKUP(Table57[[#This Row],[Facility ID]],'Coord.'!$A$1:$E$818,3,FALSE)","v":34.699564000000002},{"$f":"VLOOKUP(Table57[[#This Row],[Facility ID]],'Coord.'!$A$1:$E$818,4,FALSE)","v":"W"},{"$f":"VLOOKUP(Table57[[#This Row],[Facility ID]],'Coord.'!$A$1:$E$818,5,FALSE)","v":-80.269891000000001},968060,"Jordan, Daniel H",51310,5.54,"<30","<12.863","MEETS","MEETS",12.863,30]
["Pea Creek Mines","Pea Creek Mines","2019-06-26","Sand, 2S - Chemistry Check","FA447",{"$f":"VLOOKUP(Table57[[#This Row],[Facility ID]],'Coord.'!$A$1:$E$818,2,FALSE)","v":"N"},{"$f":"VLOOKUP(Table57[[#This Row],[Facility ID]],'Coord.'!$A$1:$E$818,3,FALSE)","v":35.665993999999998},{"$f":"VLOOKUP(Table57[[#This Row],[Facility ID]],'Coord.'!$A$1:$E$818,4,FALSE)","v":"W"},{"$f":"VLOOKUP(Table57[[#This Row],[Facility ID]],'Coord.'!$A$1:$E$818,5,FALSE)","v":-77.191417999999999},970248,"Cobb, James R",28120,4.7699999999999996,"<29","<23.471","MEETS","DOES NOT MEET",23.471,29]
["Vulcan Materials Co.","Puddledock Quarry - Prince George, VA","2019-08-26","Sand, 2S - Chemistry Check","FA172",{"$f":"VLOOKUP(Table57[[#This Row],[Facility ID]],'Coord.'!$A$1:$E$818,2,FALSE)","v":"N"},{"$f":"VLOOKUP(Table57[[#This Row],[Facility ID]],'Coord.'!$A$1:$E$818,3,FALSE)","v":37.260105000000003},{"$f":"VLOOKUP(Table57[[#This Row],[Facility ID]],'Coord.'!$A$1:$E$818,4,FALSE)","v":"W"},{"$f":"VLOOKUP(Table57[[#This Row],[Facility ID]],'Coord.'!$A$1:$E$818,5,FALSE)","v":-77.364734999999996},980143,"Bonds, Maria M",52160,4.99,"<29","<12.653","MEETS","DOES NOT MEET",12.653,29]
["Ernie Everett Site Prep., Inc.","Shepard Pit - Kinston",44095,"Sand, 2S - Chemistry Check","FA605",{"$f":"VLOOKUP(Table57[[#This Row],[Facility ID]],'Coord.'!$A$1:$E$818,2,FALSE)","v":"N"},{"$f":"VLOOKUP(Table57[[#This Row],[Facility ID]],'Coord.'!$A$1:$E$818,3,FALSE)","v":35.247407000000003},{"$f":"VLOOKUP(Table57[[#This Row],[Facility ID]],'Coord.'!$A$1:$E$818,4,FALSE)","v":"W"},{"$f":"VLOOKUP(Table57[[#This Row],[Facility ID]],'Coord.'!$A$1:$E$818,5,FALSE)","v":-77.592849999999999},1020626,"Harris, Kevin T",140070,5.39,"<30",12,"MEETS","MEETS",12,30]
["Thomas Cement, Inc.","Simpson Mine - Pageland, SC","2019-06-25","Sand, 2S - Chemistry Check","FA456",{"$f":"VLOOKUP(Table57[[#This Row],[Facility ID]],'Coord.'!$A$1:$E$818,2,FALSE)","v":"N"},{"$f":"VLOOKUP(Table57[[#This Row],[Facility ID]],'Coord.'!$A$1:$E$818,3,FALSE)","v":34.708316000000003},{"$f":"VLOOKUP(Table57[[#This Row],[Facility ID]],'Coord.'!$A$1:$E$818,4,FALSE)","v":"W"},{"$f":"VLOOKUP(Table57[[#This Row],[Facility ID]],'Coord.'!$A$1:$E$818,5,FALSE)","v":-80.368080000000006},969963,"Jordan, Daniel H",66420,4.9000000000000004,"<29","<9.937","MEETS","DOES NOT MEET",9.9369999999999994,29]
["Stony Creek Sand and Gravel, LLC","Stony Creek Sand & Gravel - Carson, VA","2016-04-22","Sand, 2S - Chemistry Check","FA503",{"$f":"VLOOKUP(Table57[[#This Row],[Facility ID]],'Coord.'!$A$1:$E$818,2,FALSE)","v":"N"},{"$f":"VLOOKUP(Table57[[#This Row],[Facility ID]],'Coord.'!$A$1:$E$818,3,FALSE)","v":36.978999000000002},{"$f":"VLOOKUP(Table57[[#This Row],[Facility ID]],'Coord.'!$A$1:$E$818,4,FALSE)","v":"W"},{"$f":"VLOOKUP(Table57[[#This Row],[Facility ID]],'Coord.'!$A$1:$E$818,5,FALSE)","v":-77.347684000000001},803774,"Raines, James R",8210,4.0999999999999996,4.3,31.3,"DOES NOT MEET","DOES NOT MEET",31.3,4.3]
["American Materials Co.","Sumter County Pit - Sumter, SC","2019-06-25","Sand, 2S - Chemistry Check","FA607",{"$f":"VLOOKUP(Table57[[#This Row],[Facility ID]],'Coord.'!$A$1:$E$818,2,FALSE)","v":"N"},{"$f":"VLOOKUP(Table57[[#This Row],[Facility ID]],'Coord.'!$A$1:$E$818,3,FALSE)","v":33.949860000000001},{"$f":"VLOOKUP(Table57[[#This Row],[Facility ID]],'Coord.'!$A$1:$E$818,4,FALSE)","v":"W"},{"$f":"VLOOKUP(Table57[[#This Row],[Facility ID]],'Coord.'!$A$1:$E$818,5,FALSE)","v":-80.481436000000002},969961,"Jordan, Daniel H",79610,5.05,"<29","<8.29","MEETS","MEETS",8.2899999999999991,29]
["B.E. Singleton & Sons, Inc.","Talley-Whichard Pitt","2018-03-27","Sand, 2S - Chemistry Check","FA488",{"$f":"VLOOKUP(Table57[[#This Row],[Facility ID]],'Coord.'!$A$1:$E$818,2,FALSE)","v":"N"},{"$f":"VLOOKUP(Table57[[#This Row],[Facility ID]],'Coord.'!$A$1:$E$818,3,FALSE)","v":35.526294999999998},{"$f":"VLOOKUP(Table57[[#This Row],[Facility ID]],'Coord.'!$A$1:$E$818,4,FALSE)","v":"W"},{"$f":"VLOOKUP(Table57[[#This Row],[Facility ID]],'Coord.'!$A$1:$E$818,5,FALSE)","v":-77.064216000000002},903394,"Cobb, James R",2203,4,21.6,30.5,"DOES NOT MEET","DOES NOT MEET",30.5,21.6]
["Neuse Sand And Gravel","Tilghman Pit","2018-02-15","Sand, 2S - Chemistry Check","FA446",{"$f":"VLOOKUP(Table57[[#This Row],[Facility ID]],'Coord.'!$A$1:$E$818,2,FALSE)","v":"N"},{"$f":"VLOOKUP(Table57[[#This Row],[Facility ID]],'Coord.'!$A$1:$E$818,3,FALSE)","v":35.259956000000003},{"$f":"VLOOKUP(Table57[[#This Row],[Facility ID]],'Coord.'!$A$1:$E$818,4,FALSE)","v":"W"},{"$f":"VLOOKUP(Table57[[#This Row],[Facility ID]],'Coord.'!$A$1:$E$818,5,FALSE)","v":-77.518299999999996},897315,"Cobb, James R",93197,7.5,0,7.1,"MEETS","MEETS",7.1,0]
["Wake Stone Corp.","Triangle Quarry - Cary","2011-08-09","Sand, 2S - Chemistry Check","CA157",{"$f":"VLOOKUP(Table57[[#This Row],[Facility ID]],'Coord.'!$A$1:$E$818,2,FALSE)","v":"N"},{"$f":"VLOOKUP(Table57[[#This Row],[Facility ID]],'Coord.'!$A$1:$E$818,3,FALSE)","v":35.838397000000001},{"$f":"VLOOKUP(Table57[[#This Row],[Facility ID]],'Coord.'!$A$1:$E$818,4,FALSE)","v":"W"},{"$f":"VLOOKUP(Table57[[#This Row],[Facility ID]],'Coord.'!$A$1:$E$818,5,FALSE)","v":-78.767809},597278,"Gowl, Adam L",8889,7.6,0,0,"MEETS","MEETS",0,0]
["American Materials Co.","Wade Pit - Wade","2016-05-10","Sand, 2S - Chemistry Check","FA211",{"$f":"VLOOKUP(Table57[[#This Row],[Facility ID]],'Coord.'!$A$1:$E$818,2,FALSE)","v":0},{"$f":"VLOOKUP(Table57[[#This Row],[Facility ID]],'Coord.'!$A$1:$E$818,3,FALSE)","v":35.163220000000003},{"$f":"VLOOKUP(Table57[[#This Row],[Facility ID]],'Coord.'!$A$1:$E$818,4,FALSE)","v":0},{"$f":"VLOOKUP(Table57[[#This Row],[Facility ID]],'Coord.'!$A$1:$E$818,5,FALSE)","v":-78.808756000000002},805958,"Murphy, Billy J",91075,5.8,0,7.3,"MEETS","MEETS",7.3,0]
["Titan Mid-Atlantic Aggregates LLC","Waverly Sand","2019-06-26","Sand, 2S - Chemistry Check","FA589",{"$f":"VLOOKUP(Table57[[#This Row],[Facility ID]],'Coord.'!$A$1:$E$818,2,FALSE)","v":"N"},{"$f":"VLOOKUP(Table57[[#This Row],[Facility ID]],'Coord.'!$A$1:$E$818,3,FALSE)","v":36.935167},{"$f":"VLOOKUP(Table57[[#This Row],[Facility ID]],'Coord.'!$A$1:$E$818,4,FALSE)","v":"W"},{"$f":"VLOOKUP(Table57[[#This Row],[Facility ID]],'Coord.'!$A$1:$E$818,5,FALSE)","v":-77.190321999999995},970946,"Thomas, Grady Q",43060,5.0199999999999996,"<29","<15.327","MEETS","MEETS",15.327,29]
["Weeks Sand Company","Weeks Sand #3","2016-03-08","Sand, 2S - Chemistry Check","FA368",{"$f":"VLOOKUP(Table57[[#This Row],[Facility ID]],'Coord.'!$A$1:$E$818,2,FALSE)","v":"N"},{"$f":"VLOOKUP(Table57[[#This Row],[Facility ID]],'Coord.'!$A$1:$E$818,3,FALSE)","v":35.296216999999999},{"$f":"VLOOKUP(Table57[[#This Row],[Facility ID]],'Coord.'!$A$1:$E$818,4,FALSE)","v":"W"},{"$f":"VLOOKUP(Table57[[#This Row],[Facility ID]],'Coord.'!$A$1:$E$818,5,FALSE)","v":-79.149028000000001},796682,"Murphy, Billy J",62344,5.2,0,5.0999999999999996,"MEETS","MEETS",5.0999999999999996,0]
["American Materials Co.","Bailey Mine - Linden","2020-07-08","Screenings - Chemistry Check","FA483",{"$f":"VLOOKUP(Table57[[#This Row],[Facility ID]],'Coord.'!$A$1:$E$818,2,FALSE)","v":"N"},{"$f":"VLOOKUP(Table57[[#This Row],[Facility ID]],'Coord.'!$A$1:$E$818,3,FALSE)","v":35.207301999999999},{"$f":"VLOOKUP(Table57[[#This Row],[Facility ID]],'Coord.'!$A$1:$E$818,4,FALSE)","v":"W"},{"$f":"VLOOKUP(Table57[[#This Row],[Facility ID]],'Coord.'!$A$1:$E$818,5,FALSE)","v":-78.764446000000007},1013296,"Gilliam, Christopher",68034,5.43,"<30","<9.701","MEETS","MEETS",9.7010000000000005,30]
["American Materials Co.","Bailey Mine - Linden","2020-07-08","Screenings - Chemistry Check","FA483",{"$f":"VLOOKUP(Table57[[#This Row],[Facility ID]],'Coord.'!$A$1:$E$818,2,FALSE)","v":"N"},{"$f":"VLOOKUP(Table57[[#This Row],[Facility ID]],'Coord.'!$A$1:$E$818,3,FALSE)","v":35.207301999999999},{"$f":"VLOOKUP(Table57[[#This Row],[Facility ID]],'Coord.'!$A$1:$E$818,4,FALSE)","v":"W"},{"$f":"VLOOKUP(Table57[[#This Row],[Facility ID]],'Coord.'!$A$1:$E$818,5,FALSE)","v":-78.764446000000007},1013293,"Gilliam, Christopher",70035,5.61,"<30","<9.424","MEETS","MEETS",9.4239999999999995,30]
["Martin Marietta","Benson Quarry - Benson","2016-03-16","Screenings - Chemistry Check","CA176",{"$f":"VLOOKUP(Table57[[#This Row],[Facility ID]],'Coord.'!$A$1:$E$818,2,FALSE)","v":"N"},{"$f":"VLOOKUP(Table57[[#This Row],[Facility ID]],'Coord.'!$A$1:$E$818,3,FALSE)","v":35.422584999999998},{"$f":"VLOOKUP(Table57[[#This Row],[Facility ID]],'Coord.'!$A$1:$E$818,4,FALSE)","v":"W"},{"$f":"VLOOKUP(Table57[[#This Row],[Facility ID]],'Coord.'!$A$1:$E$818,5,FALSE)","v":-78.501491999999999},798245,"Raines, James R",10971,8,0,8.1,"MEETS","MEETS",8.1,0]
["Vulcan Materials Co.","Blacksburg Quarry - Blacksburg, SC","2019-07-30","Screenings - Chemistry Check","FA550",{"$f":"VLOOKUP(Table57[[#This Row],[Facility ID]],'Coord.'!$A$1:$E$818,2,FALSE)","v":"N"},{"$f":"VLOOKUP(Table57[[#This Row],[Facility ID]],'Coord.'!$A$1:$E$818,3,FALSE)","v":35.151105999999999},{"$f":"VLOOKUP(Table57[[#This Row],[Facility ID]],'Coord.'!$A$1:$E$818,4,FALSE)","v":"W"},{"$f":"VLOOKUP(Table57[[#This Row],[Facility ID]],'Coord.'!$A$1:$E$818,5,FALSE)","v":-81.435475999999994},975114,"Gosnell, Jimmy L",8724,9.35,"<29","<75.653","DOES NOT MEET","MEETS",75.653000000000006,29]
["Martin Marietta","Burlington Quarry - Burlington","2019-05-31","Screenings - Chemistry Check","FA497",{"$f":"VLOOKUP(Table57[[#This Row],[Facility ID]],'Coord.'!$A$1:$E$818,2,FALSE)","v":"N"},{"$f":"VLOOKUP(Table57[[#This Row],[Facility ID]],'Coord.'!$A$1:$E$818,3,FALSE)","v":36.054313},{"$f":"VLOOKUP(Table57[[#This Row],[Facility ID]],'Coord.'!$A$1:$E$818,4,FALSE)","v":"W"},{"$f":"VLOOKUP(Table57[[#This Row],[Facility ID]],'Coord.'!$A$1:$E$818,5,FALSE)","v":-79.509247000000002},966240,"Waller, John M",7640,8.83,"<30","<86.387","MEETS","MEETS",86.387,30]
["Martin Marietta","Central Rock Quarry - Greensboro","2019-06-04","Screenings - Chemistry Check","FA496",{"$f":"VLOOKUP(Table57[[#This Row],[Facility ID]],'Coord.'!$A$1:$E$818,2,FALSE)","v":"N"},{"$f":"VLOOKUP(Table57[[#This Row],[Facility ID]],'Coord.'!$A$1:$E$818,3,FALSE)","v":36.008398},{"$f":"VLOOKUP(Table57[[#This Row],[Facility ID]],'Coord.'!$A$1:$E$818,4,FALSE)","v":"W"},{"$f":"VLOOKUP(Table57[[#This Row],[Facility ID]],'Coord.'!$A$1:$E$818,5,FALSE)","v":-79.748478000000006},966794,"Waller, John M",6334,8.65,"<30","<104.2","MEETS","MEETS",104.2,30]
["Martin Marietta","Charlotte Quarry - Charlotte","2017-06-19","Screenings - Chemistry Check","FA562",{"$f":"VLOOKUP(Table57[[#This Row],[Facility ID]],'Coord.'!$A$1:$E$818,2,FALSE)","v":"N"},{"$f":"VLOOKUP(Table57[[#This Row],[Facility ID]],'Coord.'!$A$1:$E$818,3,FALSE)","v":35.295997},{"$f":"VLOOKUP(Table57[[#This Row],[Facility ID]],'Coord.'!$A$1:$E$818,4,FALSE)","v":"W"},{"$f":"VLOOKUP(Table57[[#This Row],[Facility ID]],'Coord.'!$A$1:$E$818,5,FALSE)","v":-80.860733999999994},864046,"Adair, Mildred (Millie) L",5144,8.4,4.7,120.3,"MEETS","MEETS",120.3,4.7]
["Hanson Aggregates Southeast, Inc.","Crabtree Quarry - Raleigh","2019-03-13","Screenings - Chemistry Check","FA568",{"$f":"VLOOKUP(Table57[[#This Row],[Facility ID]],'Coord.'!$A$1:$E$818,2,FALSE)","v":"N"},{"$f":"VLOOKUP(Table57[[#This Row],[Facility ID]],'Coord.'!$A$1:$E$818,3,FALSE)","v":35.849207},{"$f":"VLOOKUP(Table57[[#This Row],[Facility ID]],'Coord.'!$A$1:$E$818,4,FALSE)","v":"W"},{"$f":"VLOOKUP(Table57[[#This Row],[Facility ID]],'Coord.'!$A$1:$E$818,5,FALSE)","v":-78.711025000000006},954291,"Skinner, III, John L",6379,8,0,"<103.464","MEETS","MEETS",103.464,0]
["Harrison Construction Co., Inc.","Dillsboro Quarry - Dillsboro","2016-10-04","Screenings - Chemistry Check","FA573",{"$f":"VLOOKUP(Table57[[#This Row],[Facility ID]],'Coord.'!$A$1:$E$818,2,FALSE)","v":"N"},{"$f":"VLOOKUP(Table57[[#This Row],[Facility ID]],'Coord.'!$A$1:$E$818,3,FALSE)","v":35.365220999999998},{"$f":"VLOOKUP(Table57[[#This Row],[Facility ID]],'Coord.'!$A$1:$E$818,4,FALSE)","v":"W"},{"$f":"VLOOKUP(Table57[[#This Row],[Facility ID]],'Coord.'!$A$1:$E$818,5,FALSE)","v":-83.261218},828925,"Kindley, Wallace Quint",1382,7.3,0,33.5,"DOES NOT MEET","DOES NOT MEET",33.5,0]
["Vulcan Materials Co.","Elizabeth City Yard (#216) - Elizabeth City","2020-09-21","Screenings - Chemistry Check","FA539",{"$f":"VLOOKUP(Table57[[#This Row],[Facility ID]],'Coord.'!$A$1:$E$818,2,FALSE)","v":"N"},{"$f":"VLOOKUP(Table57[[#This Row],[Facility ID]],'Coord.'!$A$1:$E$818,3,FALSE)","v":36.313476000000001},{"$f":"VLOOKUP(Table57[[#This Row],[Facility ID]],'Coord.'!$A$1:$E$818,4,FALSE)","v":"W"},{"$f":"VLOOKUP(Table57[[#This Row],[Facility ID]],'Coord.'!$A$1:$E$818,5,FALSE)","v":-76.209417000000002},1021107,"Bonds, Maria M",14674,9.24,"<30","<75.334",{"$f":"IF(ISBLANK(M130),\"N/A\",IF(AND(4.5<=$M130,$M130<=9),IF($L130>=3000,IF($S130<=100,IF($R130<=200,\"MEETS\",\"DOES NOT MEET\"),\"DOES NOT MEET\"),\"DOES NOT MEET\"),\"DOES NOT MEET\"))","v":"DOES NOT MEET"},{"$f":"IF(ISBLANK(M130), \"N/A\", IF(AND(5 <= $M130, $M130 <= 10),IF($L130>=3000,IF($S130<=100,IF($R130<=200,\"MEETS\",\"DOES NOT MEET\"),\"DOES NOT MEET\"),\"DOES NOT MEET\"),\"DOES NOT MEET\"))","v":"MEETS"}]
["Vulcan Materials Co.","Enka Quarry - Enka","2018-10-05","Screenings - Chemistry Check","FA458",{"$f":"VLOOKUP(Table57[[#This Row],[Facility ID]],'Coord.'!$A$1:$E$818,2,FALSE)","v":"N"},{"$f":"VLOOKUP(Table57[[#This Row],[Facility ID]],'Coord.'!$A$1:$E$818,3,FALSE)","v":35.548361999999997},{"$f":"VLOOKUP(Table57[[#This Row],[Facility ID]],'Coord.'!$A$1:$E$818,4,FALSE)","v":"W"},{"$f":"VLOOKUP(Table57[[#This Row],[Facility ID]],'Coord.'!$A$1:$E$818,5,FALSE)","v":-82.651510000000002},933928,"Rhymer, Robert C",493,4,0,">1200","DOES NOT MEET","DOES NOT MEET",{"$f":"IF(LEFT(O131, 1)=\"<\", VALUE(RIGHT(O131,LEN(O131)-1)), O131)","v":">1200"},{"$f":"IF(LEFT(N131, 1)=\"<\", VALUE(RIGHT(N131,LEN(N131)-1)), N131)","v":0}]
["Martin Marietta","Fountain Quarry - Fountain","2020-09-25","Screenings - Chemistry Check","FA572",{"$f":"VLOOKUP(Table57[[#This Row],[Facility ID]],'Coord.'!$A$1:$E$818,2,FALSE)","v":"N"},{"$f":"VLOOKUP(Table57[[#This Row],[Facility ID]],'Coord.'!$A$1:$E$818,3,FALSE)","v":35.671942999999999},{"$f":"VLOOKUP(Table57[[#This Row],[Facility ID]],'Coord.'!$A$1:$E$818,4,FALSE)","v":"W"},{"$f":"VLOOKUP(Table57[[#This Row],[Facility ID]],'Coord.'!$A$1:$E$818,5,FALSE)","v":-77.626081999999997},1021242,"Cobb, James R",11339,9.1999999999999993,"<30","<98.758","DOES NOT MEET","MEETS",98.757999999999996,30]
["Martin Marietta","Garner Quarry - Garner","2019-01-29","Screenings - Chemistry Check","FA382",{"$f":"VLOOKUP(Table57[[#This Row],[Facility ID]],'Coord.'!$A$1:$E$818,2,FALSE)","v":"N"},{"$f":"VLOOKUP(Table57[[#This Row],[Facility ID]],'Coord.'!$A$1:$E$818,3,FALSE)","v":35.702160999999997},{"$f":"VLOOKUP(Table57[[#This Row],[Facility ID]],'Coord.'!$A$1:$E$818,4,FALSE)","v":"W"},{"$f":"VLOOKUP(Table57[[#This Row],[Facility ID]],'Coord.'!$A$1:$E$818,5,FALSE)","v":-78.577136999999993},947430,"Skinner, III, John L",15190,9.1,0,"<43.45","DOES NOT MEET","MEETS",43.45,0]
["SC Rock","Goretown Mine -- Longs, SC","2016-02-03","Screenings - Chemistry Check","FA344",{"$f":"VLOOKUP(Table57[[#This Row],[Facility ID]],'Coord.'!$A$1:$E$818,2,FALSE)","v":"N"},{"$f":"VLOOKUP(Table57[[#This Row],[Facility ID]],'Coord.'!$A$1:$E$818,3,FALSE)","v":34.014183000000003},{"$f":"VLOOKUP(Table57[[#This Row],[Facility ID]],'Coord.'!$A$1:$E$818,4,FALSE)","v":"W"},{"$f":"VLOOKUP(Table57[[#This Row],[Facility ID]],'Coord.'!$A$1:$E$818,5,FALSE)","v":-78.783805999999998},792514,"Walker, Steven E",6510,8.1999999999999993,0,37.9,"MEETS","MEETS",37.9,0]
["Hedrick Industries","Grove Stone Quarry - Black Mountain","2016-04-08","Screenings - Chemistry Check","FA400",{"$f":"VLOOKUP(Table57[[#This Row],[Facility ID]],'Coord.'!$A$1:$E$818,2,FALSE)","v":"N"},{"$f":"VLOOKUP(Table57[[#This Row],[Facility ID]],'Coord.'!$A$1:$E$818,3,FALSE)","v":35.610199999999999},{"$f":"VLOOKUP(Table57[[#This Row],[Facility ID]],'Coord.'!$A$1:$E$818,4,FALSE)","v":"W"},{"$f":"VLOOKUP(Table57[[#This Row],[Facility ID]],'Coord.'!$A$1:$E$818,5,FALSE)","v":-82.364768999999995},801536,"Rhymer, Robert C",8157,7.5,0,38.799999999999997,"MEETS","MEETS",38.799999999999997,0]
["Vulcan Materials Co.","Havre De Grace Quarry - Havre De Grace, MD","2019-08-26","Screenings - Chemistry Check","FA584",{"$f":"VLOOKUP(Table57[[#This Row],[Facility ID]],'Coord.'!$A$1:$E$818,2,FALSE)","v":"N"},{"$f":"VLOOKUP(Table57[[#This Row],[Facility ID]],'Coord.'!$A$1:$E$818,3,FALSE)","v":39.570875000000001},{"$f":"VLOOKUP(Table57[[#This Row],[Facility ID]],'Coord.'!$A$1:$E$818,4,FALSE)","v":"W"},{"$f":"VLOOKUP(Table57[[#This Row],[Facility ID]],'Coord.'!$A$1:$E$818,5,FALSE)","v":-76.105770000000007},980141,"Bonds, Maria M",3264,8.17,"<29","<202.206","DOES NOT MEET","DOES NOT MEET",202.20599999999999,29]
["Harrison Construction Co., Inc.","Hayesville Quarry - Hayesville","2016-07-15","Screenings - Chemistry Check","FA542",{"$f":"VLOOKUP(Table57[[#This Row],[Facility ID]],'Coord.'!$A$1:$E$818,2,FALSE)","v":"N"},{"$f":"VLOOKUP(Table57[[#This Row],[Facility ID]],'Coord.'!$A$1:$E$818,3,FALSE)","v":34.991819999999997},{"$f":"VLOOKUP(Table57[[#This Row],[Facility ID]],'Coord.'!$A$1:$E$818,4,FALSE)","v":"W"},{"$f":"VLOOKUP(Table57[[#This Row],[Facility ID]],'Coord.'!$A$1:$E$818,5,FALSE)","v":-83.848622000000006},816297,"Ledford, Brandon S",2440,7.8,2.1,144.69999999999999,"DOES NOT MEET","DOES NOT MEET",144.69999999999999,2.1]
["Rogers Group, Inc.","Henrietta Quarry - Mooresboro","2016-02-19","Screenings - Chemistry Check","CA369",{"$f":"VLOOKUP(Table57[[#This Row],[Facility ID]],'Coord.'!$A$1:$E$818,2,FALSE)","v":"N"},{"$f":"VLOOKUP(Table57[[#This Row],[Facility ID]],'Coord.'!$A$1:$E$818,3,FALSE)","v":35.239412999999999},{"$f":"VLOOKUP(Table57[[#This Row],[Facility ID]],'Coord.'!$A$1:$E$818,4,FALSE)","v":"W"},{"$f":"VLOOKUP(Table57[[#This Row],[Facility ID]],'Coord.'!$A$1:$E$818,5,FALSE)","v":-81.814165000000003},794436,"Rhymer, Robert C",7663,8,5.4,24.7,"MEETS","MEETS",24.7,5.4]
["Martin Marietta","Hickory Quarry - Hickory","2019-07-08","Screenings - Chemistry Check","FA541",{"$f":"VLOOKUP(Table57[[#This Row],[Facility ID]],'Coord.'!$A$1:$E$818,2,FALSE)","v":"N"},{"$f":"VLOOKUP(Table57[[#This Row],[Facility ID]],'Coord.'!$A$1:$E$818,3,FALSE)","v":35.717028999999997},{"$f":"VLOOKUP(Table57[[#This Row],[Facility ID]],'Coord.'!$A$1:$E$818,4,FALSE)","v":"W"},{"$f":"VLOOKUP(Table57[[#This Row],[Facility ID]],'Coord.'!$A$1:$E$818,5,FALSE)","v":-81.301833999999999},971767,"Gosnell, Jimmy L",18600,9.0500000000000007,"<29","<35.484","DOES NOT MEET","MEETS",35.484000000000002,29]
["Hanson Aggregates Southeast, Inc.","Holly Springs Quarry","2019-03-29","Screenings - Chemistry Check","FA513",{"$f":"VLOOKUP(Table57[[#This Row],[Facility ID]],'Coord.'!$A$1:$E$818,2,FALSE)","v":"N"},{"$f":"VLOOKUP(Table57[[#This Row],[Facility ID]],'Coord.'!$A$1:$E$818,3,FALSE)","v":35.603318000000002},{"$f":"VLOOKUP(Table57[[#This Row],[Facility ID]],'Coord.'!$A$1:$E$818,4,FALSE)","v":"W"},{"$f":"VLOOKUP(Table57[[#This Row],[Facility ID]],'Coord.'!$A$1:$E$818,5,FALSE)","v":-78.883706000000004},956970,"Skinner, III, John L",8079,8.8000000000000007,"<30","<81.693","MEETS","MEETS",81.692999999999998,30]
["Vulcan Materials Co.","Jack Quarry - Petersburg, VA","2019-08-26","Screenings - Chemistry Check","FA549",{"$f":"VLOOKUP(Table57[[#This Row],[Facility ID]],'Coord.'!$A$1:$E$818,2,FALSE)","v":"N"},{"$f":"VLOOKUP(Table57[[#This Row],[Facility ID]],'Coord.'!$A$1:$E$818,3,FALSE)","v":37.197592999999998},{"$f":"VLOOKUP(Table57[[#This Row],[Facility ID]],'Coord.'!$A$1:$E$818,4,FALSE)","v":"W"},{"$f":"VLOOKUP(Table57[[#This Row],[Facility ID]],'Coord.'!$A$1:$E$818,5,FALSE)","v":-77.504630000000006},980162,"Bonds, Maria M",6465,9.1300000000000008,"<29","<102.088","DOES NOT MEET","MEETS",102.08799999999999,29]
["Hanson Aggregates Southeast, Inc.","Jefferson Quarry - Jefferson, SC","2019-09-13","Screenings - Chemistry Check","FA587",{"$f":"VLOOKUP(Table57[[#This Row],[Facility ID]],'Coord.'!$A$1:$E$818,2,FALSE)","v":"N"},{"$f":"VLOOKUP(Table57[[#This Row],[Facility ID]],'Coord.'!$A$1:$E$818,3,FALSE)","v":34.694555000000001},{"$f":"VLOOKUP(Table57[[#This Row],[Facility ID]],'Coord.'!$A$1:$E$818,4,FALSE)","v":"W"},{"$f":"VLOOKUP(Table57[[#This Row],[Facility ID]],'Coord.'!$A$1:$E$818,5,FALSE)","v":-80.444868999999997},982920,"Jordan, Daniel H",16120,8.4700000000000006,"<32","<40.943","MEETS","MEETS",40.942999999999998,32]
["Martin Marietta","Kings Mountain Quarry - Kings Mountain","2019-07-01","Screenings - Chemistry Check","FA414",{"$f":"VLOOKUP(Table57[[#This Row],[Facility ID]],'Coord.'!$A$1:$E$818,2,FALSE)","v":"N"},{"$f":"VLOOKUP(Table57[[#This Row],[Facility ID]],'Coord.'!$A$1:$E$818,3,FALSE)","v":35.225721},{"$f":"VLOOKUP(Table57[[#This Row],[Facility ID]],'Coord.'!$A$1:$E$818,4,FALSE)","v":"W"},{"$f":"VLOOKUP(Table57[[#This Row],[Facility ID]],'Coord.'!$A$1:$E$818,5,FALSE)","v":-81.339361999999994},970681,"Gosnell, Jimmy L",1946,7.96,"<29","<339.157","DOES NOT MEET","DOES NOT MEET",339.15699999999998,29]
["Carolina Sunrock LLC","Kittrell Quarry - Kittrell","2016-02-04","Screenings - Chemistry Check","CA304",{"$f":"VLOOKUP(Table57[[#This Row],[Facility ID]],'Coord.'!$A$1:$E$818,2,FALSE)","v":"N"},{"$f":"VLOOKUP(Table57[[#This Row],[Facility ID]],'Coord.'!$A$1:$E$818,3,FALSE)","v":36.169713000000002},{"$f":"VLOOKUP(Table57[[#This Row],[Facility ID]],'Coord.'!$A$1:$E$818,4,FALSE)","v":"W"},{"$f":"VLOOKUP(Table57[[#This Row],[Facility ID]],'Coord.'!$A$1:$E$818,5,FALSE)","v":-78.444863999999995},792563,"Skinner, III, John L",9872,7.9,5,67.7,"MEETS","MEETS",67.7,5]
["Vulcan Materials Co.","Kitty Hawk Sales Yard","2020-09-21","Screenings - Chemistry Check","FA338",{"$f":"VLOOKUP(Table57[[#This Row],[Facility ID]],'Coord.'!$A$1:$E$818,2,FALSE)","v":"N"},{"$f":"VLOOKUP(Table57[[#This Row],[Facility ID]],'Coord.'!$A$1:$E$818,3,FALSE)","v":36.054642999999999},{"$f":"VLOOKUP(Table57[[#This Row],[Facility ID]],'Coord.'!$A$1:$E$818,4,FALSE)","v":"W"},{"$f":"VLOOKUP(Table57[[#This Row],[Facility ID]],'Coord.'!$A$1:$E$818,5,FALSE)","v":-75.720911999999998},1021097,"Bonds, Maria M",17676,8.74,"<30","<59.621","MEETS","MEETS"]
["Martin Marietta","Lemon Springs - Sanford","2019-08-16","Screenings - Chemistry Check","FA518",{"$f":"VLOOKUP(Table57[[#This Row],[Facility ID]],'Coord.'!$A$1:$E$818,2,FALSE)","v":"N"},{"$f":"VLOOKUP(Table57[[#This Row],[Facility ID]],'Coord.'!$A$1:$E$818,3,FALSE)","v":35.409128000000003},{"$f":"VLOOKUP(Table57[[#This Row],[Facility ID]],'Coord.'!$A$1:$E$818,4,FALSE)","v":"W"},{"$f":"VLOOKUP(Table57[[#This Row],[Facility ID]],'Coord.'!$A$1:$E$818,5,FALSE)","v":-79.211861999999996},978240,"Jackson, Brandon M",9415,9.15,"<29","<70.10","DOES NOT MEET","MEETS",{"$f":"IF(LEFT(O146, 1)=\"<\", VALUE(RIGHT(O146,LEN(O146)-1)), O146)","v":70.099999999999994},{"$f":"IF(LEFT(N146, 1)=\"<\", VALUE(RIGHT(N146,LEN(N146)-1)), N146)","v":29}]
["McCrary Stone","Low Gap Quarry - Burnsville","2019-03-05","Screenings - Chemistry Check","FA540",{"$f":"VLOOKUP(Table57[[#This Row],[Facility ID]],'Coord.'!$A$1:$E$818,2,FALSE)","v":"N"},{"$f":"VLOOKUP(Table57[[#This Row],[Facility ID]],'Coord.'!$A$1:$E$818,3,FALSE)","v":35.867697},{"$f":"VLOOKUP(Table57[[#This Row],[Facility ID]],'Coord.'!$A$1:$E$818,4,FALSE)","v":"W"},{"$f":"VLOOKUP(Table57[[#This Row],[Facility ID]],'Coord.'!$A$1:$E$818,5,FALSE)","v":-82.298516000000006},952987,"Kindley, Wallace Quint",1371,3.1,"<30","<481.4","DOES NOT MEET","DOES NOT MEET",481.4,30]
["Martin Marietta","Mallard Creek Quarry - Charlotte","2017-11-07","Screenings - Chemistry Check","FA423",{"$f":"VLOOKUP(Table57[[#This Row],[Facility ID]],'Coord.'!$A$1:$E$818,2,FALSE)","v":"N"},{"$f":"VLOOKUP(Table57[[#This Row],[Facility ID]],'Coord.'!$A$1:$E$818,3,FALSE)","v":35.318081999999997},{"$f":"VLOOKUP(Table57[[#This Row],[Facility ID]],'Coord.'!$A$1:$E$818,4,FALSE)","v":"W"},{"$f":"VLOOKUP(Table57[[#This Row],[Facility ID]],'Coord.'!$A$1:$E$818,5,FALSE)","v":-80.728077999999996},885615,"Pegues, Jr., Henderson",11131,9,3.6,55.7,"MEETS","MEETS",55.7,3.6]
["McCrary Stone","Marshall Quarry - Marshall","2019-08-12","Screenings - Chemistry Check","FA557",{"$f":"VLOOKUP(Table57[[#This Row],[Facility ID]],'Coord.'!$A$1:$E$818,2,FALSE)","v":"N"},{"$f":"VLOOKUP(Table57[[#This Row],[Facility ID]],'Coord.'!$A$1:$E$818,3,FALSE)","v":35.793067000000001},{"$f":"VLOOKUP(Table57[[#This Row],[Facility ID]],'Coord.'!$A$1:$E$818,4,FALSE)","v":"W"},{"$f":"VLOOKUP(Table57[[#This Row],[Facility ID]],'Coord.'!$A$1:$E$818,5,FALSE)","v":-82.654432},978217,"Kindley, Wallace Quint",6053,9.07,"<29","<109.0","DOES NOT MEET","MEETS",109,29]
["Covia Holdings Corporation","Marston Facility - Marston","2019-08-16","Screenings - Chemistry Check","FA617",{"$f":"VLOOKUP(Table57[[#This Row],[Facility ID]],'Coord.'!$A$1:$E$818,2,FALSE)","v":"N"},{"$f":"VLOOKUP(Table57[[#This Row],[Facility ID]],'Coord.'!$A$1:$E$818,3,FALSE)","v":34.955119000000003},{"$f":"VLOOKUP(Table57[[#This Row],[Facility ID]],'Coord.'!$A$1:$E$818,4,FALSE)","v":"W"},{"$f":"VLOOKUP(Table57[[#This Row],[Facility ID]],'Coord.'!$A$1:$E$818,5,FALSE)","v":-79.604387000000003},978801,"Jordan, Daniel H",91790,6.91,"<29","<7.1903","MEETS","MEETS",7.1902999999999997,29]
["Thompson Contractors","Miller Creek Quarry - Rutherfordton","2019-09-27","Screenings - Chemistry Check","FA585",{"$f":"VLOOKUP(Table57[[#This Row],[Facility ID]],'Coord.'!$A$1:$E$818,2,FALSE)","v":"N"},{"$f":"VLOOKUP(Table57[[#This Row],[Facility ID]],'Coord.'!$A$1:$E$818,3,FALSE)","v":35.360681999999997},{"$f":"VLOOKUP(Table57[[#This Row],[Facility ID]],'Coord.'!$A$1:$E$818,4,FALSE)","v":"W"},{"$f":"VLOOKUP(Table57[[#This Row],[Facility ID]],'Coord.'!$A$1:$E$818,5,FALSE)","v":-82.005069000000006},985275,"Norton, Stephen S",9480,8.84,"<30","<69.620","MEETS","MEETS",69.62,30]
["Hanson Aggregates Southeast, Inc.","Morehead City Sales Yard","2017-09-14","Screenings - Chemistry Check","FA570",{"$f":"VLOOKUP(Table57[[#This Row],[Facility ID]],'Coord.'!$A$1:$E$818,2,FALSE)","v":"N"},{"$f":"VLOOKUP(Table57[[#This Row],[Facility ID]],'Coord.'!$A$1:$E$818,3,FALSE)","v":34.741937},{"$f":"VLOOKUP(Table57[[#This Row],[Facility ID]],'Coord.'!$A$1:$E$818,4,FALSE)","v":"W"},{"$f":"VLOOKUP(Table57[[#This Row],[Facility ID]],'Coord.'!$A$1:$E$818,5,FALSE)","v":-76.802223999999995},876864,"Bartlett, Jr., Charles T",5669,8.8000000000000007,0,86.2,"MEETS","MEETS",86.2,0]
["Vulcan Materials Co.","Morganton Quarry - Morganton","2016-12-06","Screenings - Chemistry Check","FA85",{"$f":"VLOOKUP(Table57[[#This Row],[Facility ID]],'Coord.'!$A$1:$E$818,2,FALSE)","v":"N"},{"$f":"VLOOKUP(Table57[[#This Row],[Facility ID]],'Coord.'!$A$1:$E$818,3,FALSE)","v":35.768222000000002},{"$f":"VLOOKUP(Table57[[#This Row],[Facility ID]],'Coord.'!$A$1:$E$818,4,FALSE)","v":"W"},{"$f":"VLOOKUP(Table57[[#This Row],[Facility ID]],'Coord.'!$A$1:$E$818,5,FALSE)","v":-81.661834999999996},838536,"Ausley, Jeff A",7402,7.7,0,26.3,"MEETS","MEETS",26.3,0]
["Hedrick Industries","North Buncombe Quarry - Asheville","2019-04-29","Screenings - Chemistry Check","FA126",{"$f":"VLOOKUP(Table57[[#This Row],[Facility ID]],'Coord.'!$A$1:$E$818,2,FALSE)","v":"N"},{"$f":"VLOOKUP(Table57[[#This Row],[Facility ID]],'Coord.'!$A$1:$E$818,3,FALSE)","v":35.681038999999998},{"$f":"VLOOKUP(Table57[[#This Row],[Facility ID]],'Coord.'!$A$1:$E$818,4,FALSE)","v":"W"},{"$f":"VLOOKUP(Table57[[#This Row],[Facility ID]],'Coord.'!$A$1:$E$818,5,FALSE)","v":-82.600757999999999},961055,"Kindley, Wallace Quint",767,3.6,"<30",">800<1200","DOES NOT MEET","DOES NOT MEET",">800<1200",30]
["Vulcan Materials Co.","Penrose Quarry - Pisgah Forest","2017-03-07","Screenings - Chemistry Check","FA229",{"$f":"VLOOKUP(Table57[[#This Row],[Facility ID]],'Coord.'!$A$1:$E$818,2,FALSE)","v":"N"},{"$f":"VLOOKUP(Table57[[#This Row],[Facility ID]],'Coord.'!$A$1:$E$818,3,FALSE)","v":35.275877999999999},{"$f":"VLOOKUP(Table57[[#This Row],[Facility ID]],'Coord.'!$A$1:$E$818,4,FALSE)","v":"W"},{"$f":"VLOOKUP(Table57[[#This Row],[Facility ID]],'Coord.'!$A$1:$E$818,5,FALSE)","v":-82.643300999999994},848244,"Wood, Dean Michael M",16044,9.1999999999999993,0,37.4,"DOES NOT MEET","MEETS",37.4,0]
["Vulcan Materials Co.","Pineville Quarry - Charlotte","2016-10-06","Screenings - Chemistry Check","FA266",{"$f":"VLOOKUP(Table57[[#This Row],[Facility ID]],'Coord.'!$A$1:$E$818,2,FALSE)","v":"N"},{"$f":"VLOOKUP(Table57[[#This Row],[Facility ID]],'Coord.'!$A$1:$E$818,3,FALSE)","v":35.115859},{"$f":"VLOOKUP(Table57[[#This Row],[Facility ID]],'Coord.'!$A$1:$E$818,4,FALSE)","v":"W"},{"$f":"VLOOKUP(Table57[[#This Row],[Facility ID]],'Coord.'!$A$1:$E$818,5,FALSE)","v":-80.896596000000002},832586,"Adair, Mildred (Millie) L",1872,7.6,0,93.3,"DOES NOT MEET","DOES NOT MEET",93.3,0]
["Luck Stone Corporation","Pittsboro Quarry - Moncure","2018-11-30","Screenings - Chemistry Check","FA561",{"$f":"VLOOKUP(Table57[[#This Row],[Facility ID]],'Coord.'!$A$1:$E$818,2,FALSE)","v":"N"},{"$f":"VLOOKUP(Table57[[#This Row],[Facility ID]],'Coord.'!$A$1:$E$818,3,FALSE)","v":35.660559999999997},{"$f":"VLOOKUP(Table57[[#This Row],[Facility ID]],'Coord.'!$A$1:$E$818,4,FALSE)","v":"W"},{"$f":"VLOOKUP(Table57[[#This Row],[Facility ID]],'Coord.'!$A$1:$E$818,5,FALSE)","v":-79.176798000000005},941285,"Jackson, Brandon M",13310,9.4,0,"<49.59","DOES NOT MEET","MEETS",49.59,0]
["Hanson Aggregates Southeast, Inc.","Princeton Quarry","2016-03-24","Screenings - Chemistry Check","CA64",{"$f":"VLOOKUP(Table57[[#This Row],[Facility ID]],'Coord.'!$A$1:$E$818,2,FALSE)","v":"N"},{"$f":"VLOOKUP(Table57[[#This Row],[Facility ID]],'Coord.'!$A$1:$E$818,3,FALSE)","v":35.472107000000001},{"$f":"VLOOKUP(Table57[[#This Row],[Facility ID]],'Coord.'!$A$1:$E$818,4,FALSE)","v":"W"},{"$f":"VLOOKUP(Table57[[#This Row],[Facility ID]],'Coord.'!$A$1:$E$818,5,FALSE)","v":-78.137972000000005},799118,"Raines, James R",6472,8.4,10,14.1,"MEETS","MEETS",14.1,10]
["Hanson Aggregates Southeast, Inc.","Raleigh Quarry - Wake Forest","2016-02-12","Screenings - Chemistry Check","CA67",{"$f":"VLOOKUP(Table57[[#This Row],[Facility ID]],'Coord.'!$A$1:$E$818,2,FALSE)","v":"N"},{"$f":"VLOOKUP(Table57[[#This Row],[Facility ID]],'Coord.'!$A$1:$E$818,3,FALSE)","v":35.931106999999997},{"$f":"VLOOKUP(Table57[[#This Row],[Facility ID]],'Coord.'!$A$1:$E$818,4,FALSE)","v":"W"},{"$f":"VLOOKUP(Table57[[#This Row],[Facility ID]],'Coord.'!$A$1:$E$818,5,FALSE)","v":-78.543345000000002},793722,"Skinner, III, John L",17053,7.4,0,0,"MEETS","MEETS",0,0]
["Martin Marietta","Raleigh-Durham Quarry - Raleigh","2019-01-18","Screenings - Chemistry Check","FA578",{"$f":"VLOOKUP(Table57[[#This Row],[Facility ID]],'Coord.'!$A$1:$E$818,2,FALSE)","v":"N"},{"$f":"VLOOKUP(Table57[[#This Row],[Facility ID]],'Coord.'!$A$1:$E$818,3,FALSE)","v":35.894326999999997},{"$f":"VLOOKUP(Table57[[#This Row],[Facility ID]],'Coord.'!$A$1:$E$818,4,FALSE)","v":"W"},{"$f":"VLOOKUP(Table57[[#This Row],[Facility ID]],'Coord.'!$A$1:$E$818,5,FALSE)","v":-78.749027999999996},946462,"Skinner, III, John L",12420,9.4,0,"<53.140","DOES NOT MEET","MEETS",53.14,0]
["Martin Marietta","Reidsville Quarry - Reidsville","2016-02-09","Screenings - Chemistry Check","CA52",{"$f":"VLOOKUP(Table57[[#This Row],[Facility ID]],'Coord.'!$A$1:$E$818,2,FALSE)","v":0},{"$f":"VLOOKUP(Table57[[#This Row],[Facility ID]],'Coord.'!$A$1:$E$818,3,FALSE)","v":36.371012},{"$f":"VLOOKUP(Table57[[#This Row],[Facility ID]],'Coord.'!$A$1:$E$818,4,FALSE)","v":0},{"$f":"VLOOKUP(Table57[[#This Row],[Facility ID]],'Coord.'!$A$1:$E$818,5,FALSE)","v":-79.726775000000004},793251,"Loshinskiy, Roman",16518,9,5,18.899999999999999,"MEETS","MEETS",18.899999999999999,5]
["Vulcan Materials Co.","Rockingham Quarry - Rockingham","2019-08-13","Screenings - Chemistry Check","FA374",{"$f":"VLOOKUP(Table57[[#This Row],[Facility ID]],'Coord.'!$A$1:$E$818,2,FALSE)","v":"N"},{"$f":"VLOOKUP(Table57[[#This Row],[Facility ID]],'Coord.'!$A$1:$E$818,3,FALSE)","v":34.938709000000003},{"$f":"VLOOKUP(Table57[[#This Row],[Facility ID]],'Coord.'!$A$1:$E$818,4,FALSE)","v":"W"},{"$f":"VLOOKUP(Table57[[#This Row],[Facility ID]],'Coord.'!$A$1:$E$818,5,FALSE)","v":-79.823207999999994},977732,"Jordan, Daniel H",5849,8.7200000000000006,"<29","<112.8",{"$f":"IF(ISBLANK(M162),\"N/A\",IF(AND(4.5<=$M162,$M162<=9),IF($L162>=3000,IF($S162<=100,IF($R162<=200,\"MEETS\",\"DOES NOT MEET\"),\"DOES NOT MEET\"),\"DOES NOT MEET\"),\"DOES NOT MEET\"))","v":"MEETS"},{"$f":"IF(ISBLANK(M162), \"N/A\", IF(AND(5 <= $M162, $M162 <= 10),IF($L162>=3000,IF($S162<=100,IF($R162<=200,\"MEETS\",\"DOES NOT MEET\"),\"DOES NOT MEET\"),\"DOES NOT MEET\"),\"DOES NOT MEET\"))","v":"MEETS"},112.8,29]
["Vulcan Materials Co.","Skippers Quarry - Skippers, VA","2020-02-05","Screenings - Chemistry Check","FA531",{"$f":"VLOOKUP(Table57[[#This Row],[Facility ID]],'Coord.'!$A$1:$E$818,2,FALSE)","v":"N"},{"$f":"VLOOKUP(Table57[[#This Row],[Facility ID]],'Coord.'!$A$1:$E$818,3,FALSE)","v":36.607691000000003},{"$f":"VLOOKUP(Table57[[#This Row],[Facility ID]],'Coord.'!$A$1:$E$818,4,FALSE)","v":"W"},{"$f":"VLOOKUP(Table57[[#This Row],[Facility ID]],'Coord.'!$A$1:$E$818,5,FALSE)","v":-77.582035000000005},998861,"Thomas, Grady Q",6484,8.8000000000000007,"<30","<101.789","MEETS","MEETS",101.789,30]
["Hedrick Industries","South McDowell Quarry - Marion","2017-01-13","Screenings - Chemistry Check","FA415",{"$f":"VLOOKUP(Table57[[#This Row],[Facility ID]],'Coord.'!$A$1:$E$818,2,FALSE)","v":"N"},{"$f":"VLOOKUP(Table57[[#This Row],[Facility ID]],'Coord.'!$A$1:$E$818,3,FALSE)","v":35.375700000000002},{"$f":"VLOOKUP(Table57[[#This Row],[Facility ID]],'Coord.'!$A$1:$E$818,4,FALSE)","v":"W"},{"$f":"VLOOKUP(Table57[[#This Row],[Facility ID]],'Coord.'!$A$1:$E$818,5,FALSE)","v":-81.574100000000001},841899,"Rhymer, Robert C",10930,7.5,0,55.9,"MEETS","MEETS",55.9,0]
["Salem Stone Corp.","Southside Materials - S. Boston Quarry (VA)","2019-05-21","Screenings - Chemistry Check","FA197",{"$f":"VLOOKUP(Table57[[#This Row],[Facility ID]],'Coord.'!$A$1:$E$818,2,FALSE)","v":"N"},{"$f":"VLOOKUP(Table57[[#This Row],[Facility ID]],'Coord.'!$A$1:$E$818,3,FALSE)","v":36.727431000000003},{"$f":"VLOOKUP(Table57[[#This Row],[Facility ID]],'Coord.'!$A$1:$E$818,4,FALSE)","v":"W"},{"$f":"VLOOKUP(Table57[[#This Row],[Facility ID]],'Coord.'!$A$1:$E$818,5,FALSE)","v":-78.846988999999994},964761,"Westmoreland, Braxton J",7227,9,"<30","<91.324","MEETS","MEETS",91.323999999999998,30]
["Salem Stone Corp.","Southside Materials - Shelton Quarry - Pelham","2019-02-28","Screenings - Chemistry Check","FA533",{"$f":"VLOOKUP(Table57[[#This Row],[Facility ID]],'Coord.'!$A$1:$E$818,2,FALSE)","v":"N"},{"$f":"VLOOKUP(Table57[[#This Row],[Facility ID]],'Coord.'!$A$1:$E$818,3,FALSE)","v":36.534802999999997},{"$f":"VLOOKUP(Table57[[#This Row],[Facility ID]],'Coord.'!$A$1:$E$818,4,FALSE)","v":"W"},{"$f":"VLOOKUP(Table57[[#This Row],[Facility ID]],'Coord.'!$A$1:$E$818,5,FALSE)","v":-79.459612000000007},952403,"Westmoreland, Braxton J",18390,9,0,"<35.889","MEETS","MEETS",35.889000000000003,0]
["Vulcan Materials Co.","Spruce Pine Quarry - Bakersville","2019-09-16","Screenings - Chemistry Check","FA558",{"$f":"VLOOKUP(Table57[[#This Row],[Facility ID]],'Coord.'!$A$1:$E$818,2,FALSE)","v":"N"},{"$f":"VLOOKUP(Table57[[#This Row],[Facility ID]],'Coord.'!$A$1:$E$818,3,FALSE)","v":35.970222999999997},{"$f":"VLOOKUP(Table57[[#This Row],[Facility ID]],'Coord.'!$A$1:$E$818,4,FALSE)","v":"W"},{"$f":"VLOOKUP(Table57[[#This Row],[Facility ID]],'Coord.'!$A$1:$E$818,5,FALSE)","v":-82.099553},983094,"Norton, Stephen S",3326,7.47,"<32","<198.437","MEETS","MEETS",198.43700000000001,32]
["Martin Marietta","Statesville Quarry - Statesville","2019-10-09","Screenings - Chemistry Check","FA534",{"$f":"VLOOKUP(Table57[[#This Row],[Facility ID]],'Coord.'!$A$1:$E$818,2,FALSE)","v":"N"},{"$f":"VLOOKUP(Table57[[#This Row],[Facility ID]],'Coord.'!$A$1:$E$818,3,FALSE)","v":35.804439000000002},{"$f":"VLOOKUP(Table57[[#This Row],[Facility ID]],'Coord.'!$A$1:$E$818,4,FALSE)","v":"W"},{"$f":"VLOOKUP(Table57[[#This Row],[Facility ID]],'Coord.'!$A$1:$E$818,5,FALSE)","v":-80.913158999999993},987454,"Brinson, Joseph",2276,7.81,"<30","<289.982","DOES NOT MEET","DOES NOT MEET",289.98200000000003,30]
["Vulcan Materials Co.","Stokesdale Quarry - Stokesdale","2019-02-28","Screenings - Chemistry Check","FA499",{"$f":"VLOOKUP(Table57[[#This Row],[Facility ID]],'Coord.'!$A$1:$E$818,2,FALSE)","v":"N"},{"$f":"VLOOKUP(Table57[[#This Row],[Facility ID]],'Coord.'!$A$1:$E$818,3,FALSE)","v":36.23968},{"$f":"VLOOKUP(Table57[[#This Row],[Facility ID]],'Coord.'!$A$1:$E$818,4,FALSE)","v":"W"},{"$f":"VLOOKUP(Table57[[#This Row],[Facility ID]],'Coord.'!$A$1:$E$818,5,FALSE)","v":-79.933006000000006},952380,"Westmoreland, Braxton J",19350,9.1,0,"<34.109","DOES NOT MEET","MEETS",34.109000000000002,0]
["Harrison Construction Co., Inc.","Waynesville Quarry - Waynesville","2019-07-29","Screenings - Chemistry Check","FA564",{"$f":"VLOOKUP(Table57[[#This Row],[Facility ID]],'Coord.'!$A$1:$E$818,2,FALSE)","v":"N"},{"$f":"VLOOKUP(Table57[[#This Row],[Facility ID]],'Coord.'!$A$1:$E$818,3,FALSE)","v":35.440697},{"$f":"VLOOKUP(Table57[[#This Row],[Facility ID]],'Coord.'!$A$1:$E$818,4,FALSE)","v":"W"},{"$f":"VLOOKUP(Table57[[#This Row],[Facility ID]],'Coord.'!$A$1:$E$818,5,FALSE)","v":-83.007457000000002},974815,"Kindley, Wallace Quint",2712,7.95,"<32","<243.363","DOES NOT MEET","DOES NOT MEET",243.363,32]
["LBM Industries","Whitewater Falls - Sapphire","2016-05-24","Screenings - Chemistry Check","FA162",{"$f":"VLOOKUP(Table57[[#This Row],[Facility ID]],'Coord.'!$A$1:$E$818,2,FALSE)","v":"N"},{"$f":"VLOOKUP(Table57[[#This Row],[Facility ID]],'Coord.'!$A$1:$E$818,3,FALSE)","v":35.056310000000003},{"$f":"VLOOKUP(Table57[[#This Row],[Facility ID]],'Coord.'!$A$1:$E$818,4,FALSE)","v":"W"},{"$f":"VLOOKUP(Table57[[#This Row],[Facility ID]],'Coord.'!$A$1:$E$818,5,FALSE)","v":-82.582790000000003},808254,"Wood, Dean Michael M",14663,8.6,2.1,9.3000000000000007,"MEETS","MEETS",9.3000000000000007,2.1]
["Boone's Concrete Supply, LLC","Woodlawn Quarry - Marion","2019-09-23","Screenings - Chemistry Check","FA546",{"$f":"VLOOKUP(Table57[[#This Row],[Facility ID]],'Coord.'!$A$1:$E$818,2,FALSE)","v":"N"},{"$f":"VLOOKUP(Table57[[#This Row],[Facility ID]],'Coord.'!$A$1:$E$818,3,FALSE)","v":35.787350000000004},{"$f":"VLOOKUP(Table57[[#This Row],[Facility ID]],'Coord.'!$A$1:$E$818,4,FALSE)","v":"W"},{"$f":"VLOOKUP(Table57[[#This Row],[Facility ID]],'Coord.'!$A$1:$E$818,5,FALSE)","v":-82.036387000000005},984076,"Norton, Stephen S",12950,10,"<32","<50.965","DOES NOT MEET","MEETS",50.965000000000003,32]
["Martin Marietta","Charlotte Quarry - Charlotte","2019-07-10","Screenings, Washed","FA562",{"$f":"VLOOKUP(Table57[[#This Row],[Facility ID]],'Coord.'!$A$1:$E$818,2,FALSE)","v":"N"},{"$f":"VLOOKUP(Table57[[#This Row],[Facility ID]],'Coord.'!$A$1:$E$818,3,FALSE)","v":35.295997},{"$f":"VLOOKUP(Table57[[#This Row],[Facility ID]],'Coord.'!$A$1:$E$818,4,FALSE)","v":"W"},{"$f":"VLOOKUP(Table57[[#This Row],[Facility ID]],'Coord.'!$A$1:$E$818,5,FALSE)","v":-80.860733999999994},972773,"Pegues, Jr., Henderson",5792,8.36,"<29","<113.950","MEETS","MEETS",113.95,29]
["Vulcan Materials Co.","Enka Quarry - Enka","2019-09-05","Screenings, Washed","FA458",{"$f":"VLOOKUP(Table57[[#This Row],[Facility ID]],'Coord.'!$A$1:$E$818,2,FALSE)","v":"N"},{"$f":"VLOOKUP(Table57[[#This Row],[Facility ID]],'Coord.'!$A$1:$E$818,3,FALSE)","v":35.548361999999997},{"$f":"VLOOKUP(Table57[[#This Row],[Facility ID]],'Coord.'!$A$1:$E$818,4,FALSE)","v":"W"},{"$f":"VLOOKUP(Table57[[#This Row],[Facility ID]],'Coord.'!$A$1:$E$818,5,FALSE)","v":-82.651510000000002},981857,"Rhymer, Robert C",873,5.14,"<32",">400<800","DOES NOT MEET","DOES NOT MEET",">400<800",32]
["Hedrick Industries","Grove Stone Quarry - Black Mountain","2019-04-23","Screenings, Washed","FA400",{"$f":"VLOOKUP(Table57[[#This Row],[Facility ID]],'Coord.'!$A$1:$E$818,2,FALSE)","v":"N"},{"$f":"VLOOKUP(Table57[[#This Row],[Facility ID]],'Coord.'!$A$1:$E$818,3,FALSE)","v":35.610199999999999},{"$f":"VLOOKUP(Table57[[#This Row],[Facility ID]],'Coord.'!$A$1:$E$818,4,FALSE)","v":"W"},{"$f":"VLOOKUP(Table57[[#This Row],[Facility ID]],'Coord.'!$A$1:$E$818,5,FALSE)","v":-82.364768999999995},960226,"Rhymer, Robert C",10150,8.4,"<30","<65.025","MEETS","MEETS",65.025000000000006,30]
["Rogers Group, Inc.","Henrietta Quarry - Mooresboro","2019-04-30","Screenings, Washed","FA528",{"$f":"VLOOKUP(Table57[[#This Row],[Facility ID]],'Coord.'!$A$1:$E$818,2,FALSE)","v":"N"},{"$f":"VLOOKUP(Table57[[#This Row],[Facility ID]],'Coord.'!$A$1:$E$818,3,FALSE)","v":35.239448000000003},{"$f":"VLOOKUP(Table57[[#This Row],[Facility ID]],'Coord.'!$A$1:$E$818,4,FALSE)","v":"W"},{"$f":"VLOOKUP(Table57[[#This Row],[Facility ID]],'Coord.'!$A$1:$E$818,5,FALSE)","v":-81.814254000000005},961360,"Rhymer, Robert C",22130,8.6999999999999993,"<30","<29.824","MEETS","MEETS",29.824000000000002,30]
["Hanson Aggregates Southeast, Inc.","Jefferson Quarry - Jefferson, SC","2018-12-07","Screenings, Washed","FA587",{"$f":"VLOOKUP(Table57[[#This Row],[Facility ID]],'Coord.'!$A$1:$E$818,2,FALSE)","v":"N"},{"$f":"VLOOKUP(Table57[[#This Row],[Facility ID]],'Coord.'!$A$1:$E$818,3,FALSE)","v":34.694555000000001},{"$f":"VLOOKUP(Table57[[#This Row],[Facility ID]],'Coord.'!$A$1:$E$818,4,FALSE)","v":"W"},{"$f":"VLOOKUP(Table57[[#This Row],[Facility ID]],'Coord.'!$A$1:$E$818,5,FALSE)","v":-80.444868999999997},942236,"Jordan, Daniel H",17700,9.1999999999999993,0,"<37.288","DOES NOT MEET","MEETS",37.287999999999997,0]
["Georgia Stone Products","Lynches River Quarry - Jefferson, SC","2018-12-06","Screenings, Washed","FA425",{"$f":"VLOOKUP(Table57[[#This Row],[Facility ID]],'Coord.'!$A$1:$E$818,2,FALSE)","v":"N"},{"$f":"VLOOKUP(Table57[[#This Row],[Facility ID]],'Coord.'!$A$1:$E$818,3,FALSE)","v":34.730891},{"$f":"VLOOKUP(Table57[[#This Row],[Facility ID]],'Coord.'!$A$1:$E$818,4,FALSE)","v":"W"},{"$f":"VLOOKUP(Table57[[#This Row],[Facility ID]],'Coord.'!$A$1:$E$818,5,FALSE)","v":-80.452881000000005},942224,"Jordan, Daniel H",21340,9.1,0,"<30.928","DOES NOT MEET","MEETS",30.928000000000001,0]
["Wake Stone Corp.","Moncure Quarry - Moncure","2018-03-29","Screenings, Washed","FA502",{"$f":"VLOOKUP(Table57[[#This Row],[Facility ID]],'Coord.'!$A$1:$E$818,2,FALSE)","v":"N"},{"$f":"VLOOKUP(Table57[[#This Row],[Facility ID]],'Coord.'!$A$1:$E$818,3,FALSE)","v":35.618667000000002},{"$f":"VLOOKUP(Table57[[#This Row],[Facility ID]],'Coord.'!$A$1:$E$818,4,FALSE)","v":"W"},{"$f":"VLOOKUP(Table57[[#This Row],[Facility ID]],'Coord.'!$A$1:$E$818,5,FALSE)","v":-79.105463},904094,"Jackson, Brandon M",4476,7.5,0,124.3,"MEETS","MEETS",124.3,0]
["Hanson Aggregates Southeast, Inc.","Raleigh Quarry - Wake Forest","2019-01-09","Screenings, Washed","FA515",{"$f":"VLOOKUP(Table57[[#This Row],[Facility ID]],'Coord.'!$A$1:$E$818,2,FALSE)","v":"N"},{"$f":"VLOOKUP(Table57[[#This Row],[Facility ID]],'Coord.'!$A$1:$E$818,3,FALSE)","v":35.931151999999997},{"$f":"VLOOKUP(Table57[[#This Row],[Facility ID]],'Coord.'!$A$1:$E$818,4,FALSE)","v":"W"},{"$f":"VLOOKUP(Table57[[#This Row],[Facility ID]],'Coord.'!$A$1:$E$818,5,FALSE)","v":-78.543353999999994},944673,"Skinner, III, John L",15740,9.3000000000000007,0,"<41.931","DOES NOT MEET","MEETS",41.930999999999997,0]
["Hedrick Industries","South McDowell Quarry - Marion","2019-01-24","Screenings, Washed","FA415",{"$f":"VLOOKUP(Table57[[#This Row],[Facility ID]],'Coord.'!$A$1:$E$818,2,FALSE)","v":"N"},{"$f":"VLOOKUP(Table57[[#This Row],[Facility ID]],'Coord.'!$A$1:$E$818,3,FALSE)","v":35.375700000000002},{"$f":"VLOOKUP(Table57[[#This Row],[Facility ID]],'Coord.'!$A$1:$E$818,4,FALSE)","v":"W"},{"$f":"VLOOKUP(Table57[[#This Row],[Facility ID]],'Coord.'!$A$1:$E$818,5,FALSE)","v":-81.574100000000001},946851,"Rhymer, Robert C",17770,8.6999999999999993,0,"<37.141","MEETS","MEETS",37.140999999999998,0]
["Martin Marietta","Central Rock Quarry - Greensboro","2017-07-05","Select Material, Class III, Type 1","FA496",{"$f":"VLOOKUP(Table57[[#This Row],[Facility ID]],'Coord.'!$A$1:$E$818,2,FALSE)","v":"N"},{"$f":"VLOOKUP(Table57[[#This Row],[Facility ID]],'Coord.'!$A$1:$E$818,3,FALSE)","v":36.008398},{"$f":"VLOOKUP(Table57[[#This Row],[Facility ID]],'Coord.'!$A$1:$E$818,4,FALSE)","v":"W"},{"$f":"VLOOKUP(Table57[[#This Row],[Facility ID]],'Coord.'!$A$1:$E$818,5,FALSE)","v":-79.748478000000006},866376,"Cravens, Lane T",9091,7.3,4.7,62.2,"MEETS","MEETS",62.2,4.7]
["Vulcan Materials Co.","North Quarry - Winston Salem","2020-08-19","Select Material, Class III, Type 1","FA466",{"$f":"VLOOKUP(Table57[[#This Row],[Facility ID]],'Coord.'!$A$1:$E$818,2,FALSE)","v":"N"},{"$f":"VLOOKUP(Table57[[#This Row],[Facility ID]],'Coord.'!$A$1:$E$818,3,FALSE)","v":36.177826000000003},{"$f":"VLOOKUP(Table57[[#This Row],[Facility ID]],'Coord.'!$A$1:$E$818,4,FALSE)","v":"W"},{"$f":"VLOOKUP(Table57[[#This Row],[Facility ID]],'Coord.'!$A$1:$E$818,5,FALSE)","v":-80.265812999999994},1017747,"Carpenter, Gregory S",7337,8.6,"<30","<141.056","MEETS","MEETS",141.05600000000001,30]
["Vulcan Materials Co.","North Quarry - Winston Salem","2020-08-19","Select Material, Class III, Type 1","FA466",{"$f":"VLOOKUP(Table57[[#This Row],[Facility ID]],'Coord.'!$A$1:$E$818,2,FALSE)","v":"N"},{"$f":"VLOOKUP(Table57[[#This Row],[Facility ID]],'Coord.'!$A$1:$E$818,3,FALSE)","v":36.177826000000003},{"$f":"VLOOKUP(Table57[[#This Row],[Facility ID]],'Coord.'!$A$1:$E$818,4,FALSE)","v":"W"},{"$f":"VLOOKUP(Table57[[#This Row],[Facility ID]],'Coord.'!$A$1:$E$818,5,FALSE)","v":-80.265812999999994},1017749,"Carpenter, Gregory S",10005,8.6999999999999993,"<30","<117.312","MEETS","MEETS",117.312,30]
["Vulcan Materials Co.","North Quarry - Winston Salem","2020-08-19","Select Material, Class III, Type 1","FA466",{"$f":"VLOOKUP(Table57[[#This Row],[Facility ID]],'Coord.'!$A$1:$E$818,2,FALSE)","v":"N"},{"$f":"VLOOKUP(Table57[[#This Row],[Facility ID]],'Coord.'!$A$1:$E$818,3,FALSE)","v":36.177826000000003},{"$f":"VLOOKUP(Table57[[#This Row],[Facility ID]],'Coord.'!$A$1:$E$818,4,FALSE)","v":"W"},{"$f":"VLOOKUP(Table57[[#This Row],[Facility ID]],'Coord.'!$A$1:$E$818,5,FALSE)","v":-80.265812999999994},1017748,"Carpenter, Gregory S",16008,8.82,"<30","<71.467","MEETS","MEETS",71.466999999999999,30]
["American Materials Co.","Black Creek Plant - Mt. Croghan, SC","2016-03-04","Select Material, Class III, Type 3 - Chemistry Check","FA422",{"$f":"VLOOKUP(Table57[[#This Row],[Facility ID]],'Coord.'!$A$1:$E$818,2,FALSE)","v":"N"},{"$f":"VLOOKUP(Table57[[#This Row],[Facility ID]],'Coord.'!$A$1:$E$818,3,FALSE)","v":34.717706999999997},{"$f":"VLOOKUP(Table57[[#This Row],[Facility ID]],'Coord.'!$A$1:$E$818,4,FALSE)","v":"W"},{"$f":"VLOOKUP(Table57[[#This Row],[Facility ID]],'Coord.'!$A$1:$E$818,5,FALSE)","v":-80.284664000000006},797150,"Jordan, Daniel H",96618,5.5,0,5.0999999999999996,"MEETS","MEETS",5.0999999999999996,0]
["Martin Marietta","Lemon Springs - Sanford","2018-10-29","Select Material, Class III, Type 3 - Chemistry Check","FA518",{"$f":"VLOOKUP(Table57[[#This Row],[Facility ID]],'Coord.'!$A$1:$E$818,2,FALSE)","v":"N"},{"$f":"VLOOKUP(Table57[[#This Row],[Facility ID]],'Coord.'!$A$1:$E$818,3,FALSE)","v":35.409128000000003},{"$f":"VLOOKUP(Table57[[#This Row],[Facility ID]],'Coord.'!$A$1:$E$818,4,FALSE)","v":"W"},{"$f":"VLOOKUP(Table57[[#This Row],[Facility ID]],'Coord.'!$A$1:$E$818,5,FALSE)","v":-79.211861999999996},937185,"Jackson, Brandon M",10060,8.6,0,"<65.6","MEETS","MEETS",65.599999999999994,0]
["Martin Marietta","Edmund Pit - Lexington, SC","2000-07-14","Yearly Quality Check for Fine Aggregate (Strength, Soundness, etc.)","FA265",{"$f":"VLOOKUP(Table57[[#This Row],[Facility ID]],'Coord.'!$A$1:$E$818,2,FALSE)","v":"N"},{"$f":"VLOOKUP(Table57[[#This Row],[Facility ID]],'Coord.'!$A$1:$E$818,3,FALSE)","v":33.855843},{"$f":"VLOOKUP(Table57[[#This Row],[Facility ID]],'Coord.'!$A$1:$E$818,4,FALSE)","v":"W"},{"$f":"VLOOKUP(Table57[[#This Row],[Facility ID]],'Coord.'!$A$1:$E$818,5,FALSE)","v":-81.204701999999997},143321,"Keyes, Terry L",null,null,35.4,"","N/A","N/A","",35.4]
["Hedrick Industries","Grove Stone Quarry - Black Mountain","2016-12-12","Yearly Quality Check for Fine Aggregate (Strength, Soundness, etc.)","FA400",{"$f":"VLOOKUP(Table57[[#This Row],[Facility ID]],'Coord.'!$A$1:$E$818,2,FALSE)","v":"N"},{"$f":"VLOOKUP(Table57[[#This Row],[Facility ID]],'Coord.'!$A$1:$E$818,3,FALSE)","v":35.610199999999999},{"$f":"VLOOKUP(Table57[[#This Row],[Facility ID]],'Coord.'!$A$1:$E$818,4,FALSE)","v":"W"},{"$f":"VLOOKUP(Table57[[#This Row],[Facility ID]],'Coord.'!$A$1:$E$818,5,FALSE)","v":-82.364768999999995},838364,"Rhymer, Robert C",6575,7.3,0,22.2,"MEETS","MEETS",22.2,0]

{"sheet":"Latest Data Coarse Aggregate","index":1,"n_rows":299,"n_cols":22,"rows_kept":299,"cut":false,"hidden":false,"merged":[]}
["Producer Name","Facility Name","Sample Date","Material Description","Facility ID","Direction","Latitude","Direction2","Longitude","Sample ID","Sampled By","Resistivity [ohm-cm]:","pH Units:","Chloride [ppm]:","Sulfate [ppm]:","Geosynthetic Spec","Steel Spec","Coastal Plain Geosynthetic Spec","Coastal Plain Steel Spec","SO4","Cl"," Coastal Plain Aggregates"]
["Martin Marietta","Statesville Quarry - Statesville","2003-11-20","Stone for Erosion Control (#57)","CA54",{"$f":"VLOOKUP(Table16[[#This Row],[Facility ID]],'Coord.'!$A$1:$E$818,2,FALSE)","v":"N"},{"$f":"VLOOKUP(Table16[[#This Row],[Facility ID]],'Coord.'!$A$1:$E$818,3,FALSE)","v":35.804465999999998},{"$f":"VLOOKUP(Table16[[#This Row],[Facility ID]],'Coord.'!$A$1:$E$818,4,FALSE)","v":"W"},{"$f":"VLOOKUP(Table16[[#This Row],[Facility ID]],'Coord.'!$A$1:$E$818,5,FALSE)","v":-80.913083999999998},320107,"Leatherman, Barbara L",21950,6.3,26,"",{"$f":"IF(AND(4.5 <= $M2, $M2 <= 9), \"MEETS\", \"DOES NOT MEET\")","v":"MEETS"},{"$f":"IF(AND(5 <= $M2, $M2 <= 10), \"MEETS\", \"DOES NOT MEET\")","v":"MEETS"},{"$f":"IF(OR(ISBLANK(L2), NOT(ISNUMBER(MATCH($E2, Coastal,0)))), \"N/A\", IF(AND(4.5 <= $M2, $M2 <= 9),IF($L2>=5000,IF($U2<=100,IF($T2<=200,\"MEETS\",\"DOES NOT MEET\"),\"DOES NOT MEET\"),\"DOES NOT MEET\"),\"DOES NOT MEET\"))","v":"N/A"},{"$f":"IF(OR(ISBLANK(M2), NOT(ISNUMBER(MATCH($E2, Coastal, 0)))), \"N/A\", IF(AND(5 <= $M2, $M2 <= 10),IF($L2>=5000,IF($U2<=100,IF($T2<=200,\"MEETS\",\"DOES NOT MEET\"),\"DOES NOT MEET\"),\"DOES NOT MEET\"),\"DOES NOT MEET\"))","v":"N/A"},{"$f":"IF(LEFT(O2, 1)=\"<\", VALUE(RIGHT(O2,LEN(O2)-1)), O2)","v":""},{"$f":"IF(LEFT(N2, 1)=\"<\", VALUE(RIGHT(N2,LEN(N2)-1)), N2)","v":26},"CA345"]
["Radford Quarries Of Boone, Inc.","Bamboo Quarry","2019-04-26","Select Material, Class VI","CA122",{"$f":"VLOOKUP(Table16[[#This Row],[Facility ID]],'Coord.'!$A$1:$E$818,2,FALSE)","v":"N"},{"$f":"VLOOKUP(Table16[[#This Row],[Facility ID]],'Coord.'!$A$1:$E$818,3,FALSE)","v":36.215747},{"$f":"VLOOKUP(Table16[[#This Row],[Facility ID]],'Coord.'!$A$1:$E$818,4,FALSE)","v":"W"},{"$f":"VLOOKUP(Table16[[#This Row],[Facility ID]],'Coord.'!$A$1:$E$818,5,FALSE)","v":-81.636511999999996},960975,"Winkler, Jeffrey D",21960,9.6,"<30","<30.055","DOES NOT MEET","MEETS","N/A","N/A",30.055,30,"CA224"]
["Salem Stone Corp.","Cardinal Quarries - Smethport Quarry - W. Jefferson","2019-06-25","Select Material, Class VI","CA123",{"$f":"VLOOKUP(Table16[[#This Row],[Facility ID]],'Coord.'!$A$1:$E$818,2,FALSE)","v":"N"},{"$f":"VLOOKUP(Table16[[#This Row],[Facility ID]],'Coord.'!$A$1:$E$818,3,FALSE)","v":36.439355999999997},{"$f":"VLOOKUP(Table16[[#This Row],[Facility ID]],'Coord.'!$A$1:$E$818,4,FALSE)","v":"W"},{"$f":"VLOOKUP(Table16[[#This Row],[Facility ID]],'Coord.'!$A$1:$E$818,5,FALSE)","v":-81.488720000000001},970103,"Murray, Brandi S",13030,9.11,"<29","<50.652","DOES NOT MEET","MEETS","N/A","N/A",50.652000000000001,29,"CA137"]
["Rogers Group, Inc.","Mitchell County Stone","2015-07-22","Select Material, Class VI","CA315",{"$f":"VLOOKUP(Table16[[#This Row],[Facility ID]],'Coord.'!$A$1:$E$818,2,FALSE)","v":"N"},{"$f":"VLOOKUP(Table16[[#This Row],[Facility ID]],'Coord.'!$A$1:$E$818,3,FALSE)","v":35.899016000000003},{"$f":"VLOOKUP(Table16[[#This Row],[Facility ID]],'Coord.'!$A$1:$E$818,4,FALSE)","v":"W"},{"$f":"VLOOKUP(Table16[[#This Row],[Facility ID]],'Coord.'!$A$1:$E$818,5,FALSE)","v":-82.100712000000001},767763,"Radcliff, Roger Keith",50865,7.2,0,0,"MEETS","MEETS","N/A","N/A",0,0,"CA337"]
["Vulcan Materials Co.","Spruce Pine Quarry - Bakersville","2015-07-22","Select Material, Class VI","CA111",{"$f":"VLOOKUP(Table16[[#This Row],[Facility ID]],'Coord.'!$A$1:$E$818,2,FALSE)","v":"N"},{"$f":"VLOOKUP(Table16[[#This Row],[Facility ID]],'Coord.'!$A$1:$E$818,3,FALSE)","v":35.583199999999998},{"$f":"VLOOKUP(Table16[[#This Row],[Facility ID]],'Coord.'!$A$1:$E$818,4,FALSE)","v":"W"},{"$f":"VLOOKUP(Table16[[#This Row],[Facility ID]],'Coord.'!$A$1:$E$818,5,FALSE)","v":-82.054100000000005},767762,"Radcliff, Roger Keith",25374,8.1999999999999993,0,0,"MEETS","MEETS","N/A","N/A",0,0,"CA216"]
["Maymead Materials, Inc.","Turnip Patch Quarry - Mountain City, TN","2019-06-25","Select Material, Class VI","CA153",{"$f":"VLOOKUP(Table16[[#This Row],[Facility ID]],'Coord.'!$A$1:$E$818,2,FALSE)","v":"N"},{"$f":"VLOOKUP(Table16[[#This Row],[Facility ID]],'Coord.'!$A$1:$E$818,3,FALSE)","v":36.426709000000002},{"$f":"VLOOKUP(Table16[[#This Row],[Facility ID]],'Coord.'!$A$1:$E$818,4,FALSE)","v":"W"},{"$f":"VLOOKUP(Table16[[#This Row],[Facility ID]],'Coord.'!$A$1:$E$818,5,FALSE)","v":-81.773808000000002},970106,"Murray, Brandi S",22950,9.4600000000000009,"<29","<28.758","DOES NOT MEET","MEETS","N/A","N/A",28.757999999999999,29,"CA55"]
["Wake Stone Corp.","Knightdale Quarry - Knightdale","2012-06-13","Select Material, Class II, Type 1","CA98",{"$f":"VLOOKUP(Table16[[#This Row],[Facility ID]],'Coord.'!$A$1:$E$818,2,FALSE)","v":"N"},{"$f":"VLOOKUP(Table16[[#This Row],[Facility ID]],'Coord.'!$A$1:$E$818,3,FALSE)","v":35.797772999999999},{"$f":"VLOOKUP(Table16[[#This Row],[Facility ID]],'Coord.'!$A$1:$E$818,4,FALSE)","v":"W"},{"$f":"VLOOKUP(Table16[[#This Row],[Facility ID]],'Coord.'!$A$1:$E$818,5,FALSE)","v":-78.502251000000001},630833,"Carter, PE, Sean C",9800,8.8000000000000007,"","","MEETS","MEETS","N/A","N/A","","","CA371"]
["Vulcan Materials Co.","Havre De Grace Quarry - Havre De Grace, MD","2020-09-21","Miscellaneous Material for Electrochemical","CA345",{"$f":"VLOOKUP(Table16[[#This Row],[Facility ID]],'Coord.'!$A$1:$E$818,2,FALSE)","v":"N"},{"$f":"VLOOKUP(Table16[[#This Row],[Facility ID]],'Coord.'!$A$1:$E$818,3,FALSE)","v":35.584989999999998},{"$f":"VLOOKUP(Table16[[#This Row],[Facility ID]],'Coord.'!$A$1:$E$818,4,FALSE)","v":"W"},{"$f":"VLOOKUP(Table16[[#This Row],[Facility ID]],'Coord.'!$A$1:$E$818,5,FALSE)","v":-76.103046000000006},1021092,"Bonds, Maria M",21050,8.7799999999999994,"<30","<31.354","MEETS","MEETS",{"$f":"IF(ISBLANK(L9), \"N/A\", IF(AND(4.5 <= $M9, $M9 <= 9),IF($L9>=5000,IF($U9<=100,IF($T9<=200,\"MEETS\",\"DOES NOT MEET\"),\"DOES NOT MEET\"),\"DOES NOT MEET\"),\"DOES NOT MEET\"))","v":"MEETS"},{"$f":"IF(ISBLANK(M9), \"N/A\", IF(AND(5 <= $M9, $M9 <= 10),IF($L9>=5000,IF($U9<=100,IF($T9<=200,\"MEETS\",\"DOES NOT MEET\"),\"DOES NOT MEET\"),\"DOES NOT MEET\"),\"DOES NOT MEET\"))","v":"MEETS"},31.353999999999999,30,"CA288"]
["Hanson Aggregates Southeast, Inc.","Princeton Quarry","2013-06-12","Miscellaneous Material for Electrochemical","CA64",{"$f":"VLOOKUP(Table16[[#This Row],[Facility ID]],'Coord.'!$A$1:$E$818,2,FALSE)","v":"N"},{"$f":"VLOOKUP(Table16[[#This Row],[Facility ID]],'Coord.'!$A$1:$E$818,3,FALSE)","v":35.472107000000001},{"$f":"VLOOKUP(Table16[[#This Row],[Facility ID]],'Coord.'!$A$1:$E$818,4,FALSE)","v":"W"},{"$f":"VLOOKUP(Table16[[#This Row],[Facility ID]],'Coord.'!$A$1:$E$818,5,FALSE)","v":-78.137972000000005},669957,"Gardner, Joseph Tyler",23809,7.8,0,0,"MEETS","MEETS",{"$f":"IF(OR(ISBLANK(L10), NOT(ISNUMBER(MATCH($E10, Coastal,0)))), \"N/A\", IF(AND(4.5 <= $M10, $M10 <= 9),IF($L10>=5000,IF($U10<=100,IF($T10<=200,\"MEETS\",\"DOES NOT MEET\"),\"DOES NOT MEET\"),\"DOES NOT MEET\"),\"DOES NOT MEET\"))","v":"MEETS"},{"$f":"IF(OR(ISBLANK(M10), NOT(ISNUMBER(MATCH($E10, Coastal, 0)))), \"N/A\", IF(AND(5 <= $M10, $M10 <= 10),IF($L10>=5000,IF($U10<=100,IF($T10<=200,\"MEETS\",\"DOES NOT MEET\"),\"DOES NOT MEET\"),\"DOES NOT MEET\"),\"DOES NOT MEET\"))","v":"MEETS"},0,0,"CA42"]
["Martin Marietta","Castle Hayne Yard - Castle Hayne","2018-07-13","Coarse Aggregate, #78M","CA319",{"$f":"VLOOKUP(Table16[[#This Row],[Facility ID]],'Coord.'!$A$1:$E$818,2,FALSE)","v":"N"},{"$f":"VLOOKUP(Table16[[#This Row],[Facility ID]],'Coord.'!$A$1:$E$818,3,FALSE)","v":34.359216000000004},{"$f":"VLOOKUP(Table16[[#This Row],[Facility ID]],'Coord.'!$A$1:$E$818,4,FALSE)","v":"W"},{"$f":"VLOOKUP(Table16[[#This Row],[Facility ID]],'Coord.'!$A$1:$E$818,5,FALSE)","v":-77.857907999999995},920602,"Oehman, Christopher E",16480,9.4,0,"<38.6","DOES NOT MEET","MEETS","DOES NOT MEET","MEETS",38.6,0,"CA64"]
["Martin Marietta","Cumberland Quarry","2011-06-08","ABC Stone for Electrochemical","CA339",{"$f":"VLOOKUP(Table16[[#This Row],[Facility ID]],'Coord.'!$A$1:$E$818,2,FALSE)","v":"N"},{"$f":"VLOOKUP(Table16[[#This Row],[Facility ID]],'Coord.'!$A$1:$E$818,3,FALSE)","v":35.215510000000002},{"$f":"VLOOKUP(Table16[[#This Row],[Facility ID]],'Coord.'!$A$1:$E$818,4,FALSE)","v":"W"},{"$f":"VLOOKUP(Table16[[#This Row],[Facility ID]],'Coord.'!$A$1:$E$818,5,FALSE)","v":-78.933400000000006},541382,"Robinson, Beatrice H",5247,7.6,0,0,"MEETS","MEETS","N/A","N/A",0,0,"CA380"]
["Martin Marietta","Cumberland Quarry","2011-06-08","ABC Stone for Electrochemical","CA339",{"$f":"VLOOKUP(Table16[[#This Row],[Facility ID]],'Coord.'!$A$1:$E$818,2,FALSE)","v":"N"},{"$f":"VLOOKUP(Table16[[#This Row],[Facility ID]],'Coord.'!$A$1:$E$818,3,FALSE)","v":35.215510000000002},{"$f":"VLOOKUP(Table16[[#This Row],[Facility ID]],'Coord.'!$A$1:$E$818,4,FALSE)","v":"W"},{"$f":"VLOOKUP(Table16[[#This Row],[Facility ID]],'Coord.'!$A$1:$E$818,5,FALSE)","v":-78.933400000000006},541380,"Robinson, Beatrice H",6169,7.7,0,0,"MEETS","MEETS","N/A","N/A",0,0,"CA189"]
["Thompson Contractors","Miller Creek Quarry - Rutherfordton","2004-07-01","ABC Stone for Electrochemical","CA59",{"$f":"VLOOKUP(Table16[[#This Row],[Facility ID]],'Coord.'!$A$1:$E$818,2,FALSE)","v":"N"},{"$f":"VLOOKUP(Table16[[#This Row],[Facility ID]],'Coord.'!$A$1:$E$818,3,FALSE)","v":35.213900000000002},{"$f":"VLOOKUP(Table16[[#This Row],[Facility ID]],'Coord.'!$A$1:$E$818,4,FALSE)","v":"W"},{"$f":"VLOOKUP(Table16[[#This Row],[Facility ID]],'Coord.'!$A$1:$E$818,5,FALSE)","v":-82.002099999999999},342622,"Worley, Lester V",22050,9,26,"","MEETS","MEETS","N/A","N/A","",26,"CA38"]
["Thompson Contractors","Miller Creek Quarry - Rutherfordton","2004-07-01","ABC Stone for Electrochemical","CA59",{"$f":"VLOOKUP(Table16[[#This Row],[Facility ID]],'Coord.'!$A$1:$E$818,2,FALSE)","v":"N"},{"$f":"VLOOKUP(Table16[[#This Row],[Facility ID]],'Coord.'!$A$1:$E$818,3,FALSE)","v":35.213900000000002},{"$f":"VLOOKUP(Table16[[#This Row],[Facility ID]],'Coord.'!$A$1:$E$818,4,FALSE)","v":"W"},{"$f":"VLOOKUP(Table16[[#This Row],[Facility ID]],'Coord.'!$A$1:$E$818,5,FALSE)","v":-82.002099999999999},342623,"Worley, Lester V",24120,9.1,26,"","DOES NOT MEET","MEETS","N/A","N/A","",26,"CA381"]
["Vulcan Materials Co.","115 Quarry - N. Wilkesboro","2018-05-10","#78-M Stone for Electrochemical","CA79",{"$f":"VLOOKUP(Table16[[#This Row],[Facility ID]],'Coord.'!$A$1:$E$818,2,FALSE)","v":"N"},{"$f":"VLOOKUP(Table16[[#This Row],[Facility ID]],'Coord.'!$A$1:$E$818,3,FALSE)","v":36.106467000000002},{"$f":"VLOOKUP(Table16[[#This Row],[Facility ID]],'Coord.'!$A$1:$E$818,4,FALSE)","v":"W"},{"$f":"VLOOKUP(Table16[[#This Row],[Facility ID]],'Coord.'!$A$1:$E$818,5,FALSE)","v":-81.099030999999997},910655,"Patrie, Garin T",10774,8.1,0,53.4,"MEETS","MEETS","N/A","N/A",53.4,0,"CA408"]
["Martin Marietta","American Stone - Carrboro","2019-02-13","#78-M Stone for Electrochemical","CA2",{"$f":"VLOOKUP(Table16[[#This Row],[Facility ID]],'Coord.'!$A$1:$E$818,2,FALSE)","v":"N"},{"$f":"VLOOKUP(Table16[[#This Row],[Facility ID]],'Coord.'!$A$1:$E$818,3,FALSE)","v":35.927264999999998},{"$f":"VLOOKUP(Table16[[#This Row],[Facility ID]],'Coord.'!$A$1:$E$818,4,FALSE)","v":"W"},{"$f":"VLOOKUP(Table16[[#This Row],[Facility ID]],'Coord.'!$A$1:$E$818,5,FALSE)","v":-79.153772000000004},949792,"Westmoreland, Braxton J",14230,8.9,0,"<46.381","MEETS","MEETS","N/A","N/A",46.381,0,"CA259"]
["Hedrick Industries","Aquadale Quarry - Norwood","2019-09-24","#78-M Stone for Electrochemical","CA274",{"$f":"VLOOKUP(Table16[[#This Row],[Facility ID]],'Coord.'!$A$1:$E$818,2,FALSE)","v":"N"},{"$f":"VLOOKUP(Table16[[#This Row],[Facility ID]],'Coord.'!$A$1:$E$818,3,FALSE)","v":35.236497999999997},{"$f":"VLOOKUP(Table16[[#This Row],[Facility ID]],'Coord.'!$A$1:$E$818,4,FALSE)","v":"W"},{"$f":"VLOOKUP(Table16[[#This Row],[Facility ID]],'Coord.'!$A$1:$E$818,5,FALSE)","v":-80.239287000000004},984802,"Smith, Michael L",9018,8.86,"<32","<73.187","MEETS","MEETS","N/A","N/A",73.186999999999998,32,"CA380"]
["Martin Marietta","Arrowood Quarry - Charlotte","2019-09-18","#78-M Stone for Electrochemical","CA31",{"$f":"VLOOKUP(Table16[[#This Row],[Facility ID]],'Coord.'!$A$1:$E$818,2,FALSE)","v":"N"},{"$f":"VLOOKUP(Table16[[#This Row],[Facility ID]],'Coord.'!$A$1:$E$818,3,FALSE)","v":35.111865000000002},{"$f":"VLOOKUP(Table16[[#This Row],[Facility ID]],'Coord.'!$A$1:$E$818,4,FALSE)","v":"W"},{"$f":"VLOOKUP(Table16[[#This Row],[Facility ID]],'Coord.'!$A$1:$E$818,5,FALSE)","v":-80.921875},983524,"Smith, Michael L",9789,9.0299999999999994,"<32","<67.423","DOES NOT MEET","MEETS","N/A","N/A",67.423000000000002,32,"CA319"]
["Martin Marietta","Asheboro Quarry - Asheboro","2019-08-22","#78-M Stone for Electrochemical","CA30",{"$f":"VLOOKUP(Table16[[#This Row],[Facility ID]],'Coord.'!$A$1:$E$818,2,FALSE)","v":"N"},{"$f":"VLOOKUP(Table16[[#This Row],[Facility ID]],'Coord.'!$A$1:$E$818,3,FALSE)","v":35.766084999999997},{"$f":"VLOOKUP(Table16[[#This Row],[Facility ID]],'Coord.'!$A$1:$E$818,4,FALSE)","v":"W"},{"$f":"VLOOKUP(Table16[[#This Row],[Facility ID]],'Coord.'!$A$1:$E$818,5,FALSE)","v":-79.823999000000001},979366,"Jackson, Brandon M",18550,9.11,"<29","<35.580","DOES NOT MEET","MEETS","N/A","N/A",35.58,29,"CA349"]
["Martin Marietta","Bakers Quarry - Monroe","2019-11-27","#78-M Stone for Electrochemical","CA32",{"$f":"VLOOKUP(Table16[[#This Row],[Facility ID]],'Coord.'!$A$1:$E$818,2,FALSE)","v":"N"},{"$f":"VLOOKUP(Table16[[#This Row],[Facility ID]],'Coord.'!$A$1:$E$818,3,FALSE)","v":35.027617999999997},{"$f":"VLOOKUP(Table16[[#This Row],[Facility ID]],'Coord.'!$A$1:$E$818,4,FALSE)","v":"W"},{"$f":"VLOOKUP(Table16[[#This Row],[Facility ID]],'Coord.'!$A$1:$E$818,5,FALSE)","v":-80.603740999999999},993359,"Smith, Michael L",17070,9.27,"<30","<38.664","DOES NOT MEET","MEETS","N/A","N/A",38.664000000000001,30,"CA272"]
["Radford Quarries Of Boone, Inc.","Bamboo Quarry","2016-02-08","#78-M Stone for Electrochemical","CA122",{"$f":"VLOOKUP(Table16[[#This Row],[Facility ID]],'Coord.'!$A$1:$E$818,2,FALSE)","v":"N"},{"$f":"VLOOKUP(Table16[[#This Row],[Facility ID]],'Coord.'!$A$1:$E$818,3,FALSE)","v":36.215747},{"$f":"VLOOKUP(Table16[[#This Row],[Facility ID]],'Coord.'!$A$1:$E$818,4,FALSE)","v":"W"},{"$f":"VLOOKUP(Table16[[#This Row],[Facility ID]],'Coord.'!$A$1:$E$818,5,FALSE)","v":-81.636511999999996},793017,"Church, Tracy G",20687,7.5,5,5.2,"MEETS","MEETS","N/A","N/A",5.2,5,"CA289"]
["Martin Marietta","Belgrade Quarry - Maysville","2015-09-30","#78-M Stone for Electrochemical","CA38",{"$f":"VLOOKUP(Table16[[#This Row],[Facility ID]],'Coord.'!$A$1:$E$818,2,FALSE)","v":"N"},{"$f":"VLOOKUP(Table16[[#This Row],[Facility ID]],'Coord.'!$A$1:$E$818,3,FALSE)","v":34.884103000000003},{"$f":"VLOOKUP(Table16[[#This Row],[Facility ID]],'Coord.'!$A$1:$E$818,4,FALSE)","v":"W"},{"$f":"VLOOKUP(Table16[[#This Row],[Facility ID]],'Coord.'!$A$1:$E$818,5,FALSE)","v":-77.231482999999997},778061,"Cahill, Luke R",3370,7.3,0,0,"MEETS","MEETS","DOES NOT MEET","DOES NOT MEET",0,0,"CA310"]
["Martin Marietta","Benson Quarry - Benson","2016-03-16","#78-M Stone for Electrochemical","CA176",{"$f":"VLOOKUP(Table16[[#This Row],[Facility ID]],'Coord.'!$A$1:$E$818,2,FALSE)","v":"N"},{"$f":"VLOOKUP(Table16[[#This Row],[Facility ID]],'Coord.'!$A$1:$E$818,3,FALSE)","v":35.422584999999998},{"$f":"VLOOKUP(Table16[[#This Row],[Facility ID]],'Coord.'!$A$1:$E$818,4,FALSE)","v":"W"},{"$f":"VLOOKUP(Table16[[#This Row],[Facility ID]],'Coord.'!$A$1:$E$818,5,FALSE)","v":-78.501491999999999},798244,"Raines, James R",20585,8.3000000000000007,0,4.3,"MEETS","MEETS","N/A","N/A",4.3,0,"CA138"]
["Vulcan Materials Co.","Blacksburg Quarry - Blacksburg, SC","2019-07-30","#78-M Stone for Electrochemical","CA82",{"$f":"VLOOKUP(Table16[[#This Row],[Facility ID]],'Coord.'!$A$1:$E$818,2,FALSE)","v":"N"},{"$f":"VLOOKUP(Table16[[#This Row],[Facility ID]],'Coord.'!$A$1:$E$818,3,FALSE)","v":35.151584},{"$f":"VLOOKUP(Table16[[#This Row],[Facility ID]],'Coord.'!$A$1:$E$818,4,FALSE)","v":"W"},{"$f":"VLOOKUP(Table16[[#This Row],[Facility ID]],'Coord.'!$A$1:$E$818,5,FALSE)","v":-81.435598999999996},975113,"Gosnell, Jimmy L",12430,9.82,"<29","<53.097","DOES NOT MEET","MEETS","N/A","N/A",53.097000000000001,29,"CA63"]
["Boxley Materials Company","Blue Ridge Quarry - Blue Ridge, VA","2019-03-05","#78-M Stone for Electrochemical","CA334",{"$f":"VLOOKUP(Table16[[#This Row],[Facility ID]],'Coord.'!$A$1:$E$818,2,FALSE)","v":"N"},{"$f":"VLOOKUP(Table16[[#This Row],[Facility ID]],'Coord.'!$A$1:$E$818,3,FALSE)","v":37.386913},{"$f":"VLOOKUP(Table16[[#This Row],[Facility ID]],'Coord.'!$A$1:$E$818,4,FALSE)","v":"W"},{"$f":"VLOOKUP(Table16[[#This Row],[Facility ID]],'Coord.'!$A$1:$E$818,5,FALSE)","v":-79.794443999999999},953110,"Westmoreland, Braxton J",8427,9.1999999999999993,"<30","<78.32","DOES NOT MEET","MEETS","N/A","N/A",78.319999999999993,30]
["Martin Marietta","Bonds Quarry - Concord","2019-09-04","#78-M Stone for Electrochemical","CA276",{"$f":"VLOOKUP(Table16[[#This Row],[Facility ID]],'Coord.'!$A$1:$E$818,2,FALSE)","v":"N"},{"$f":"VLOOKUP(Table16[[#This Row],[Facility ID]],'Coord.'!$A$1:$E$818,3,FALSE)","v":35.379277999999999},{"$f":"VLOOKUP(Table16[[#This Row],[Facility ID]],'Coord.'!$A$1:$E$818,4,FALSE)","v":"W"},{"$f":"VLOOKUP(Table16[[#This Row],[Facility ID]],'Coord.'!$A$1:$E$818,5,FALSE)","v":-80.698134999999994},981563,"Cero, Kevin M",19530,9.43,"<32","<33.794","DOES NOT MEET","MEETS","N/A","N/A",33.793999999999997,32]
["Vulcan Materials Co.","Boone Quarry - Boone","2016-11-03","#78-M Stone for Electrochemical","CA21",{"$f":"VLOOKUP(Table16[[#This Row],[Facility ID]],'Coord.'!$A$1:$E$818,2,FALSE)","v":"N"},{"$f":"VLOOKUP(Table16[[#This Row],[Facility ID]],'Coord.'!$A$1:$E$818,3,FALSE)","v":36.205551},{"$f":"VLOOKUP(Table16[[#This Row],[Facility ID]],'Coord.'!$A$1:$E$818,4,FALSE)","v":"W"},{"$f":"VLOOKUP(Table16[[#This Row],[Facility ID]],'Coord.'!$A$1:$E$818,5,FALSE)","v":-81.718419999999995},833828,"Church, Tracy G",35881,7.7,0,1.8,"MEETS","MEETS","N/A","N/A",1.8,0]
["Martin Marietta","Burlington Quarry - Burlington","2019-05-31","#78-M Stone for Electrochemical","CA39",{"$f":"VLOOKUP(Table16[[#This Row],[Facility ID]],'Coord.'!$A$1:$E$818,2,FALSE)","v":"N"},{"$f":"VLOOKUP(Table16[[#This Row],[Facility ID]],'Coord.'!$A$1:$E$818,3,FALSE)","v":36.051876},{"$f":"VLOOKUP(Table16[[#This Row],[Facility ID]],'Coord.'!$A$1:$E$818,4,FALSE)","v":"W"},{"$f":"VLOOKUP(Table16[[#This Row],[Facility ID]],'Coord.'!$A$1:$E$818,5,FALSE)","v":-79.508236999999994},966238,"Waller, John M",13960,9.25,"<30","<47.278","DOES NOT MEET","MEETS","N/A","N/A",47.277999999999999,30]
["Carolina Sunrock LLC","Butner Quarry - Butner","2019-03-25","#78-M Stone for Electrochemical","CA178",{"$f":"VLOOKUP(Table16[[#This Row],[Facility ID]],'Coord.'!$A$1:$E$818,2,FALSE)","v":"N"},{"$f":"VLOOKUP(Table16[[#This Row],[Facility ID]],'Coord.'!$A$1:$E$818,3,FALSE)","v":36.121974999999999},{"$f":"VLOOKUP(Table16[[#This Row],[Facility ID]],'Coord.'!$A$1:$E$818,4,FALSE)","v":"W"},{"$f":"VLOOKUP(Table16[[#This Row],[Facility ID]],'Coord.'!$A$1:$E$818,5,FALSE)","v":-78.772541000000004},955935,"Skinner, III, John L",11850,10.1,"<30","<55.696","DOES NOT MEET","DOES NOT MEET","N/A","N/A",55.695999999999998,30]
["Vulcan Materials Co.","Cabarrus Quarry - Concord","2019-09-24","#78-M Stone for Electrochemical","CA186",{"$f":"VLOOKUP(Table16[[#This Row],[Facility ID]],'Coord.'!$A$1:$E$818,2,FALSE)","v":"N"},{"$f":"VLOOKUP(Table16[[#This Row],[Facility ID]],'Coord.'!$A$1:$E$818,3,FALSE)","v":35.404029999999999},{"$f":"VLOOKUP(Table16[[#This Row],[Facility ID]],'Coord.'!$A$1:$E$818,4,FALSE)","v":"W"},{"$f":"VLOOKUP(Table16[[#This Row],[Facility ID]],'Coord.'!$A$1:$E$818,5,FALSE)","v":-80.704829000000004},984945,"Cero, Kevin M",15200,9.73,"<32","<43.421","DOES NOT MEET","MEETS","N/A","N/A",43.420999999999999,32]
["Salem Stone Corp.","Cardinal Quarries - Smethport Quarry - W. Jefferson","2016-08-02","#78-M Stone for Electrochemical","CA123",{"$f":"VLOOKUP(Table16[[#This Row],[Facility ID]],'Coord.'!$A$1:$E$818,2,FALSE)","v":"N"},{"$f":"VLOOKUP(Table16[[#This Row],[Facility ID]],'Coord.'!$A$1:$E$818,3,FALSE)","v":36.439355999999997},{"$f":"VLOOKUP(Table16[[#This Row],[Facility ID]],'Coord.'!$A$1:$E$818,4,FALSE)","v":"W"},{"$f":"VLOOKUP(Table16[[#This Row],[Facility ID]],'Coord.'!$A$1:$E$818,5,FALSE)","v":-81.488720000000001},819962,"Church, Tracy G",7502,8.6999999999999993,0,40.200000000000003,"MEETS","MEETS","N/A","N/A",40.200000000000003,0]
["Salem Stone Corp.","Cardinal Realty - Galax Quarry - Galax, VA","2016-03-07","#78-M Stone for Electrochemical","CA11",{"$f":"VLOOKUP(Table16[[#This Row],[Facility ID]],'Coord.'!$A$1:$E$818,2,FALSE)","v":"N"},{"$f":"VLOOKUP(Table16[[#This Row],[Facility ID]],'Coord.'!$A$1:$E$818,3,FALSE)","v":36.574818999999998},{"$f":"VLOOKUP(Table16[[#This Row],[Facility ID]],'Coord.'!$A$1:$E$818,4,FALSE)","v":"W"},{"$f":"VLOOKUP(Table16[[#This Row],[Facility ID]],'Coord.'!$A$1:$E$818,5,FALSE)","v":-80.929176999999996},797287,"Whitley, Christopher D",12880,9.1999999999999993,0,5.5,"DOES NOT MEET","MEETS","N/A","N/A",5.5,0]
["Martin Marietta","Central Rock Quarry - Greensboro","2019-06-04","#78-M Stone for Electrochemical","CA28",{"$f":"VLOOKUP(Table16[[#This Row],[Facility ID]],'Coord.'!$A$1:$E$818,2,FALSE)","v":"N"},{"$f":"VLOOKUP(Table16[[#This Row],[Facility ID]],'Coord.'!$A$1:$E$818,3,FALSE)","v":36.005654},{"$f":"VLOOKUP(Table16[[#This Row],[Facility ID]],'Coord.'!$A$1:$E$818,4,FALSE)","v":"W"},{"$f":"VLOOKUP(Table16[[#This Row],[Facility ID]],'Coord.'!$A$1:$E$818,5,FALSE)","v":-79.748210999999998},966787,"Waller, John M",15200,9.49,"<30","<43.421","DOES NOT MEET","MEETS","N/A","N/A",43.420999999999999,30]
["Martin Marietta","Charlotte Quarry - Charlotte","2019-07-10","#78-M Stone for Electrochemical","CA41",{"$f":"VLOOKUP(Table16[[#This Row],[Facility ID]],'Coord.'!$A$1:$E$818,2,FALSE)","v":"N"},{"$f":"VLOOKUP(Table16[[#This Row],[Facility ID]],'Coord.'!$A$1:$E$818,3,FALSE)","v":35.297229000000002},{"$f":"VLOOKUP(Table16[[#This Row],[Facility ID]],'Coord.'!$A$1:$E$818,4,FALSE)","v":"W"},{"$f":"VLOOKUP(Table16[[#This Row],[Facility ID]],'Coord.'!$A$1:$E$818,5,FALSE)","v":-80.863066000000003},972759,"Pegues, Jr., Henderson",17520,9.34,"<29","<37.671","DOES NOT MEET","MEETS","N/A","N/A",37.670999999999999,29]
["Martin Marietta","Clarks Quarry - New Bern","2019-09-13","#78-M Stone for Electrochemical","CA189",{"$f":"VLOOKUP(Table16[[#This Row],[Facility ID]],'Coord.'!$A$1:$E$818,2,FALSE)","v":"N"},{"$f":"VLOOKUP(Table16[[#This Row],[Facility ID]],'Coord.'!$A$1:$E$818,3,FALSE)","v":35.150663999999999},{"$f":"VLOOKUP(Table16[[#This Row],[Facility ID]],'Coord.'!$A$1:$E$818,4,FALSE)","v":"W"},{"$f":"VLOOKUP(Table16[[#This Row],[Facility ID]],'Coord.'!$A$1:$E$818,5,FALSE)","v":-77.151770999999997},982804,"Cobb, James R",3934,8.0500000000000007,"<32","<167.768","MEETS","MEETS","DOES NOT MEET","DOES NOT MEET",167.768,32]
["Vulcan Materials Co.","Clear Creek Q. - Charlotte","2020-02-04","#78-M Stone for Electrochemical","CA249",{"$f":"VLOOKUP(Table16[[#This Row],[Facility ID]],'Coord.'!$A$1:$E$818,2,FALSE)","v":"N"},{"$f":"VLOOKUP(Table16[[#This Row],[Facility ID]],'Coord.'!$A$1:$E$818,3,FALSE)","v":35.220500000000001},{"$f":"VLOOKUP(Table16[[#This Row],[Facility ID]],'Coord.'!$A$1:$E$818,4,FALSE)","v":"W"},{"$f":"VLOOKUP(Table16[[#This Row],[Facility ID]],'Coord.'!$A$1:$E$818,5,FALSE)","v":-80.647542000000001},998424,"Pegues, Jr., Henderson",20190,9.4600000000000009,"<30","<32.689","DOES NOT MEET","MEETS","N/A","N/A",32.689,30]
["Hanson Aggregates Southeast, Inc.","Crabtree Quarry - Raleigh","2019-03-13","#78-M Stone for Electrochemical","CA61",{"$f":"VLOOKUP(Table16[[#This Row],[Facility ID]],'Coord.'!$A$1:$E$818,2,FALSE)","v":"N"},{"$f":"VLOOKUP(Table16[[#This Row],[Facility ID]],'Coord.'!$A$1:$E$818,3,FALSE)","v":35.846781999999997},{"$f":"VLOOKUP(Table16[[#This Row],[Facility ID]],'Coord.'!$A$1:$E$818,4,FALSE)","v":"W"},{"$f":"VLOOKUP(Table16[[#This Row],[Facility ID]],'Coord.'!$A$1:$E$818,5,FALSE)","v":-78.710387999999995},954290,"Skinner, III, John L",17680,9,0,"<37.330","MEETS","MEETS","N/A","N/A",37.33,0]
["Martin Marietta","Denver Quarry - Denver","2019-09-20","#78-M Stone for Electrochemical","CA169",{"$f":"VLOOKUP(Table16[[#This Row],[Facility ID]],'Coord.'!$A$1:$E$818,2,FALSE)","v":"N"},{"$f":"VLOOKUP(Table16[[#This Row],[Facility ID]],'Coord.'!$A$1:$E$818,3,FALSE)","v":35.527092000000003},{"$f":"VLOOKUP(Table16[[#This Row],[Facility ID]],'Coord.'!$A$1:$E$818,4,FALSE)","v":"W"},{"$f":"VLOOKUP(Table16[[#This Row],[Facility ID]],'Coord.'!$A$1:$E$818,5,FALSE)","v":-81.026443999999998},983981,"Myers, Jesse J",10780,8.52,"<32","<61.224","MEETS","MEETS","N/A","N/A",61.223999999999997,32]
["Harrison Construction Co., Inc.","Dillsboro Quarry - Dillsboro","2019-02-13","#78-M Stone for Electrochemical","CA15",{"$f":"VLOOKUP(Table16[[#This Row],[Facility ID]],'Coord.'!$A$1:$E$818,2,FALSE)","v":"N"},{"$f":"VLOOKUP(Table16[[#This Row],[Facility ID]],'Coord.'!$A$1:$E$818,3,FALSE)","v":35.365220999999998},{"$f":"VLOOKUP(Table16[[#This Row],[Facility ID]],'Coord.'!$A$1:$E$818,4,FALSE)","v":"W"},{"$f":"VLOOKUP(Table16[[#This Row],[Facility ID]],'Coord.'!$A$1:$E$818,5,FALSE)","v":-83.261218},949677,"Ledford, Brandon S",9607,8.8000000000000007,0,"<68.7","MEETS","MEETS","N/A","N/A",68.7,0]
["Martin Marietta","East Alamance Sales Yard","2016-02-08","#78-M Stone for Electrochemical","CA377",{"$f":"VLOOKUP(Table16[[#This Row],[Facility ID]],'Coord.'!$A$1:$E$818,2,FALSE)","v":"N"},{"$f":"VLOOKUP(Table16[[#This Row],[Facility ID]],'Coord.'!$A$1:$E$818,3,FALSE)","v":36.126730000000002},{"$f":"VLOOKUP(Table16[[#This Row],[Facility ID]],'Coord.'!$A$1:$E$818,4,FALSE)","v":"W"},{"$f":"VLOOKUP(Table16[[#This Row],[Facility ID]],'Coord.'!$A$1:$E$818,5,FALSE)","v":-79.347309999999993},793261,"Westmoreland, Braxton J",15330,8.3000000000000007,5,9.4,"MEETS","MEETS","N/A","N/A",9.4,5]
["Vulcan Materials Co.","East Forsyth Quarry - Kernersville","2020-02-24","#78-M Stone for Electrochemical","CA139",{"$f":"VLOOKUP(Table16[[#This Row],[Facility ID]],'Coord.'!$A$1:$E$818,2,FALSE)","v":"N"},{"$f":"VLOOKUP(Table16[[#This Row],[Facility ID]],'Coord.'!$A$1:$E$818,3,FALSE)","v":36.024622999999998},{"$f":"VLOOKUP(Table16[[#This Row],[Facility ID]],'Coord.'!$A$1:$E$818,4,FALSE)","v":"W"},{"$f":"VLOOKUP(Table16[[#This Row],[Facility ID]],'Coord.'!$A$1:$E$818,5,FALSE)","v":-80.060130000000001},1000310,"Ealey, Lee E",16860,9.25,"<30","<39.146","DOES NOT MEET","MEETS","N/A","N/A",39.146000000000001,30]
["Ararat Rock Products","Eden Quarry - Eden","2019-03-12","#78-M Stone for Electrochemical","CA374",{"$f":"VLOOKUP(Table16[[#This Row],[Facility ID]],'Coord.'!$A$1:$E$818,2,FALSE)","v":"N"},{"$f":"VLOOKUP(Table16[[#This Row],[Facility ID]],'Coord.'!$A$1:$E$818,3,FALSE)","v":36.541252},{"$f":"VLOOKUP(Table16[[#This Row],[Facility ID]],'Coord.'!$A$1:$E$818,4,FALSE)","v":"W"},{"$f":"VLOOKUP(Table16[[#This Row],[Facility ID]],'Coord.'!$A$1:$E$818,5,FALSE)","v":-79.665728000000001},954434,"Westmoreland, Braxton J",7234,8.9,0,"<91.236","MEETS","MEETS","N/A","N/A",91.236000000000004,0]
["Vulcan Materials Co.","Enka Quarry - Enka","2019-09-05","#78-M Stone for Electrochemical","CA69",{"$f":"VLOOKUP(Table16[[#This Row],[Facility ID]],'Coord.'!$A$1:$E$818,2,FALSE)","v":"N"},{"$f":"VLOOKUP(Table16[[#This Row],[Facility ID]],'Coord.'!$A$1:$E$818,3,FALSE)","v":35.323700000000002},{"$f":"VLOOKUP(Table16[[#This Row],[Facility ID]],'Coord.'!$A$1:$E$818,4,FALSE)","v":"W"},{"$f":"VLOOKUP(Table16[[#This Row],[Facility ID]],'Coord.'!$A$1:$E$818,5,FALSE)","v":-82.400899999999993},981853,"Rhymer, Robert C",11350,8.64,"<32","<58.150","MEETS","MEETS","N/A","N/A",58.15,32]
["Boxley Materials Company","Fieldale Quarry - Martinsville, VA","2019-03-05","#78-M Stone for Electrochemical","CA142",{"$f":"VLOOKUP(Table16[[#This Row],[Facility ID]],'Coord.'!$A$1:$E$818,2,FALSE)","v":"N"},{"$f":"VLOOKUP(Table16[[#This Row],[Facility ID]],'Coord.'!$A$1:$E$818,3,FALSE)","v":36.688294999999997},{"$f":"VLOOKUP(Table16[[#This Row],[Facility ID]],'Coord.'!$A$1:$E$818,4,FALSE)","v":"W"},{"$f":"VLOOKUP(Table16[[#This Row],[Facility ID]],'Coord.'!$A$1:$E$818,5,FALSE)","v":-79.938883000000004},953149,"Westmoreland, Braxton J",7555,8.6999999999999993,0,"<87.359","MEETS","MEETS","N/A","N/A",87.358999999999995,0]
["Martin Marietta","Fountain Quarry - Fountain","2020-09-25","#78-M Stone for Electrochemical","CA42",{"$f":"VLOOKUP(Table16[[#This Row],[Facility ID]],'Coord.'!$A$1:$E$818,2,FALSE)","v":"N"},{"$f":"VLOOKUP(Table16[[#This Row],[Facility ID]],'Coord.'!$A$1:$E$818,3,FALSE)","v":35.668506000000001},{"$f":"VLOOKUP(Table16[[#This Row],[Facility ID]],'Coord.'!$A$1:$E$818,4,FALSE)","v":"W"},{"$f":"VLOOKUP(Table16[[#This Row],[Facility ID]],'Coord.'!$A$1:$E$818,5,FALSE)","v":-77.630317000000005},1021241,"Cobb, James R",14210,9.44,"<30","<46.446","DOES NOT MEET","MEETS","DOES NOT MEET","MEETS",46.445999999999998,30]
["Harrison Construction Co., Inc.","Franklin Quarry - Franklin","2019-01-17","#78-M Stone for Electrochemical","CA16",{"$f":"VLOOKUP(Table16[[#This Row],[Facility ID]],'Coord.'!$A$1:$E$818,2,FALSE)","v":"N"},{"$f":"VLOOKUP(Table16[[#This Row],[Facility ID]],'Coord.'!$A$1:$E$818,3,FALSE)","v":35.163902},{"$f":"VLOOKUP(Table16[[#This Row],[Facility ID]],'Coord.'!$A$1:$E$818,4,FALSE)","v":"W"},{"$f":"VLOOKUP(Table16[[#This Row],[Facility ID]],'Coord.'!$A$1:$E$818,5,FALSE)","v":-83.425331},946030,"Ledford, Brandon S",11820,8.4,0,"<55.838","MEETS","MEETS","N/A","N/A",55.838000000000001,0]
["Martin Marietta","Franklin Quarry - Franklinton","2019-03-27","#78-M Stone for Electrochemical","CA270",{"$f":"VLOOKUP(Table16[[#This Row],[Facility ID]],'Coord.'!$A$1:$E$818,2,FALSE)","v":"N"},{"$f":"VLOOKUP(Table16[[#This Row],[Facility ID]],'Coord.'!$A$1:$E$818,3,FALSE)","v":36.070531000000003},{"$f":"VLOOKUP(Table16[[#This Row],[Facility ID]],'Coord.'!$A$1:$E$818,4,FALSE)","v":"W"},{"$f":"VLOOKUP(Table16[[#This Row],[Facility ID]],'Coord.'!$A$1:$E$818,5,FALSE)","v":-78.485541999999995},956772,"Skinner, III, John L",24930,8.1,"<30","<26.474","MEETS","MEETS","N/A","N/A",26.474,30]
["Martin Marietta","Fuquay Quarry - Fuquay-Varina","2019-01-31","#78-M Stone for Electrochemical","CA220",{"$f":"VLOOKUP(Table16[[#This Row],[Facility ID]],'Coord.'!$A$1:$E$818,2,FALSE)","v":0},{"$f":"VLOOKUP(Table16[[#This Row],[Facility ID]],'Coord.'!$A$1:$E$818,3,FALSE)","v":35.579534000000002},{"$f":"VLOOKUP(Table16[[#This Row],[Facility ID]],'Coord.'!$A$1:$E$818,4,FALSE)","v":"W"},{"$f":"VLOOKUP(Table16[[#This Row],[Facility ID]],'Coord.'!$A$1:$E$818,5,FALSE)","v":-78.875698999999997},947853,"Skinner, III, John L",20170,9.3000000000000007,0,"<32.722","DOES NOT MEET","MEETS","N/A","N/A",32.722000000000001,0]
["Martin Marietta","Garner Quarry - Garner","2019-01-29","#78-M Stone for Electrochemical","CA57",{"$f":"VLOOKUP(Table16[[#This Row],[Facility ID]],'Coord.'!$A$1:$E$818,2,FALSE)","v":"N"},{"$f":"VLOOKUP(Table16[[#This Row],[Facility ID]],'Coord.'!$A$1:$E$818,3,FALSE)","v":35.702164000000003},{"$f":"VLOOKUP(Table16[[#This Row],[Facility ID]],'Coord.'!$A$1:$E$818,4,FALSE)","v":"W"},{"$f":"VLOOKUP(Table16[[#This Row],[Facility ID]],'Coord.'!$A$1:$E$818,5,FALSE)","v":-78.577136999999993},947428,"Skinner, III, John L",21020,9.3000000000000007,0,"<31.399","DOES NOT MEET","MEETS","N/A","N/A",31.399000000000001,0]
["Carolina Stalite Corp.","Gold Hill (Light Wt.) - Gold Hill","2020-04-07","#78-M Stone for Electrochemical","CA226",{"$f":"VLOOKUP(Table16[[#This Row],[Facility ID]],'Coord.'!$A$1:$E$818,2,FALSE)","v":"N"},{"$f":"VLOOKUP(Table16[[#This Row],[Facility ID]],'Coord.'!$A$1:$E$818,3,FALSE)","v":35.504739000000001},{"$f":"VLOOKUP(Table16[[#This Row],[Facility ID]],'Coord.'!$A$1:$E$818,4,FALSE)","v":"W"},{"$f":"VLOOKUP(Table16[[#This Row],[Facility ID]],'Coord.'!$A$1:$E$818,5,FALSE)","v":-80.330614999999995},1004822,"Whitley, Christopher D",4816,9.67,"<30","<137.0","DOES NOT MEET","MEETS","N/A","N/A",137,30]
["Vulcan Materials Co.","Gold Hill Quarry - Gold Hill","2020-02-20","#78-M Stone for Electrochemical","CA85",{"$f":"VLOOKUP(Table16[[#This Row],[Facility ID]],'Coord.'!$A$1:$E$818,2,FALSE)","v":"N"},{"$f":"VLOOKUP(Table16[[#This Row],[Facility ID]],'Coord.'!$A$1:$E$818,3,FALSE)","v":35.507567999999999},{"$f":"VLOOKUP(Table16[[#This Row],[Facility ID]],'Coord.'!$A$1:$E$818,4,FALSE)","v":"W"},{"$f":"VLOOKUP(Table16[[#This Row],[Facility ID]],'Coord.'!$A$1:$E$818,5,FALSE)","v":-80.323988},1000216,"Ealey, Lee E",6092,8.35,"<30","<108.339","MEETS","MEETS","N/A","N/A",108.339,30]
["Vulcan Materials Co.","Greystone Quarry - Henderson","2019-04-01","#78-M Stone for Electrochemical","CA70",{"$f":"VLOOKUP(Table16[[#This Row],[Facility ID]],'Coord.'!$A$1:$E$818,2,FALSE)","v":"N"},{"$f":"VLOOKUP(Table16[[#This Row],[Facility ID]],'Coord.'!$A$1:$E$818,3,FALSE)","v":36.355213999999997},{"$f":"VLOOKUP(Table16[[#This Row],[Facility ID]],'Coord.'!$A$1:$E$818,4,FALSE)","v":"W"},{"$f":"VLOOKUP(Table16[[#This Row],[Facility ID]],'Coord.'!$A$1:$E$818,5,FALSE)","v":-78.348459000000005},957255,"Skinner, III, John L",24010,9.5,"<30","<27.489","DOES NOT MEET","MEETS","N/A","N/A",27.489000000000001,30]
["Hedrick Industries","Grove Stone Quarry - Black Mountain","2019-04-23","#78-M Stone for Electrochemical","CA146",{"$f":"VLOOKUP(Table16[[#This Row],[Facility ID]],'Coord.'!$A$1:$E$818,2,FALSE)","v":"N"},{"$f":"VLOOKUP(Table16[[#This Row],[Facility ID]],'Coord.'!$A$1:$E$818,3,FALSE)","v":35.610683999999999},{"$f":"VLOOKUP(Table16[[#This Row],[Facility ID]],'Coord.'!$A$1:$E$818,4,FALSE)","v":"W"},{"$f":"VLOOKUP(Table16[[#This Row],[Facility ID]],'Coord.'!$A$1:$E$818,5,FALSE)","v":-82.364768999999995},960224,"Rhymer, Robert C",16900,9.1999999999999993,"<30","<39.053","DOES NOT MEET","MEETS","N/A","N/A",39.052999999999997,30]
["Vulcan Materials Co.","Havre De Grace Quarry - Havre De Grace, MD","2016-10-26","#78-M Stone for Electrochemical","CA345",{"$f":"VLOOKUP(Table16[[#This Row],[Facility ID]],'Coord.'!$A$1:$E$818,2,FALSE)","v":"N"},{"$f":"VLOOKUP(Table16[[#This Row],[Facility ID]],'Coord.'!$A$1:$E$818,3,FALSE)","v":35.584989999999998},{"$f":"VLOOKUP(Table16[[#This Row],[Facility ID]],'Coord.'!$A$1:$E$818,4,FALSE)","v":"W"},{"$f":"VLOOKUP(Table16[[#This Row],[Facility ID]],'Coord.'!$A$1:$E$818,5,FALSE)","v":-76.103046000000006},832499,"Bonds, Maria M",6605,7.9,17.7,7.6,"MEETS","MEETS","MEETS","MEETS",7.6,17.7]
["Harrison Construction Co., Inc.","Hayesville Quarry - Hayesville","2016-07-15","#78-M Stone for Electrochemical","CA195",{"$f":"VLOOKUP(Table16[[#This Row],[Facility ID]],'Coord.'!$A$1:$E$818,2,FALSE)","v":"N"},{"$f":"VLOOKUP(Table16[[#This Row],[Facility ID]],'Coord.'!$A$1:$E$818,3,FALSE)","v":34.991819999999997},{"$f":"VLOOKUP(Table16[[#This Row],[Facility ID]],'Coord.'!$A$1:$E$818,4,FALSE)","v":"W"},{"$f":"VLOOKUP(Table16[[#This Row],[Facility ID]],'Coord.'!$A$1:$E$818,5,FALSE)","v":-83.848622000000006},816298,"Ledford, Brandon S",8467,8.6999999999999993,2.1,28.4,"MEETS","MEETS","N/A","N/A",28.4,2.1]
["Rogers Group, Inc.","Henrietta Quarry - Mooresboro","2019-04-30","#78-M Stone for Electrochemical","CA369",{"$f":"VLOOKUP(Table16[[#This Row],[Facility ID]],'Coord.'!$A$1:$E$818,2,FALSE)","v":"N"},{"$f":"VLOOKUP(Table16[[#This Row],[Facility ID]],'Coord.'!$A$1:$E$818,3,FALSE)","v":35.239412999999999},{"$f":"VLOOKUP(Table16[[#This Row],[Facility ID]],'Coord.'!$A$1:$E$818,4,FALSE)","v":"W"},{"$f":"VLOOKUP(Table16[[#This Row],[Facility ID]],'Coord.'!$A$1:$E$818,5,FALSE)","v":-81.814165000000003},961359,"Rhymer, Robert C",18140,8.9,"<30","<36.384","MEETS","MEETS","N/A","N/A",36.384,30]
["L.B.M. Industries","Hewitt Quarry - Topton","2011-07-26","#78-M Stone for Electrochemical","CA23",{"$f":"VLOOKUP(Table16[[#This Row],[Facility ID]],'Coord.'!$A$1:$E$818,2,FALSE)","v":"N"},{"$f":"VLOOKUP(Table16[[#This Row],[Facility ID]],'Coord.'!$A$1:$E$818,3,FALSE)","v":35.18289},{"$f":"VLOOKUP(Table16[[#This Row],[Facility ID]],'Coord.'!$A$1:$E$818,4,FALSE)","v":"W"},{"$f":"VLOOKUP(Table16[[#This Row],[Facility ID]],'Coord.'!$A$1:$E$818,5,FALSE)","v":-83.389880000000005},595694,"Cross, Adam D",15432,8.8000000000000007,0,0,"MEETS","MEETS","N/A","N/A",0,0]
["Martin Marietta","Hickory Quarry - Hickory","2019-07-08","#78-M Stone for Electrochemical","CA43",{"$f":"VLOOKUP(Table16[[#This Row],[Facility ID]],'Coord.'!$A$1:$E$818,2,FALSE)","v":"N"},{"$f":"VLOOKUP(Table16[[#This Row],[Facility ID]],'Coord.'!$A$1:$E$818,3,FALSE)","v":35.717019999999998},{"$f":"VLOOKUP(Table16[[#This Row],[Facility ID]],'Coord.'!$A$1:$E$818,4,FALSE)","v":"W"},{"$f":"VLOOKUP(Table16[[#This Row],[Facility ID]],'Coord.'!$A$1:$E$818,5,FALSE)","v":-81.301822999999999},971764,"Gosnell, Jimmy L",21930,9.4700000000000006,"<29","<30.096","DOES NOT MEET","MEETS","N/A","N/A",30.096,29]
["Hanson Aggregates Southeast, Inc.","Holly Springs Quarry","2019-03-29","#78-M Stone for Electrochemical","CA282",{"$f":"VLOOKUP(Table16[[#This Row],[Facility ID]],'Coord.'!$A$1:$E$818,2,FALSE)","v":"N"},{"$f":"VLOOKUP(Table16[[#This Row],[Facility ID]],'Coord.'!$A$1:$E$818,3,FALSE)","v":35.602601999999997},{"$f":"VLOOKUP(Table16[[#This Row],[Facility ID]],'Coord.'!$A$1:$E$818,4,FALSE)","v":"W"},{"$f":"VLOOKUP(Table16[[#This Row],[Facility ID]],'Coord.'!$A$1:$E$818,5,FALSE)","v":-78.877609000000007},956969,"Skinner, III, John L",22360,9.3000000000000007,"<30","<29.517","DOES NOT MEET","MEETS","N/A","N/A",29.516999999999999,30]
["Vulcan Materials Co.","Jack Quarry - Petersburg, VA","2020-09-21","#78-M Stone for Electrochemical","CA137",{"$f":"VLOOKUP(Table16[[#This Row],[Facility ID]],'Coord.'!$A$1:$E$818,2,FALSE)","v":0},{"$f":"VLOOKUP(Table16[[#This Row],[Facility ID]],'Coord.'!$A$1:$E$818,3,FALSE)","v":37.197637999999998},{"$f":"VLOOKUP(Table16[[#This Row],[Facility ID]],'Coord.'!$A$1:$E$818,4,FALSE)","v":0},{"$f":"VLOOKUP(Table16[[#This Row],[Facility ID]],'Coord.'!$A$1:$E$818,5,FALSE)","v":-77.504617999999994},1021105,"Bonds, Maria M",10330,9.51,"<30","<63.892","DOES NOT MEET","MEETS","DOES NOT MEET","MEETS",63.892000000000003,30]
["Martin Marietta","Jamestown Quarry - Jamestown","2019-06-04","#78-M Stone for Electrochemical","CA46",{"$f":"VLOOKUP(Table16[[#This Row],[Facility ID]],'Coord.'!$A$1:$E$818,2,FALSE)","v":0},{"$f":"VLOOKUP(Table16[[#This Row],[Facility ID]],'Coord.'!$A$1:$E$818,3,FALSE)","v":35.964756000000001},{"$f":"VLOOKUP(Table16[[#This Row],[Facility ID]],'Coord.'!$A$1:$E$818,4,FALSE)","v":"W"},{"$f":"VLOOKUP(Table16[[#This Row],[Facility ID]],'Coord.'!$A$1:$E$818,5,FALSE)","v":-79.920193999999995},966788,"Waller, John M",28310,9.1300000000000008,"<30","<23.313","DOES NOT MEET","MEETS","N/A","N/A",23.312999999999999,30]
["Hanson Aggregates Southeast, Inc.","Jefferson Quarry - Jefferson, SC","2019-09-13","#78-M Stone for Electrochemical","CA120",{"$f":"VLOOKUP(Table16[[#This Row],[Facility ID]],'Coord.'!$A$1:$E$818,2,FALSE)","v":"N"},{"$f":"VLOOKUP(Table16[[#This Row],[Facility ID]],'Coord.'!$A$1:$E$818,3,FALSE)","v":34.699689999999997},{"$f":"VLOOKUP(Table16[[#This Row],[Facility ID]],'Coord.'!$A$1:$E$818,4,FALSE)","v":"W"},{"$f":"VLOOKUP(Table16[[#This Row],[Facility ID]],'Coord.'!$A$1:$E$818,5,FALSE)","v":-80.332674999999995},982918,"Jordan, Daniel H",55150,7.86,"<32","<11.967","MEETS","MEETS","N/A","N/A",11.967000000000001,32]
["Martin Marietta","Kannapolis Quarry - Landis","2020-02-26","#78-M Stone for Electrochemical","CA47",{"$f":"VLOOKUP(Table16[[#This Row],[Facility ID]],'Coord.'!$A$1:$E$818,2,FALSE)","v":"N"},{"$f":"VLOOKUP(Table16[[#This Row],[Facility ID]],'Coord.'!$A$1:$E$818,3,FALSE)","v":35.520546000000003},{"$f":"VLOOKUP(Table16[[#This Row],[Facility ID]],'Coord.'!$A$1:$E$818,4,FALSE)","v":"W"},{"$f":"VLOOKUP(Table16[[#This Row],[Facility ID]],'Coord.'!$A$1:$E$818,5,FALSE)","v":-80.584057999999999},1000984,"Ealey, Lee E",20890,9.1300000000000008,"<30","<31.594","DOES NOT MEET","MEETS","N/A","N/A",31.594000000000001,30]
["Martin Marietta","Kings Mountain Quarry - Kings Mountain","2019-07-01","#78-M Stone for Electrochemical","CA48",{"$f":"VLOOKUP(Table16[[#This Row],[Facility ID]],'Coord.'!$A$1:$E$818,2,FALSE)","v":"N"},{"$f":"VLOOKUP(Table16[[#This Row],[Facility ID]],'Coord.'!$A$1:$E$818,3,FALSE)","v":35.225724},{"$f":"VLOOKUP(Table16[[#This Row],[Facility ID]],'Coord.'!$A$1:$E$818,4,FALSE)","v":"W"},{"$f":"VLOOKUP(Table16[[#This Row],[Facility ID]],'Coord.'!$A$1:$E$818,5,FALSE)","v":-81.339361999999994},970680,"Gosnell, Jimmy L",12220,9.2899999999999991,"<29","<54.010","DOES NOT MEET","MEETS","N/A","N/A",54.01,29]
["Carolina Sunrock LLC","Kittrell Quarry - Kittrell","2019-02-01","#78-M Stone for Electrochemical","CA304",{"$f":"VLOOKUP(Table16[[#This Row],[Facility ID]],'Coord.'!$A$1:$E$818,2,FALSE)","v":"N"},{"$f":"VLOOKUP(Table16[[#This Row],[Facility ID]],'Coord.'!$A$1:$E$818,3,FALSE)","v":36.169713000000002},{"$f":"VLOOKUP(Table16[[#This Row],[Facility ID]],'Coord.'!$A$1:$E$818,4,FALSE)","v":"W"},{"$f":"VLOOKUP(Table16[[#This Row],[Facility ID]],'Coord.'!$A$1:$E$818,5,FALSE)","v":-78.444863999999995},948022,"Skinner, III, John L",18400,9.3000000000000007,0,"<35.87",{"$f":"IF(AND(4.5 <= $M66, $M66 <= 9), \"MEETS\", \"DOES NOT MEET\")","v":"DOES NOT MEET"},{"$f":"IF(AND(5 <= $M66, $M66 <= 10), \"MEETS\", \"DOES NOT MEET\")","v":"MEETS"},"N/A","N/A",{"$f":"IF(LEFT(O66, 1)=\"<\", VALUE(RIGHT(O66,LEN(O66)-1)), O66)","v":35.869999999999997},{"$f":"IF(LEFT(N66, 1)=\"<\", VALUE(RIGHT(N66,LEN(N66)-1)), N66)","v":0}]
["Wake Stone Corp.","Knightdale Quarry - Knightdale","2020-09-14","#78-M Stone for Electrochemical","CA98",{"$f":"VLOOKUP(Table16[[#This Row],[Facility ID]],'Coord.'!$A$1:$E$818,2,FALSE)","v":"N"},{"$f":"VLOOKUP(Table16[[#This Row],[Facility ID]],'Coord.'!$A$1:$E$818,3,FALSE)","v":35.797772999999999},{"$f":"VLOOKUP(Table16[[#This Row],[Facility ID]],'Coord.'!$A$1:$E$818,4,FALSE)","v":"W"},{"$f":"VLOOKUP(Table16[[#This Row],[Facility ID]],'Coord.'!$A$1:$E$818,5,FALSE)","v":-78.502251000000001},1020095,"Skinner, III, John L",16560,9.51,"<30","<39.855","DOES NOT MEET","MEETS","N/A","N/A",39.854999999999997,30]
["Hedrick Industries","Lake Norman Quarry - Stanley","2019-07-12","#78-M Stone for Electrochemical","CA168",{"$f":"VLOOKUP(Table16[[#This Row],[Facility ID]],'Coord.'!$A$1:$E$818,2,FALSE)","v":"N"},{"$f":"VLOOKUP(Table16[[#This Row],[Facility ID]],'Coord.'!$A$1:$E$818,3,FALSE)","v":35.428623999999999},{"$f":"VLOOKUP(Table16[[#This Row],[Facility ID]],'Coord.'!$A$1:$E$818,4,FALSE)","v":"W"},{"$f":"VLOOKUP(Table16[[#This Row],[Facility ID]],'Coord.'!$A$1:$E$818,5,FALSE)","v":-81.017241999999996},972393,"Gosnell, Jimmy L",8980,9.0399999999999991,"<29","<73.497","DOES NOT MEET","MEETS","N/A","N/A",73.497,29]
["Boxley Materials Company","Lawyers Road Quarry - Lynchburg, VA","2016-03-14","#78-M Stone for Electrochemical","CA400",{"$f":"VLOOKUP(Table16[[#This Row],[Facility ID]],'Coord.'!$A$1:$E$818,2,FALSE)","v":"N"},{"$f":"VLOOKUP(Table16[[#This Row],[Facility ID]],'Coord.'!$A$1:$E$818,3,FALSE)","v":37.310775999999997},{"$f":"VLOOKUP(Table16[[#This Row],[Facility ID]],'Coord.'!$A$1:$E$818,4,FALSE)","v":"W"},{"$f":"VLOOKUP(Table16[[#This Row],[Facility ID]],'Coord.'!$A$1:$E$818,5,FALSE)","v":-79.196890999999994},798420,"Fosque, Robert W",17065,7.6,0,9.5,"MEETS","MEETS","N/A","N/A",9.5,0]
["Martin Marietta","Lemon Springs - Sanford","2019-08-16","#78-M Stone for Electrochemical","CA97",{"$f":"VLOOKUP(Table16[[#This Row],[Facility ID]],'Coord.'!$A$1:$E$818,2,FALSE)","v":0},{"$f":"VLOOKUP(Table16[[#This Row],[Facility ID]],'Coord.'!$A$1:$E$818,3,FALSE)","v":35.410660999999998},{"$f":"VLOOKUP(Table16[[#This Row],[Facility ID]],'Coord.'!$A$1:$E$818,4,FALSE)","v":0},{"$f":"VLOOKUP(Table16[[#This Row],[Facility ID]],'Coord.'!$A$1:$E$818,5,FALSE)","v":-79.206500000000005},978234,"Jackson, Brandon M",15270,9.23,"<29","<43.222","DOES NOT MEET","MEETS","N/A","N/A",43.222000000000001,29]
["Vulcan Materials Co.","Lenior Quarry - Lenoir","2016-06-24","#78-M Stone for Electrochemical","CA91",{"$f":"VLOOKUP(Table16[[#This Row],[Facility ID]],'Coord.'!$A$1:$E$818,2,FALSE)","v":"N"},{"$f":"VLOOKUP(Table16[[#This Row],[Facility ID]],'Coord.'!$A$1:$E$818,3,FALSE)","v":35.935250000000003},{"$f":"VLOOKUP(Table16[[#This Row],[Facility ID]],'Coord.'!$A$1:$E$818,4,FALSE)","v":"W"},{"$f":"VLOOKUP(Table16[[#This Row],[Facility ID]],'Coord.'!$A$1:$E$818,5,FALSE)","v":-81.488753000000003},815307,"Church, Tracy G",17443,9.1999999999999993,2.1,15.3,"DOES NOT MEET","MEETS","N/A","N/A",15.3,2.1]
["McCrary Stone","Low Gap Quarry - Burnsville","2019-03-05","#78-M Stone for Electrochemical","CA244",{"$f":"VLOOKUP(Table16[[#This Row],[Facility ID]],'Coord.'!$A$1:$E$818,2,FALSE)","v":"N"},{"$f":"VLOOKUP(Table16[[#This Row],[Facility ID]],'Coord.'!$A$1:$E$818,3,FALSE)","v":35.523000000000003},{"$f":"VLOOKUP(Table16[[#This Row],[Facility ID]],'Coord.'!$A$1:$E$818,4,FALSE)","v":"W"},{"$f":"VLOOKUP(Table16[[#This Row],[Facility ID]],'Coord.'!$A$1:$E$818,5,FALSE)","v":-82.175399999999996},952983,"Kindley, Wallace Quint",2687,3.4,"<30","<245.627","DOES NOT MEET","DOES NOT MEET","N/A","N/A",245.62700000000001,30]
["Georgia Stone Products","Lynches River Quarry - Jefferson, SC","2019-07-10","#78-M Stone for Electrochemical","CA325",{"$f":"VLOOKUP(Table16[[#This Row],[Facility ID]],'Coord.'!$A$1:$E$818,2,FALSE)","v":"N"},{"$f":"VLOOKUP(Table16[[#This Row],[Facility ID]],'Coord.'!$A$1:$E$818,3,FALSE)","v":34.703234999999999},{"$f":"VLOOKUP(Table16[[#This Row],[Facility ID]],'Coord.'!$A$1:$E$818,4,FALSE)","v":"W"},{"$f":"VLOOKUP(Table16[[#This Row],[Facility ID]],'Coord.'!$A$1:$E$818,5,FALSE)","v":-80.461099000000004},971840,"Jordan, Daniel H",25790,9.33,"<29","<25.591","DOES NOT MEET","MEETS","N/A","N/A",25.591000000000001,29]
["Martin Marietta","Mallard Creek Quarry - Charlotte","2019-11-06","#78-M Stone for Electrochemical","CA188",{"$f":"VLOOKUP(Table16[[#This Row],[Facility ID]],'Coord.'!$A$1:$E$818,2,FALSE)","v":"N"},{"$f":"VLOOKUP(Table16[[#This Row],[Facility ID]],'Coord.'!$A$1:$E$818,3,FALSE)","v":35.318085000000004},{"$f":"VLOOKUP(Table16[[#This Row],[Facility ID]],'Coord.'!$A$1:$E$818,4,FALSE)","v":"W"},{"$f":"VLOOKUP(Table16[[#This Row],[Facility ID]],'Coord.'!$A$1:$E$818,5,FALSE)","v":-80.728077999999996},990711,"Pegues, Jr., Henderson",15450,9.34,"<32","<42.718","DOES NOT MEET","MEETS",{"$f":"IF(OR(ISBLANK(L74), NOT(ISNUMBER(MATCH($E74, Coastal,0)))), \"N/A\", IF(AND(4.5 <= $M74, $M74 <= 9),IF($L74>=5000,IF($U74<=100,IF($T74<=200,\"MEETS\",\"DOES NOT MEET\"),\"DOES NOT MEET\"),\"DOES NOT MEET\"),\"DOES NOT MEET\"))","v":"N/A"},{"$f":"IF(OR(ISBLANK(M74), NOT(ISNUMBER(MATCH($E74, Coastal, 0)))), \"N/A\", IF(AND(5 <= $M74, $M74 <= 10),IF($L74>=5000,IF($U74<=100,IF($T74<=200,\"MEETS\",\"DOES NOT MEET\"),\"DOES NOT MEET\"),\"DOES NOT MEET\"),\"DOES NOT MEET\"))","v":"N/A"},42.718000000000004,32]
["Hanson Aggregates Southeast, Inc.","Marlboro Plant - Bennettsville","2018-10-24","#78-M Stone for Electrochemical","CA34",{"$f":"VLOOKUP(Table16[[#This Row],[Facility ID]],'Coord.'!$A$1:$E$818,2,FALSE)","v":"N"},{"$f":"VLOOKUP(Table16[[#This Row],[Facility ID]],'Coord.'!$A$1:$E$818,3,FALSE)","v":34.584676000000002},{"$f":"VLOOKUP(Table16[[#This Row],[Facility ID]],'Coord.'!$A$1:$E$818,4,FALSE)","v":"W"},{"$f":"VLOOKUP(Table16[[#This Row],[Facility ID]],'Coord.'!$A$1:$E$818,5,FALSE)","v":-79.748296999999994},936887,"Jordan, Daniel H",101900,5.8,0,"<6.5","MEETS","MEETS","N/A","N/A",6.5,0]
["McCrary Stone","Marshall Quarry - Marshall","2019-08-12","#78-M Stone for Electrochemical","CA113",{"$f":"VLOOKUP(Table16[[#This Row],[Facility ID]],'Coord.'!$A$1:$E$818,2,FALSE)","v":"N"},{"$f":"VLOOKUP(Table16[[#This Row],[Facility ID]],'Coord.'!$A$1:$E$818,3,FALSE)","v":35.792836000000001},{"$f":"VLOOKUP(Table16[[#This Row],[Facility ID]],'Coord.'!$A$1:$E$818,4,FALSE)","v":"W"},{"$f":"VLOOKUP(Table16[[#This Row],[Facility ID]],'Coord.'!$A$1:$E$818,5,FALSE)","v":-82.655023},978213,"Kindley, Wallace Quint",11310,8.83,"<29","<58.355","MEETS","MEETS","N/A","N/A",58.354999999999997,29]
["Harrison Construction Co., Inc.","Massey Branch Quarry - Robbinsville","2001-10-22","#78-M Stone for Electrochemical","CA193",{"$f":"VLOOKUP(Table16[[#This Row],[Facility ID]],'Coord.'!$A$1:$E$818,2,FALSE)","v":"N"},{"$f":"VLOOKUP(Table16[[#This Row],[Facility ID]],'Coord.'!$A$1:$E$818,3,FALSE)","v":35.335340000000002},{"$f":"VLOOKUP(Table16[[#This Row],[Facility ID]],'Coord.'!$A$1:$E$818,4,FALSE)","v":"W"},{"$f":"VLOOKUP(Table16[[#This Row],[Facility ID]],'Coord.'!$A$1:$E$818,5,FALSE)","v":-83.836816999999996},235848,"Wallace, Robert R",8300,5.7,"","","MEETS","MEETS","N/A","N/A","",""]
["Martin Marietta","Matthews Quarry - Matthews","2019-11-25","#78-M Stone for Electrochemical","CA37",{"$f":"VLOOKUP(Table16[[#This Row],[Facility ID]],'Coord.'!$A$1:$E$818,2,FALSE)","v":0},{"$f":"VLOOKUP(Table16[[#This Row],[Facility ID]],'Coord.'!$A$1:$E$818,3,FALSE)","v":35.131262999999997},{"$f":"VLOOKUP(Table16[[#This Row],[Facility ID]],'Coord.'!$A$1:$E$818,4,FALSE)","v":"W"},{"$f":"VLOOKUP(Table16[[#This Row],[Facility ID]],'Coord.'!$A$1:$E$818,5,FALSE)","v":-80.720371999999998},993308,"Smith, Michael L",18410,9.25,"<30","<35.850","DOES NOT MEET","MEETS","N/A","N/A",35.85,30]
["Thompson Contractors","Miller Creek Quarry - Rutherfordton","2019-09-27","#78-M Stone for Electrochemical","CA59",{"$f":"VLOOKUP(Table16[[#This Row],[Facility ID]],'Coord.'!$A$1:$E$818,2,FALSE)","v":"N"},{"$f":"VLOOKUP(Table16[[#This Row],[Facility ID]],'Coord.'!$A$1:$E$818,3,FALSE)","v":35.213900000000002},{"$f":"VLOOKUP(Table16[[#This Row],[Facility ID]],'Coord.'!$A$1:$E$818,4,FALSE)","v":"W"},{"$f":"VLOOKUP(Table16[[#This Row],[Facility ID]],'Coord.'!$A$1:$E$818,5,FALSE)","v":-82.002099999999999},985270,"Norton, Stephen S",14090,9.34,"<30","<46.842","DOES NOT MEET","MEETS","N/A","N/A",46.841999999999999,30]
["Rogers Group, Inc.","Mitchell County Stone","2016-10-25","#78-M Stone for Electrochemical","CA315",{"$f":"VLOOKUP(Table16[[#This Row],[Facility ID]],'Coord.'!$A$1:$E$818,2,FALSE)","v":"N"},{"$f":"VLOOKUP(Table16[[#This Row],[Facility ID]],'Coord.'!$A$1:$E$818,3,FALSE)","v":35.899016000000003},{"$f":"VLOOKUP(Table16[[#This Row],[Facility ID]],'Coord.'!$A$1:$E$818,4,FALSE)","v":"W"},{"$f":"VLOOKUP(Table16[[#This Row],[Facility ID]],'Coord.'!$A$1:$E$818,5,FALSE)","v":-82.100712000000001},832457,"Rhymer, Robert C",42373,8.1,0,0.1,"MEETS","MEETS","N/A","N/A",0.1,0]
["Wake Stone Corp.","Moncure Quarry - Moncure","2020-10-14","#78-M Stone for Electrochemical","CA100",{"$f":"VLOOKUP(Table16[[#This Row],[Facility ID]],'Coord.'!$A$1:$E$818,2,FALSE)","v":"N"},{"$f":"VLOOKUP(Table16[[#This Row],[Facility ID]],'Coord.'!$A$1:$E$818,3,FALSE)","v":35.616160000000001},{"$f":"VLOOKUP(Table16[[#This Row],[Facility ID]],'Coord.'!$A$1:$E$818,4,FALSE)","v":"W"},{"$f":"VLOOKUP(Table16[[#This Row],[Facility ID]],'Coord.'!$A$1:$E$818,5,FALSE)","v":-79.103876},1023300,"Braly, James R",14920,9.1999999999999993,"<30","<44.236","DOES NOT MEET","MEETS","N/A","N/A",44.235999999999997,30]
["Vulcan Materials Co.","Morganton Quarry - Morganton","2016-04-21","#78-M Stone for Electrochemical","CA7",{"$f":"VLOOKUP(Table16[[#This Row],[Facility ID]],'Coord.'!$A$1:$E$818,2,FALSE)","v":"N"},{"$f":"VLOOKUP(Table16[[#This Row],[Facility ID]],'Coord.'!$A$1:$E$818,3,FALSE)","v":35.461010000000002},{"$f":"VLOOKUP(Table16[[#This Row],[Facility ID]],'Coord.'!$A$1:$E$818,4,FALSE)","v":"W"},{"$f":"VLOOKUP(Table16[[#This Row],[Facility ID]],'Coord.'!$A$1:$E$818,5,FALSE)","v":-81.394000000000005},803457,"Ausley, Jeff A",13410,8.6,0,16.7,"MEETS","MEETS","N/A","N/A",16.7,0]
["NC Granite Corp.","Mount Airy Quarry","2016-03-08","#78-M Stone for Electrochemical","CA24",{"$f":"VLOOKUP(Table16[[#This Row],[Facility ID]],'Coord.'!$A$1:$E$818,2,FALSE)","v":"N"},{"$f":"VLOOKUP(Table16[[#This Row],[Facility ID]],'Coord.'!$A$1:$E$818,3,FALSE)","v":36.507544000000003},{"$f":"VLOOKUP(Table16[[#This Row],[Facility ID]],'Coord.'!$A$1:$E$818,4,FALSE)","v":"W"},{"$f":"VLOOKUP(Table16[[#This Row],[Facility ID]],'Coord.'!$A$1:$E$818,5,FALSE)","v":-80.591076000000001},797325,"Whitley, Christopher D",23436,7.9,0,5.2,"MEETS","MEETS","N/A","N/A",5.2,0]
["Ararat Rock Products","Mt. Airy Quarry - Mt. Airy","2017-01-31","#78-M Stone for Electrochemical","CA3",{"$f":"VLOOKUP(Table16[[#This Row],[Facility ID]],'Coord.'!$A$1:$E$818,2,FALSE)","v":"N"},{"$f":"VLOOKUP(Table16[[#This Row],[Facility ID]],'Coord.'!$A$1:$E$818,3,FALSE)","v":36.461475999999998},{"$f":"VLOOKUP(Table16[[#This Row],[Facility ID]],'Coord.'!$A$1:$E$818,4,FALSE)","v":"W"},{"$f":"VLOOKUP(Table16[[#This Row],[Facility ID]],'Coord.'!$A$1:$E$818,5,FALSE)","v":-80.593323999999996},843861,"Whitley, Christopher D",11582,8.3000000000000007,0,50.8,"MEETS","MEETS","N/A","N/A",50.8,0]
["Wake Stone Corp.","Nash County Quarry - Battleboro","2016-03-11","#78-M Stone for Electrochemical","CA223",{"$f":"VLOOKUP(Table16[[#This Row],[Facility ID]],'Coord.'!$A$1:$E$818,2,FALSE)","v":"N"},{"$f":"VLOOKUP(Table16[[#This Row],[Facility ID]],'Coord.'!$A$1:$E$818,3,FALSE)","v":36.060037000000001},{"$f":"VLOOKUP(Table16[[#This Row],[Facility ID]],'Coord.'!$A$1:$E$818,4,FALSE)","v":"W"},{"$f":"VLOOKUP(Table16[[#This Row],[Facility ID]],'Coord.'!$A$1:$E$818,5,FALSE)","v":-77.83229},797387,"Raines, James R",18450,7.6,0,8.5,"MEETS","MEETS","N/A","N/A",8.5,0]
["Hanson Aggregates Southeast, Inc.","Neverson Quarry - Sims","2016-03-15","#78-M Stone for Electrochemical","CA66",{"$f":"VLOOKUP(Table16[[#This Row],[Facility ID]],'Coord.'!$A$1:$E$818,2,FALSE)","v":"N"},{"$f":"VLOOKUP(Table16[[#This Row],[Facility ID]],'Coord.'!$A$1:$E$818,3,FALSE)","v":35.766500999999998},{"$f":"VLOOKUP(Table16[[#This Row],[Facility ID]],'Coord.'!$A$1:$E$818,4,FALSE)","v":"W"},{"$f":"VLOOKUP(Table16[[#This Row],[Facility ID]],'Coord.'!$A$1:$E$818,5,FALSE)","v":-78.084275000000005},798233,"Raines, James R",23288,7.4,0,4.5999999999999996,"MEETS","MEETS","N/A","N/A",4.5999999999999996,0]
["Hedrick Industries","North Buncombe Quarry - Asheville","2019-04-29","#78-M Stone for Electrochemical","CA131",{"$f":"VLOOKUP(Table16[[#This Row],[Facility ID]],'Coord.'!$A$1:$E$818,2,FALSE)","v":"N"},{"$f":"VLOOKUP(Table16[[#This Row],[Facility ID]],'Coord.'!$A$1:$E$818,3,FALSE)","v":35.687100000000001},{"$f":"VLOOKUP(Table16[[#This Row],[Facility ID]],'Coord.'!$A$1:$E$818,4,FALSE)","v":"W"},{"$f":"VLOOKUP(Table16[[#This Row],[Facility ID]],'Coord.'!$A$1:$E$818,5,FALSE)","v":-82.6083},961088,"Kindley, Wallace Quint",8953,9.1,"<30","<73.718","DOES NOT MEET","MEETS","N/A","N/A",73.718000000000004,30]
["Vulcan Materials Co.","North Quarry - Winston Salem","2020-02-25","#78-M Stone for Electrochemical","CA72",{"$f":"VLOOKUP(Table16[[#This Row],[Facility ID]],'Coord.'!$A$1:$E$818,2,FALSE)","v":"N"},{"$f":"VLOOKUP(Table16[[#This Row],[Facility ID]],'Coord.'!$A$1:$E$818,3,FALSE)","v":36.176855000000003},{"$f":"VLOOKUP(Table16[[#This Row],[Facility ID]],'Coord.'!$A$1:$E$818,4,FALSE)","v":"W"},{"$f":"VLOOKUP(Table16[[#This Row],[Facility ID]],'Coord.'!$A$1:$E$818,5,FALSE)","v":-80.268285000000006},1000799,"Ealey, Lee E",19050,9.24,"<30","<34.646","DOES NOT MEET","MEETS","N/A","N/A",34.646000000000001,30]
["Vulcan Materials Co.","Penrose Quarry - Pisgah Forest","2017-03-07","#78-M Stone for Electrochemical","CA12",{"$f":"VLOOKUP(Table16[[#This Row],[Facility ID]],'Coord.'!$A$1:$E$818,2,FALSE)","v":"N"},{"$f":"VLOOKUP(Table16[[#This Row],[Facility ID]],'Coord.'!$A$1:$E$818,3,FALSE)","v":35.273408000000003},{"$f":"VLOOKUP(Table16[[#This Row],[Facility ID]],'Coord.'!$A$1:$E$818,4,FALSE)","v":"W"},{"$f":"VLOOKUP(Table16[[#This Row],[Facility ID]],'Coord.'!$A$1:$E$818,5,FALSE)","v":-82.641863999999998},848232,"Wood, Dean Michael M",22784,9.4,0,26.4,"DOES NOT MEET","MEETS","N/A","N/A",26.4,0]
["Vulcan Materials Co.","Pineville Quarry - Charlotte","2019-08-21","#78-M Stone for Electrochemical","CA101",{"$f":"VLOOKUP(Table16[[#This Row],[Facility ID]],'Coord.'!$A$1:$E$818,2,FALSE)","v":"N"},{"$f":"VLOOKUP(Table16[[#This Row],[Facility ID]],'Coord.'!$A$1:$E$818,3,FALSE)","v":35.115856000000001},{"$f":"VLOOKUP(Table16[[#This Row],[Facility ID]],'Coord.'!$A$1:$E$818,4,FALSE)","v":"W"},{"$f":"VLOOKUP(Table16[[#This Row],[Facility ID]],'Coord.'!$A$1:$E$818,5,FALSE)","v":-80.896596000000002},979253,"Smith, Michael L",12210,9.2899999999999991,"<32","<54.054","DOES NOT MEET","MEETS","N/A","N/A",54.054000000000002,32]
["Luck Stone Corporation","Pittsboro Quarry - Moncure","2018-11-30","#78-M Stone for Electrochemical","CA292",{"$f":"VLOOKUP(Table16[[#This Row],[Facility ID]],'Coord.'!$A$1:$E$818,2,FALSE)","v":"N"},{"$f":"VLOOKUP(Table16[[#This Row],[Facility ID]],'Coord.'!$A$1:$E$818,3,FALSE)","v":35.660415999999998},{"$f":"VLOOKUP(Table16[[#This Row],[Facility ID]],'Coord.'!$A$1:$E$818,4,FALSE)","v":"W"},{"$f":"VLOOKUP(Table16[[#This Row],[Facility ID]],'Coord.'!$A$1:$E$818,5,FALSE)","v":-79.176833000000002},941283,"Jackson, Brandon M",18920,9.4,0,"<34.88","DOES NOT MEET","MEETS","N/A","N/A",34.880000000000003,0]
["Martin Marietta","Pomona Quarry - Greensboro","2019-05-28","#78-M Stone for Electrochemical","CA51",{"$f":"VLOOKUP(Table16[[#This Row],[Facility ID]],'Coord.'!$A$1:$E$818,2,FALSE)","v":0},{"$f":"VLOOKUP(Table16[[#This Row],[Facility ID]],'Coord.'!$A$1:$E$818,3,FALSE)","v":36.060417999999999},{"$f":"VLOOKUP(Table16[[#This Row],[Facility ID]],'Coord.'!$A$1:$E$818,4,FALSE)","v":0},{"$f":"VLOOKUP(Table16[[#This Row],[Facility ID]],'Coord.'!$A$1:$E$818,5,FALSE)","v":-79.925364999999999},965376,"Waller, John M",18800,9.5,"<30","<35.106","DOES NOT MEET","MEETS","N/A","N/A",35.106000000000002,30]
["Hanson Aggregates Southeast, Inc.","Princeton Quarry","2016-03-24","#78-M Stone for Electrochemical","CA64",{"$f":"VLOOKUP(Table16[[#This Row],[Facility ID]],'Coord.'!$A$1:$E$818,2,FALSE)","v":"N"},{"$f":"VLOOKUP(Table16[[#This Row],[Facility ID]],'Coord.'!$A$1:$E$818,3,FALSE)","v":35.472107000000001},{"$f":"VLOOKUP(Table16[[#This Row],[Facility ID]],'Coord.'!$A$1:$E$818,4,FALSE)","v":"W"},{"$f":"VLOOKUP(Table16[[#This Row],[Facility ID]],'Coord.'!$A$1:$E$818,5,FALSE)","v":-78.137972000000005},799117,"Raines, James R",13463,7.7,0,5.7,"MEETS","MEETS","MEETS","MEETS",5.7,0]
["Vulcan Materials Co.","Puddledock Quarry - Prince George, VA","2020-09-21","#78-M Stone for Electrochemical","CA224",{"$f":"VLOOKUP(Table16[[#This Row],[Facility ID]],'Coord.'!$A$1:$E$818,2,FALSE)","v":"N"},{"$f":"VLOOKUP(Table16[[#This Row],[Facility ID]],'Coord.'!$A$1:$E$818,3,FALSE)","v":37.260108000000002},{"$f":"VLOOKUP(Table16[[#This Row],[Facility ID]],'Coord.'!$A$1:$E$818,4,FALSE)","v":"W"},{"$f":"VLOOKUP(Table16[[#This Row],[Facility ID]],'Coord.'!$A$1:$E$818,5,FALSE)","v":-77.364734999999996},1021102,"Bonds, Maria M",38360,4.87,"<30","<17.205","MEETS","DOES NOT MEET","MEETS","DOES NOT MEET",17.204999999999998,30]
["Hanson Aggregates Southeast, Inc.","Raleigh Quarry - Wake Forest","2019-01-09","#78-M Stone for Electrochemical","CA67",{"$f":"VLOOKUP(Table16[[#This Row],[Facility ID]],'Coord.'!$A$1:$E$818,2,FALSE)","v":"N"},{"$f":"VLOOKUP(Table16[[#This Row],[Facility ID]],'Coord.'!$A$1:$E$818,3,FALSE)","v":35.931106999999997},{"$f":"VLOOKUP(Table16[[#This Row],[Facility ID]],'Coord.'!$A$1:$E$818,4,FALSE)","v":"W"},{"$f":"VLOOKUP(Table16[[#This Row],[Facility ID]],'Coord.'!$A$1:$E$818,5,FALSE)","v":-78.543345000000002},944670,"Skinner, III, John L",21530,9.4,0,"<30.655","DOES NOT MEET","MEETS","N/A","N/A",30.655000000000001,0]
["Martin Marietta","Raleigh-Durham Quarry - Raleigh","2019-01-18","#78-M Stone for Electrochemical","CA156",{"$f":"VLOOKUP(Table16[[#This Row],[Facility ID]],'Coord.'!$A$1:$E$818,2,FALSE)","v":"N"},{"$f":"VLOOKUP(Table16[[#This Row],[Facility ID]],'Coord.'!$A$1:$E$818,3,FALSE)","v":35.894070999999997},{"$f":"VLOOKUP(Table16[[#This Row],[Facility ID]],'Coord.'!$A$1:$E$818,4,FALSE)","v":"W"},{"$f":"VLOOKUP(Table16[[#This Row],[Facility ID]],'Coord.'!$A$1:$E$818,5,FALSE)","v":-78.749120000000005},946460,"Skinner, III, John L",14230,10.1,0,"<46.381","DOES NOT MEET","DOES NOT MEET","N/A","N/A",46.381,0]
["Martin Marietta","Reidsville Quarry - Reidsville","2019-02-13","#78-M Stone for Electrochemical","CA52",{"$f":"VLOOKUP(Table16[[#This Row],[Facility ID]],'Coord.'!$A$1:$E$818,2,FALSE)","v":0},{"$f":"VLOOKUP(Table16[[#This Row],[Facility ID]],'Coord.'!$A$1:$E$818,3,FALSE)","v":36.371012},{"$f":"VLOOKUP(Table16[[#This Row],[Facility ID]],'Coord.'!$A$1:$E$818,4,FALSE)","v":0},{"$f":"VLOOKUP(Table16[[#This Row],[Facility ID]],'Coord.'!$A$1:$E$818,5,FALSE)","v":-79.726775000000004},949846,"Westmoreland, Braxton J",17310,9.5,0,"<38.128","DOES NOT MEET","MEETS","N/A","N/A",38.128,0]
["Martin Marietta","Rock Hill Quarry - Rock Hill, SC","2019-09-10","#78-M Stone for Electrochemical","CA271",{"$f":"VLOOKUP(Table16[[#This Row],[Facility ID]],'Coord.'!$A$1:$E$818,2,FALSE)","v":"N"},{"$f":"VLOOKUP(Table16[[#This Row],[Facility ID]],'Coord.'!$A$1:$E$818,3,FALSE)","v":34.894787000000001},{"$f":"VLOOKUP(Table16[[#This Row],[Facility ID]],'Coord.'!$A$1:$E$818,4,FALSE)","v":"W"},{"$f":"VLOOKUP(Table16[[#This Row],[Facility ID]],'Coord.'!$A$1:$E$818,5,FALSE)","v":-80.999021999999997},982310,"Adair, Mildred (Millie) L",16020,9.4700000000000006,"<32","<41.199","DOES NOT MEET","MEETS","N/A","N/A",41.198999999999998,32]
["Vulcan Materials Co.","Rockingham Quarry - Rockingham","2019-08-13","#78-M Stone for Electrochemical","CA94",{"$f":"VLOOKUP(Table16[[#This Row],[Facility ID]],'Coord.'!$A$1:$E$818,2,FALSE)","v":"N"},{"$f":"VLOOKUP(Table16[[#This Row],[Facility ID]],'Coord.'!$A$1:$E$818,3,FALSE)","v":34.938706000000003},{"$f":"VLOOKUP(Table16[[#This Row],[Facility ID]],'Coord.'!$A$1:$E$818,4,FALSE)","v":"W"},{"$f":"VLOOKUP(Table16[[#This Row],[Facility ID]],'Coord.'!$A$1:$E$818,5,FALSE)","v":-79.823207999999994},977705,"Jordan, Daniel H",13960,9.42,"<29","<47.278","DOES NOT MEET","MEETS","N/A","N/A",47.277999999999999,29]
["Hanson Aggregates Southeast, Inc.","Rocky Mount Quarry (#2)","2016-04-14","#78-M Stone for Electrochemical","CA371",{"$f":"VLOOKUP(Table16[[#This Row],[Facility ID]],'Coord.'!$A$1:$E$818,2,FALSE)","v":"N"},{"$f":"VLOOKUP(Table16[[#This Row],[Facility ID]],'Coord.'!$A$1:$E$818,3,FALSE)","v":35.972839999999998},{"$f":"VLOOKUP(Table16[[#This Row],[Facility ID]],'Coord.'!$A$1:$E$818,4,FALSE)","v":"W"},{"$f":"VLOOKUP(Table16[[#This Row],[Facility ID]],'Coord.'!$A$1:$E$818,5,FALSE)","v":-77.760082999999995},802198,"Raines, James R",10244,9.3000000000000007,0,62.7,"DOES NOT MEET","MEETS","DOES NOT MEET","MEETS",62.7,0]
["Hanson Aggregates Southeast, Inc.","Rougemont Quarry","2019-01-11","#78-M Stone for Electrochemical","CA217",{"$f":"VLOOKUP(Table16[[#This Row],[Facility ID]],'Coord.'!$A$1:$E$818,2,FALSE)","v":"N"},{"$f":"VLOOKUP(Table16[[#This Row],[Facility ID]],'Coord.'!$A$1:$E$818,3,FALSE)","v":36.224888},{"$f":"VLOOKUP(Table16[[#This Row],[Facility ID]],'Coord.'!$A$1:$E$818,4,FALSE)","v":"W"},{"$f":"VLOOKUP(Table16[[#This Row],[Facility ID]],'Coord.'!$A$1:$E$818,5,FALSE)","v":-78.951487999999998},945247,"Skinner, III, John L",24460,9.6999999999999993,0,"<26.983","DOES NOT MEET","MEETS","N/A","N/A",26.983000000000001,0]
["Martin Marietta","Salem Stone Quarry - Kernersville","2020-03-10","#78-M Stone for Electrochemical","CA209",{"$f":"VLOOKUP(Table16[[#This Row],[Facility ID]],'Coord.'!$A$1:$E$818,2,FALSE)","v":"N"},{"$f":"VLOOKUP(Table16[[#This Row],[Facility ID]],'Coord.'!$A$1:$E$818,3,FALSE)","v":36.035980000000002},{"$f":"VLOOKUP(Table16[[#This Row],[Facility ID]],'Coord.'!$A$1:$E$818,4,FALSE)","v":"W"},{"$f":"VLOOKUP(Table16[[#This Row],[Facility ID]],'Coord.'!$A$1:$E$818,5,FALSE)","v":-80.106778000000006},1005506,"Ealey, Lee E",22540,9.2799999999999994,"<30","<29.281","DOES NOT MEET","MEETS","N/A","N/A",29.280999999999999,30]
["Hanson Aggregates Southeast, Inc.","Sandy Flats Quarry - Taylors, SC","2016-12-14","#78-M Stone for Electrochemical","CA298",{"$f":"VLOOKUP(Table16[[#This Row],[Facility ID]],'Coord.'!$A$1:$E$818,2,FALSE)","v":"N"},{"$f":"VLOOKUP(Table16[[#This Row],[Facility ID]],'Coord.'!$A$1:$E$818,3,FALSE)","v":35.008490999999999},{"$f":"VLOOKUP(Table16[[#This Row],[Facility ID]],'Coord.'!$A$1:$E$818,4,FALSE)","v":"W"},{"$f":"VLOOKUP(Table16[[#This Row],[Facility ID]],'Coord.'!$A$1:$E$818,5,FALSE)","v":-82.345754999999997},839144,"Wood, Dean Michael M",21786,7.8,0,0.9,"MEETS","MEETS","N/A","N/A",0.9,0]
["Vulcan Materials Co.","Skippers Quarry - Skippers, VA","2020-02-05","#78-M Stone for Electrochemical","CA55",{"$f":"VLOOKUP(Table16[[#This Row],[Facility ID]],'Coord.'!$A$1:$E$818,2,FALSE)","v":"N"},{"$f":"VLOOKUP(Table16[[#This Row],[Facility ID]],'Coord.'!$A$1:$E$818,3,FALSE)","v":36.608707000000003},{"$f":"VLOOKUP(Table16[[#This Row],[Facility ID]],'Coord.'!$A$1:$E$818,4,FALSE)","v":"W"},{"$f":"VLOOKUP(Table16[[#This Row],[Facility ID]],'Coord.'!$A$1:$E$818,5,FALSE)","v":-77.582424000000003},998832,"Thomas, Grady Q",15140,9.33,"<30","<43.593","DOES NOT MEET","MEETS","DOES NOT MEET","MEETS",43.593000000000004,30]
["Vulcan Materials Co.","Smith Grove Q. - Mocksville","2020-02-03","#78-M Stone for Electrochemical","CA80",{"$f":"VLOOKUP(Table16[[#This Row],[Facility ID]],'Coord.'!$A$1:$E$818,2,FALSE)","v":"N"},{"$f":"VLOOKUP(Table16[[#This Row],[Facility ID]],'Coord.'!$A$1:$E$818,3,FALSE)","v":35.967185000000001},{"$f":"VLOOKUP(Table16[[#This Row],[Facility ID]],'Coord.'!$A$1:$E$818,4,FALSE)","v":"W"},{"$f":"VLOOKUP(Table16[[#This Row],[Facility ID]],'Coord.'!$A$1:$E$818,5,FALSE)","v":-80.530692999999999},998595,"Ealey, Lee E",21020,9.4499999999999993,"<30","<31.399","DOES NOT MEET","MEETS","N/A","N/A",31.399000000000001,30]
["Hedrick Industries","South McDowell Quarry - Marion","2019-01-24","#78-M Stone for Electrochemical","CA283",{"$f":"VLOOKUP(Table16[[#This Row],[Facility ID]],'Coord.'!$A$1:$E$818,2,FALSE)","v":"N"},{"$f":"VLOOKUP(Table16[[#This Row],[Facility ID]],'Coord.'!$A$1:$E$818,3,FALSE)","v":35.632061},{"$f":"VLOOKUP(Table16[[#This Row],[Facility ID]],'Coord.'!$A$1:$E$818,4,FALSE)","v":"W"},{"$f":"VLOOKUP(Table16[[#This Row],[Facility ID]],'Coord.'!$A$1:$E$818,5,FALSE)","v":-81.961977000000005},946849,"Rhymer, Robert C",26700,9.1999999999999993,0,"<24.719","DOES NOT MEET","MEETS","N/A","N/A",24.719000000000001,0]
["Salem Stone Corp.","Southside Materials - Shelton Quarry - Pelham","2019-02-28","#78-M Stone for Electrochemical","CA75",{"$f":"VLOOKUP(Table16[[#This Row],[Facility ID]],'Coord.'!$A$1:$E$818,2,FALSE)","v":0},{"$f":"VLOOKUP(Table16[[#This Row],[Facility ID]],'Coord.'!$A$1:$E$818,3,FALSE)","v":36.535156999999998},{"$f":"VLOOKUP(Table16[[#This Row],[Facility ID]],'Coord.'!$A$1:$E$818,4,FALSE)","v":0},{"$f":"VLOOKUP(Table16[[#This Row],[Facility ID]],'Coord.'!$A$1:$E$818,5,FALSE)","v":-79.459670000000003},952400,"Westmoreland, Braxton J",33790,7.8,0,"<19.532","MEETS","MEETS","N/A","N/A",19.532,0]
["Vulcan Materials Co.","Spruce Pine Quarry - Bakersville","2019-09-16","#78-M Stone for Electrochemical","CA111",{"$f":"VLOOKUP(Table16[[#This Row],[Facility ID]],'Coord.'!$A$1:$E$818,2,FALSE)","v":"N"},{"$f":"VLOOKUP(Table16[[#This Row],[Facility ID]],'Coord.'!$A$1:$E$818,3,FALSE)","v":35.583199999999998},{"$f":"VLOOKUP(Table16[[#This Row],[Facility ID]],'Coord.'!$A$1:$E$818,4,FALSE)","v":"W"},{"$f":"VLOOKUP(Table16[[#This Row],[Facility ID]],'Coord.'!$A$1:$E$818,5,FALSE)","v":-82.054100000000005},983086,"Norton, Stephen S",12260,7.61,"<32","<53.834","MEETS","MEETS","N/A","N/A",53.834000000000003,32]
["Martin Marietta","Statesville Quarry - Statesville","2019-10-09","#78-M Stone for Electrochemical","CA54",{"$f":"VLOOKUP(Table16[[#This Row],[Facility ID]],'Coord.'!$A$1:$E$818,2,FALSE)","v":"N"},{"$f":"VLOOKUP(Table16[[#This Row],[Facility ID]],'Coord.'!$A$1:$E$818,3,FALSE)","v":35.804465999999998},{"$f":"VLOOKUP(Table16[[#This Row],[Facility ID]],'Coord.'!$A$1:$E$818,4,FALSE)","v":"W"},{"$f":"VLOOKUP(Table16[[#This Row],[Facility ID]],'Coord.'!$A$1:$E$818,5,FALSE)","v":-80.913083999999998},987453,"Brinson, Joseph",6641,6.94,"<30","<99.383","MEETS","MEETS","N/A","N/A",99.382999999999996,30]
["Vulcan Materials Co.","Stokesdale Quarry - Stokesdale","2019-02-28","#78-M Stone for Electrochemical","CA76",{"$f":"VLOOKUP(Table16[[#This Row],[Facility ID]],'Coord.'!$A$1:$E$818,2,FALSE)","v":0},{"$f":"VLOOKUP(Table16[[#This Row],[Facility ID]],'Coord.'!$A$1:$E$818,3,FALSE)","v":36.241660000000003},{"$f":"VLOOKUP(Table16[[#This Row],[Facility ID]],'Coord.'!$A$1:$E$818,4,FALSE)","v":"W"},{"$f":"VLOOKUP(Table16[[#This Row],[Facility ID]],'Coord.'!$A$1:$E$818,5,FALSE)","v":-79.935815000000005},952377,"Westmoreland, Braxton J",20110,9.3000000000000007,0,"<32.819","DOES NOT MEET","MEETS","N/A","N/A",32.819000000000003,0]
["Martin Marietta","Thomasville Quarry - Thomasville","2020-03-10","#78-M Stone for Electrochemical","CA102",{"$f":"VLOOKUP(Table16[[#This Row],[Facility ID]],'Coord.'!$A$1:$E$818,2,FALSE)","v":"N"},{"$f":"VLOOKUP(Table16[[#This Row],[Facility ID]],'Coord.'!$A$1:$E$818,3,FALSE)","v":35.853850000000001},{"$f":"VLOOKUP(Table16[[#This Row],[Facility ID]],'Coord.'!$A$1:$E$818,4,FALSE)","v":"W"},{"$f":"VLOOKUP(Table16[[#This Row],[Facility ID]],'Coord.'!$A$1:$E$818,5,FALSE)","v":-80.160167999999999},1005551,"Ealey, Lee E",17700,9.57,"<30","<37.288","DOES NOT MEET","MEETS","N/A","N/A",37.287999999999997,30]
["Wake Stone Corp.","Triangle Quarry - Cary","2019-02-27","#78-M Stone for Electrochemical","CA157",{"$f":"VLOOKUP(Table16[[#This Row],[Facility ID]],'Coord.'!$A$1:$E$818,2,FALSE)","v":"N"},{"$f":"VLOOKUP(Table16[[#This Row],[Facility ID]],'Coord.'!$A$1:$E$818,3,FALSE)","v":35.838397000000001},{"$f":"VLOOKUP(Table16[[#This Row],[Facility ID]],'Coord.'!$A$1:$E$818,4,FALSE)","v":"W"},{"$f":"VLOOKUP(Table16[[#This Row],[Facility ID]],'Coord.'!$A$1:$E$818,5,FALSE)","v":-78.767809},951912,"Skinner, III, John L",19140,9.4,0,"<34.483","DOES NOT MEET","MEETS","N/A","N/A",34.482999999999997,0]
["Harrison Construction Co., Inc.","Waynesville Quarry - Waynesville","2019-07-29","#78-M Stone for Electrochemical","CA1",{"$f":"VLOOKUP(Table16[[#This Row],[Facility ID]],'Coord.'!$A$1:$E$818,2,FALSE)","v":"N"},{"$f":"VLOOKUP(Table16[[#This Row],[Facility ID]],'Coord.'!$A$1:$E$818,3,FALSE)","v":35.440697},{"$f":"VLOOKUP(Table16[[#This Row],[Facility ID]],'Coord.'!$A$1:$E$818,4,FALSE)","v":"W"},{"$f":"VLOOKUP(Table16[[#This Row],[Facility ID]],'Coord.'!$A$1:$E$818,5,FALSE)","v":-83.007457000000002},974813,"Kindley, Wallace Quint",8835,8.83,"<29","<74.70","MEETS","MEETS","N/A","N/A",74.7,29]
["LBM Industries","Whitewater Falls Quarry - Sapphire","2019-08-21","#78-M Stone for Electrochemical","CA119",{"$f":"VLOOKUP(Table16[[#This Row],[Facility ID]],'Coord.'!$A$1:$E$818,2,FALSE)","v":"N"},{"$f":"VLOOKUP(Table16[[#This Row],[Facility ID]],'Coord.'!$A$1:$E$818,3,FALSE)","v":35.056310000000003},{"$f":"VLOOKUP(Table16[[#This Row],[Facility ID]],'Coord.'!$A$1:$E$818,4,FALSE)","v":"W"},{"$f":"VLOOKUP(Table16[[#This Row],[Facility ID]],'Coord.'!$A$1:$E$818,5,FALSE)","v":-82.582790000000003},979124,"Wood, Dean Michael M",24020,9.58,"<32","<27.477","DOES NOT MEET","MEETS","N/A","N/A",27.477,32]
["Boone's Concrete Supply, LLC","Woodlawn Quarry - Marion","2019-09-23","#78-M Stone for Electrochemical","CA190",{"$f":"VLOOKUP(Table16[[#This Row],[Facility ID]],'Coord.'!$A$1:$E$818,2,FALSE)","v":"N"},{"$f":"VLOOKUP(Table16[[#This Row],[Facility ID]],'Coord.'!$A$1:$E$818,3,FALSE)","v":35.787314000000002},{"$f":"VLOOKUP(Table16[[#This Row],[Facility ID]],'Coord.'!$A$1:$E$818,4,FALSE)","v":"W"},{"$f":"VLOOKUP(Table16[[#This Row],[Facility ID]],'Coord.'!$A$1:$E$818,5,FALSE)","v":-82.036208000000002},984074,"Norton, Stephen S",11100,9.93,"<32","<59.459","DOES NOT MEET","MEETS","N/A","N/A",59.459000000000003,32]
["Martin Marietta","Woodleaf Quarry - Salisbury","2020-03-03","#78-M Stone for Electrochemical","CA56",{"$f":"VLOOKUP(Table16[[#This Row],[Facility ID]],'Coord.'!$A$1:$E$818,2,FALSE)","v":"N"},{"$f":"VLOOKUP(Table16[[#This Row],[Facility ID]],'Coord.'!$A$1:$E$818,3,FALSE)","v":35.773539},{"$f":"VLOOKUP(Table16[[#This Row],[Facility ID]],'Coord.'!$A$1:$E$818,4,FALSE)","v":"W"},{"$f":"VLOOKUP(Table16[[#This Row],[Facility ID]],'Coord.'!$A$1:$E$818,5,FALSE)","v":-80.598793000000001},1005350,"Ealey, Lee E",17540,9.48,"<30","<37.628","DOES NOT MEET","MEETS","N/A","N/A",37.628,30]
["Carolina Sunrock LLC","Woodsdale Quarry - Roxboro","2019-01-11","#78-M Stone for Electrochemical","CA329",{"$f":"VLOOKUP(Table16[[#This Row],[Facility ID]],'Coord.'!$A$1:$E$818,2,FALSE)","v":"N"},{"$f":"VLOOKUP(Table16[[#This Row],[Facility ID]],'Coord.'!$A$1:$E$818,3,FALSE)","v":36.516776},{"$f":"VLOOKUP(Table16[[#This Row],[Facility ID]],'Coord.'!$A$1:$E$818,4,FALSE)","v":"W"},{"$f":"VLOOKUP(Table16[[#This Row],[Facility ID]],'Coord.'!$A$1:$E$818,5,FALSE)","v":-78.963525000000004},945251,"Skinner, III, John L",16390,9.4,0,"<40.268","DOES NOT MEET","MEETS","N/A","N/A",40.268000000000001,0]
["Vulcan Materials Co.","115 Quarry - N. Wilkesboro","2019-08-05","#67 Stone for Electrochemical","CA79",{"$f":"VLOOKUP(Table16[[#This Row],[Facility ID]],'Coord.'!$A$1:$E$818,2,FALSE)","v":"N"},{"$f":"VLOOKUP(Table16[[#This Row],[Facility ID]],'Coord.'!$A$1:$E$818,3,FALSE)","v":36.106467000000002},{"$f":"VLOOKUP(Table16[[#This Row],[Facility ID]],'Coord.'!$A$1:$E$818,4,FALSE)","v":"W"},{"$f":"VLOOKUP(Table16[[#This Row],[Facility ID]],'Coord.'!$A$1:$E$818,5,FALSE)","v":-81.099030999999997},976211,"Church, Tracy G",15980,9.1999999999999993,"<29","<41.302","DOES NOT MEET","MEETS","N/A","N/A",41.302,29]
["Martin Marietta","American Stone - Carrboro","2019-02-13","#67 Stone for Electrochemical","CA2",{"$f":"VLOOKUP(Table16[[#This Row],[Facility ID]],'Coord.'!$A$1:$E$818,2,FALSE)","v":"N"},{"$f":"VLOOKUP(Table16[[#This Row],[Facility ID]],'Coord.'!$A$1:$E$818,3,FALSE)","v":35.927264999999998},{"$f":"VLOOKUP(Table16[[#This Row],[Facility ID]],'Coord.'!$A$1:$E$818,4,FALSE)","v":"W"},{"$f":"VLOOKUP(Table16[[#This Row],[Facility ID]],'Coord.'!$A$1:$E$818,5,FALSE)","v":-79.153772000000004},949790,"Westmoreland, Braxton J",16170,9.8000000000000007,0,"<40.816","DOES NOT MEET","MEETS","N/A","N/A",40.816000000000003,0]
["Hedrick Industries","Aquadale Quarry - Norwood","2019-09-24","#67 Stone for Electrochemical","CA274",{"$f":"VLOOKUP(Table16[[#This Row],[Facility ID]],'Coord.'!$A$1:$E$818,2,FALSE)","v":"N"},{"$f":"VLOOKUP(Table16[[#This Row],[Facility ID]],'Coord.'!$A$1:$E$818,3,FALSE)","v":35.236497999999997},{"$f":"VLOOKUP(Table16[[#This Row],[Facility ID]],'Coord.'!$A$1:$E$818,4,FALSE)","v":"W"},{"$f":"VLOOKUP(Table16[[#This Row],[Facility ID]],'Coord.'!$A$1:$E$818,5,FALSE)","v":-80.239287000000004},984693,"Smith, Michael L",14180,9.02,"<32","<46.544","DOES NOT MEET","MEETS","N/A","N/A",46.543999999999997,32]
["Martin Marietta","Arrowood Quarry - Charlotte","2019-09-18","#67 Stone for Electrochemical","CA31",{"$f":"VLOOKUP(Table16[[#This Row],[Facility ID]],'Coord.'!$A$1:$E$818,2,FALSE)","v":"N"},{"$f":"VLOOKUP(Table16[[#This Row],[Facility ID]],'Coord.'!$A$1:$E$818,3,FALSE)","v":35.111865000000002},{"$f":"VLOOKUP(Table16[[#This Row],[Facility ID]],'Coord.'!$A$1:$E$818,4,FALSE)","v":"W"},{"$f":"VLOOKUP(Table16[[#This Row],[Facility ID]],'Coord.'!$A$1:$E$818,5,FALSE)","v":-80.921875},983522,"Smith, Michael L",10830,9.15,"<32","<60.942","DOES NOT MEET","MEETS","N/A","N/A",60.942,32]
["Martin Marietta","Asheboro Quarry - Asheboro","2019-08-22","#67 Stone for Electrochemical","CA30",{"$f":"VLOOKUP(Table16[[#This Row],[Facility ID]],'Coord.'!$A$1:$E$818,2,FALSE)","v":"N"},{"$f":"VLOOKUP(Table16[[#This Row],[Facility ID]],'Coord.'!$A$1:$E$818,3,FALSE)","v":35.766084999999997},{"$f":"VLOOKUP(Table16[[#This Row],[Facility ID]],'Coord.'!$A$1:$E$818,4,FALSE)","v":"W"},{"$f":"VLOOKUP(Table16[[#This Row],[Facility ID]],'Coord.'!$A$1:$E$818,5,FALSE)","v":-79.823999000000001},979365,"Jackson, Brandon M",17770,9.0500000000000007,"<29","<37.141","DOES NOT MEET","MEETS","N/A","N/A",37.140999999999998,29]
["Martin Marietta","Bakers Quarry - Monroe","2019-11-27","#67 Stone for Electrochemical","CA32",{"$f":"VLOOKUP(Table16[[#This Row],[Facility ID]],'Coord.'!$A$1:$E$818,2,FALSE)","v":"N"},{"$f":"VLOOKUP(Table16[[#This Row],[Facility ID]],'Coord.'!$A$1:$E$818,3,FALSE)","v":35.027617999999997},{"$f":"VLOOKUP(Table16[[#This Row],[Facility ID]],'Coord.'!$A$1:$E$818,4,FALSE)","v":"W"},{"$f":"VLOOKUP(Table16[[#This Row],[Facility ID]],'Coord.'!$A$1:$E$818,5,FALSE)","v":-80.603740999999999},993358,"Smith, Michael L",23130,9.3800000000000008,"<30","<28.534","DOES NOT MEET","MEETS","N/A","N/A",28.533999999999999,30]
["Sloan Construction Co.","Blacksburg Quarry - Blacksburg, SC","2019-08-22","#67 Stone for Electrochemical","CA382",{"$f":"VLOOKUP(Table16[[#This Row],[Facility ID]],'Coord.'!$A$1:$E$818,2,FALSE)","v":"N"},{"$f":"VLOOKUP(Table16[[#This Row],[Facility ID]],'Coord.'!$A$1:$E$818,3,FALSE)","v":35.136633000000003},{"$f":"VLOOKUP(Table16[[#This Row],[Facility ID]],'Coord.'!$A$1:$E$818,4,FALSE)","v":"W"},{"$f":"VLOOKUP(Table16[[#This Row],[Facility ID]],'Coord.'!$A$1:$E$818,5,FALSE)","v":81.528683000000001},979540,"Brinson, Joseph",24510,7.76,"<29","<26.928","MEETS","MEETS","N/A","N/A",26.928000000000001,29]
["Martin Marietta","Bonds Quarry - Concord","2019-09-04","#67 Stone for Electrochemical","CA276",{"$f":"VLOOKUP(Table16[[#This Row],[Facility ID]],'Coord.'!$A$1:$E$818,2,FALSE)","v":"N"},{"$f":"VLOOKUP(Table16[[#This Row],[Facility ID]],'Coord.'!$A$1:$E$818,3,FALSE)","v":35.379277999999999},{"$f":"VLOOKUP(Table16[[#This Row],[Facility ID]],'Coord.'!$A$1:$E$818,4,FALSE)","v":"W"},{"$f":"VLOOKUP(Table16[[#This Row],[Facility ID]],'Coord.'!$A$1:$E$818,5,FALSE)","v":-80.698134999999994},981560,"Cero, Kevin M",19640,9.7200000000000006,"<32","<33.605","DOES NOT MEET","MEETS","N/A","N/A",33.604999999999997,32]
["Martin Marietta","Burlington Quarry - Burlington","2019-05-31","#67 Stone for Electrochemical","CA39",{"$f":"VLOOKUP(Table16[[#This Row],[Facility ID]],'Coord.'!$A$1:$E$818,2,FALSE)","v":"N"},{"$f":"VLOOKUP(Table16[[#This Row],[Facility ID]],'Coord.'!$A$1:$E$818,3,FALSE)","v":36.051876},{"$f":"VLOOKUP(Table16[[#This Row],[Facility ID]],'Coord.'!$A$1:$E$818,4,FALSE)","v":"W"},{"$f":"VLOOKUP(Table16[[#This Row],[Facility ID]],'Coord.'!$A$1:$E$818,5,FALSE)","v":-79.508236999999994},966239,"Waller, John M",15550,9.4499999999999993,"<30","<42.444","DOES NOT MEET","MEETS","N/A","N/A",42.444000000000003,30]
["Carolina Sunrock LLC","Butner Quarry - Butner","2019-03-25","#67 Stone for Electrochemical","CA178",{"$f":"VLOOKUP(Table16[[#This Row],[Facility ID]],'Coord.'!$A$1:$E$818,2,FALSE)","v":"N"},{"$f":"VLOOKUP(Table16[[#This Row],[Facility ID]],'Coord.'!$A$1:$E$818,3,FALSE)","v":36.121974999999999},{"$f":"VLOOKUP(Table16[[#This Row],[Facility ID]],'Coord.'!$A$1:$E$818,4,FALSE)","v":"W"},{"$f":"VLOOKUP(Table16[[#This Row],[Facility ID]],'Coord.'!$A$1:$E$818,5,FALSE)","v":-78.772541000000004},955934,"Skinner, III, John L",10130,10.1,"<30","<65.153","DOES NOT MEET","DOES NOT MEET","N/A","N/A",65.153000000000006,30]
["Vulcan Materials Co.","Cabarrus Quarry - Concord","2019-09-24","#67 Stone for Electrochemical","CA186",{"$f":"VLOOKUP(Table16[[#This Row],[Facility ID]],'Coord.'!$A$1:$E$818,2,FALSE)","v":"N"},{"$f":"VLOOKUP(Table16[[#This Row],[Facility ID]],'Coord.'!$A$1:$E$818,3,FALSE)","v":35.404029999999999},{"$f":"VLOOKUP(Table16[[#This Row],[Facility ID]],'Coord.'!$A$1:$E$818,4,FALSE)","v":"W"},{"$f":"VLOOKUP(Table16[[#This Row],[Facility ID]],'Coord.'!$A$1:$E$818,5,FALSE)","v":-80.704829000000004},984943,"Cero, Kevin M",17720,9.65,"<32","<37.246","DOES NOT MEET","MEETS","N/A","N/A",37.246000000000002,32]
["Martin Marietta","Charlotte Quarry - Charlotte","2019-07-10","#67 Stone for Electrochemical","CA41",{"$f":"VLOOKUP(Table16[[#This Row],[Facility ID]],'Coord.'!$A$1:$E$818,2,FALSE)","v":"N"},{"$f":"VLOOKUP(Table16[[#This Row],[Facility ID]],'Coord.'!$A$1:$E$818,3,FALSE)","v":35.297229000000002},{"$f":"VLOOKUP(Table16[[#This Row],[Facility ID]],'Coord.'!$A$1:$E$818,4,FALSE)","v":"W"},{"$f":"VLOOKUP(Table16[[#This Row],[Facility ID]],'Coord.'!$A$1:$E$818,5,FALSE)","v":-80.863066000000003},972758,"Pegues, Jr., Henderson",18470,9.49,"<29","<35.734","DOES NOT MEET","MEETS","N/A","N/A",35.734000000000002,29]
["Martin Marietta","Clarks Quarry - New Bern","2019-09-13","#67 Stone for Electrochemical","CA189",{"$f":"VLOOKUP(Table16[[#This Row],[Facility ID]],'Coord.'!$A$1:$E$818,2,FALSE)","v":"N"},{"$f":"VLOOKUP(Table16[[#This Row],[Facility ID]],'Coord.'!$A$1:$E$818,3,FALSE)","v":35.150663999999999},{"$f":"VLOOKUP(Table16[[#This Row],[Facility ID]],'Coord.'!$A$1:$E$818,4,FALSE)","v":"W"},{"$f":"VLOOKUP(Table16[[#This Row],[Facility ID]],'Coord.'!$A$1:$E$818,5,FALSE)","v":-77.151770999999997},982797,"Cobb, James R",4048,8.2200000000000006,"<32","<163.043",{"$f":"IF(AND(4.5 <= $M130, $M130 <= 9), \"MEETS\", \"DOES NOT MEET\")","v":"MEETS"},{"$f":"IF(AND(5 <= $M130, $M130 <= 10), \"MEETS\", \"DOES NOT MEET\")","v":"MEETS"},"DOES NOT MEET","DOES NOT MEET",{"$f":"IF(LEFT(O130, 1)=\"<\", VALUE(RIGHT(O130,LEN(O130)-1)), O130)","v":163.04300000000001},{"$f":"IF(LEFT(N130, 1)=\"<\", VALUE(RIGHT(N130,LEN(N130)-1)), N130)","v":32}]
["Vulcan Materials Co.","Clear Creek Q. - Charlotte","2020-02-04","#67 Stone for Electrochemical","CA249",{"$f":"VLOOKUP(Table16[[#This Row],[Facility ID]],'Coord.'!$A$1:$E$818,2,FALSE)","v":"N"},{"$f":"VLOOKUP(Table16[[#This Row],[Facility ID]],'Coord.'!$A$1:$E$818,3,FALSE)","v":35.220500000000001},{"$f":"VLOOKUP(Table16[[#This Row],[Facility ID]],'Coord.'!$A$1:$E$818,4,FALSE)","v":"W"},{"$f":"VLOOKUP(Table16[[#This Row],[Facility ID]],'Coord.'!$A$1:$E$818,5,FALSE)","v":-80.647542000000001},998435,"Pegues, Jr., Henderson",22470,9.57,"<30","<29.372","DOES NOT MEET","MEETS","N/A","N/A",29.372,30]
["Hanson Aggregates Southeast, Inc.","Crabtree Quarry - Raleigh","2019-03-13","#67 Stone for Electrochemical","CA61",{"$f":"VLOOKUP(Table16[[#This Row],[Facility ID]],'Coord.'!$A$1:$E$818,2,FALSE)","v":"N"},{"$f":"VLOOKUP(Table16[[#This Row],[Facility ID]],'Coord.'!$A$1:$E$818,3,FALSE)","v":35.846781999999997},{"$f":"VLOOKUP(Table16[[#This Row],[Facility ID]],'Coord.'!$A$1:$E$818,4,FALSE)","v":"W"},{"$f":"VLOOKUP(Table16[[#This Row],[Facility ID]],'Coord.'!$A$1:$E$818,5,FALSE)","v":-78.710387999999995},954289,"Skinner, III, John L",18360,8.8000000000000007,0,"<35.948","MEETS","MEETS","N/A","N/A",35.948,0]
["Martin Marietta","Denver Quarry - Denver","2019-08-28","#67 Stone for Electrochemical","CA169",{"$f":"VLOOKUP(Table16[[#This Row],[Facility ID]],'Coord.'!$A$1:$E$818,2,FALSE)","v":"N"},{"$f":"VLOOKUP(Table16[[#This Row],[Facility ID]],'Coord.'!$A$1:$E$818,3,FALSE)","v":35.527092000000003},{"$f":"VLOOKUP(Table16[[#This Row],[Facility ID]],'Coord.'!$A$1:$E$818,4,FALSE)","v":"W"},{"$f":"VLOOKUP(Table16[[#This Row],[Facility ID]],'Coord.'!$A$1:$E$818,5,FALSE)","v":-81.026443999999998},980194,"Brinson, Joseph",2476,3.97,"<32","<266.559","DOES NOT MEET","DOES NOT MEET","N/A","N/A",266.55900000000003,32]
["Vulcan Materials Co.","East Forsyth Quarry - Kernersville","2020-02-24","#67 Stone for Electrochemical","CA139",{"$f":"VLOOKUP(Table16[[#This Row],[Facility ID]],'Coord.'!$A$1:$E$818,2,FALSE)","v":"N"},{"$f":"VLOOKUP(Table16[[#This Row],[Facility ID]],'Coord.'!$A$1:$E$818,3,FALSE)","v":36.024622999999998},{"$f":"VLOOKUP(Table16[[#This Row],[Facility ID]],'Coord.'!$A$1:$E$818,4,FALSE)","v":"W"},{"$f":"VLOOKUP(Table16[[#This Row],[Facility ID]],'Coord.'!$A$1:$E$818,5,FALSE)","v":-80.060130000000001},1000307,"Ealey, Lee E",21680,9.36,"<30","<30.443","DOES NOT MEET","MEETS","N/A","N/A",30.443000000000001,30]
["Boxley Materials Company","Fieldale Quarry - Martinsville, VA","2019-03-05","#67 Stone for Electrochemical","CA142",{"$f":"VLOOKUP(Table16[[#This Row],[Facility ID]],'Coord.'!$A$1:$E$818,2,FALSE)","v":"N"},{"$f":"VLOOKUP(Table16[[#This Row],[Facility ID]],'Coord.'!$A$1:$E$818,3,FALSE)","v":36.688294999999997},{"$f":"VLOOKUP(Table16[[#This Row],[Facility ID]],'Coord.'!$A$1:$E$818,4,FALSE)","v":"W"},{"$f":"VLOOKUP(Table16[[#This Row],[Facility ID]],'Coord.'!$A$1:$E$818,5,FALSE)","v":-79.938883000000004},953148,"Westmoreland, Braxton J",10830,8.6999999999999993,0,"<60.942","MEETS","MEETS","N/A","N/A",60.942,0]
["Martin Marietta","Garner Quarry - Garner","2019-01-29","#67 Stone for Electrochemical","CA57",{"$f":"VLOOKUP(Table16[[#This Row],[Facility ID]],'Coord.'!$A$1:$E$818,2,FALSE)","v":"N"},{"$f":"VLOOKUP(Table16[[#This Row],[Facility ID]],'Coord.'!$A$1:$E$818,3,FALSE)","v":35.702164000000003},{"$f":"VLOOKUP(Table16[[#This Row],[Facility ID]],'Coord.'!$A$1:$E$818,4,FALSE)","v":"W"},{"$f":"VLOOKUP(Table16[[#This Row],[Facility ID]],'Coord.'!$A$1:$E$818,5,FALSE)","v":-78.577136999999993},947426,"Skinner, III, John L",21980,9.3000000000000007,0,"<30.027","DOES NOT MEET","MEETS","N/A","N/A",30.027000000000001,0]
["Carolina Stalite Corp.","Gold Hill (Light Wt.) - Gold Hill","2020-04-07","#67 Stone for Electrochemical","CA226",{"$f":"VLOOKUP(Table16[[#This Row],[Facility ID]],'Coord.'!$A$1:$E$818,2,FALSE)","v":"N"},{"$f":"VLOOKUP(Table16[[#This Row],[Facility ID]],'Coord.'!$A$1:$E$818,3,FALSE)","v":35.504739000000001},{"$f":"VLOOKUP(Table16[[#This Row],[Facility ID]],'Coord.'!$A$1:$E$818,4,FALSE)","v":"W"},{"$f":"VLOOKUP(Table16[[#This Row],[Facility ID]],'Coord.'!$A$1:$E$818,5,FALSE)","v":-80.330614999999995},1004812,"Whitley, Christopher D",8852,9.4499999999999993,"<30","<74.56","DOES NOT MEET","MEETS","N/A","N/A",74.56,30]
["Vulcan Materials Co.","Greystone Quarry - Henderson","2019-04-01","#67 Stone for Electrochemical","CA70",{"$f":"VLOOKUP(Table16[[#This Row],[Facility ID]],'Coord.'!$A$1:$E$818,2,FALSE)","v":"N"},{"$f":"VLOOKUP(Table16[[#This Row],[Facility ID]],'Coord.'!$A$1:$E$818,3,FALSE)","v":36.355213999999997},{"$f":"VLOOKUP(Table16[[#This Row],[Facility ID]],'Coord.'!$A$1:$E$818,4,FALSE)","v":"W"},{"$f":"VLOOKUP(Table16[[#This Row],[Facility ID]],'Coord.'!$A$1:$E$818,5,FALSE)","v":-78.348459000000005},957253,"Skinner, III, John L",24930,9.5,"<30","<26.474","DOES NOT MEET","MEETS",{"$f":"IF(OR(ISBLANK(L138), NOT(ISNUMBER(MATCH($E138, Coastal,0)))), \"N/A\", IF(AND(4.5 <= $M138, $M138 <= 9),IF($L138>=5000,IF($U138<=100,IF($T138<=200,\"MEETS\",\"DOES NOT MEET\"),\"DOES NOT MEET\"),\"DOES NOT MEET\"),\"DOES NOT MEET\"))","v":"N/A"},{"$f":"IF(OR(ISBLANK(M138), NOT(ISNUMBER(MATCH($E138, Coastal, 0)))), \"N/A\", IF(AND(5 <= $M138, $M138 <= 10),IF($L138>=5000,IF($U138<=100,IF($T138<=200,\"MEETS\",\"DOES NOT MEET\"),\"DOES NOT MEET\"),\"DOES NOT MEET\"),\"DOES NOT MEET\"))","v":"N/A"},26.474,30]
["Hedrick Industries","Grove Stone Quarry - Black Mountain","2016-04-08","#67 Stone for Electrochemical","CA146",{"$f":"VLOOKUP(Table16[[#This Row],[Facility ID]],'Coord.'!$A$1:$E$818,2,FALSE)","v":"N"},{"$f":"VLOOKUP(Table16[[#This Row],[Facility ID]],'Coord.'!$A$1:$E$818,3,FALSE)","v":35.610683999999999},{"$f":"VLOOKUP(Table16[[#This Row],[Facility ID]],'Coord.'!$A$1:$E$818,4,FALSE)","v":"W"},{"$f":"VLOOKUP(Table16[[#This Row],[Facility ID]],'Coord.'!$A$1:$E$818,5,FALSE)","v":-82.364768999999995},801531,"Rhymer, Robert C",11593,7,0,21,"MEETS","MEETS","N/A","N/A",21,0]
["Vulcan Materials Co.","Havre De Grace Quarry - Havre De Grace, MD","2020-09-21","#67 Stone for Electrochemical","CA345",{"$f":"VLOOKUP(Table16[[#This Row],[Facility ID]],'Coord.'!$A$1:$E$818,2,FALSE)","v":"N"},{"$f":"VLOOKUP(Table16[[#This Row],[Facility ID]],'Coord.'!$A$1:$E$818,3,FALSE)","v":35.584989999999998},{"$f":"VLOOKUP(Table16[[#This Row],[Facility ID]],'Coord.'!$A$1:$E$818,4,FALSE)","v":"W"},{"$f":"VLOOKUP(Table16[[#This Row],[Facility ID]],'Coord.'!$A$1:$E$818,5,FALSE)","v":-76.103046000000006},1021094,"Bonds, Maria M",13710,9.31,"<30","<48.140","DOES NOT MEET","MEETS","DOES NOT MEET","MEETS",48.14,30]
["Martin Marietta","Hickory Quarry - Hickory","2019-07-08","#67 Stone for Electrochemical","CA43",{"$f":"VLOOKUP(Table16[[#This Row],[Facility ID]],'Coord.'!$A$1:$E$818,2,FALSE)","v":"N"},{"$f":"VLOOKUP(Table16[[#This Row],[Facility ID]],'Coord.'!$A$1:$E$818,3,FALSE)","v":35.717019999999998},{"$f":"VLOOKUP(Table16[[#This Row],[Facility ID]],'Coord.'!$A$1:$E$818,4,FALSE)","v":"W"},{"$f":"VLOOKUP(Table16[[#This Row],[Facility ID]],'Coord.'!$A$1:$E$818,5,FALSE)","v":-81.301822999999999},971762,"Gosnell, Jimmy L",22660,9.4700000000000006,"<29","<29.126","DOES NOT MEET","MEETS","N/A","N/A",29.126000000000001,29]
["Hanson Aggregates Southeast, Inc.","Holly Springs Quarry","2019-03-29","#67 Stone for Electrochemical","CA282",{"$f":"VLOOKUP(Table16[[#This Row],[Facility ID]],'Coord.'!$A$1:$E$818,2,FALSE)","v":"N"},{"$f":"VLOOKUP(Table16[[#This Row],[Facility ID]],'Coord.'!$A$1:$E$818,3,FALSE)","v":35.602601999999997},{"$f":"VLOOKUP(Table16[[#This Row],[Facility ID]],'Coord.'!$A$1:$E$818,4,FALSE)","v":"W"},{"$f":"VLOOKUP(Table16[[#This Row],[Facility ID]],'Coord.'!$A$1:$E$818,5,FALSE)","v":-78.877609000000007},956968,"Skinner, III, John L",16520,9.3000000000000007,"<30","<39.952","DOES NOT MEET","MEETS","N/A","N/A",39.951999999999998,30]
["Vulcan Materials Co.","Jack Quarry - Petersburg, VA","2020-09-21","#67 Stone for Electrochemical","CA137",{"$f":"VLOOKUP(Table16[[#This Row],[Facility ID]],'Coord.'!$A$1:$E$818,2,FALSE)","v":0},{"$f":"VLOOKUP(Table16[[#This Row],[Facility ID]],'Coord.'!$A$1:$E$818,3,FALSE)","v":37.197637999999998},{"$f":"VLOOKUP(Table16[[#This Row],[Facility ID]],'Coord.'!$A$1:$E$818,4,FALSE)","v":0},{"$f":"VLOOKUP(Table16[[#This Row],[Facility ID]],'Coord.'!$A$1:$E$818,5,FALSE)","v":-77.504617999999994},1021106,"Bonds, Maria M",19570,9.52,"<30","<33.725","DOES NOT MEET","MEETS","DOES NOT MEET","MEETS",33.725000000000001,30]
["Martin Marietta","Jamestown Quarry - Jamestown","2019-06-04","#67 Stone for Electrochemical","CA46",{"$f":"VLOOKUP(Table16[[#This Row],[Facility ID]],'Coord.'!$A$1:$E$818,2,FALSE)","v":0},{"$f":"VLOOKUP(Table16[[#This Row],[Facility ID]],'Coord.'!$A$1:$E$818,3,FALSE)","v":35.964756000000001},{"$f":"VLOOKUP(Table16[[#This Row],[Facility ID]],'Coord.'!$A$1:$E$818,4,FALSE)","v":"W"},{"$f":"VLOOKUP(Table16[[#This Row],[Facility ID]],'Coord.'!$A$1:$E$818,5,FALSE)","v":-79.920193999999995},966791,"Waller, John M",26120,9.15,"<30","<25.268","DOES NOT MEET","MEETS","N/A","N/A",25.268000000000001,30]
["Hanson Aggregates Southeast, Inc.","Jefferson Quarry - Jefferson, SC","2019-09-13","#67 Stone for Electrochemical","CA120",{"$f":"VLOOKUP(Table16[[#This Row],[Facility ID]],'Coord.'!$A$1:$E$818,2,FALSE)","v":"N"},{"$f":"VLOOKUP(Table16[[#This Row],[Facility ID]],'Coord.'!$A$1:$E$818,3,FALSE)","v":34.699689999999997},{"$f":"VLOOKUP(Table16[[#This Row],[Facility ID]],'Coord.'!$A$1:$E$818,4,FALSE)","v":"W"},{"$f":"VLOOKUP(Table16[[#This Row],[Facility ID]],'Coord.'!$A$1:$E$818,5,FALSE)","v":-80.332674999999995},982914,"Jordan, Daniel H",29240,9.25,"<32","<22.573","DOES NOT MEET","MEETS","N/A","N/A",22.573,32]
["Martin Marietta","Kannapolis Quarry - Landis","2020-02-26","#67 Stone for Electrochemical","CA47",{"$f":"VLOOKUP(Table16[[#This Row],[Facility ID]],'Coord.'!$A$1:$E$818,2,FALSE)","v":"N"},{"$f":"VLOOKUP(Table16[[#This Row],[Facility ID]],'Coord.'!$A$1:$E$818,3,FALSE)","v":35.520546000000003},{"$f":"VLOOKUP(Table16[[#This Row],[Facility ID]],'Coord.'!$A$1:$E$818,4,FALSE)","v":"W"},{"$f":"VLOOKUP(Table16[[#This Row],[Facility ID]],'Coord.'!$A$1:$E$818,5,FALSE)","v":-80.584057999999999},1000982,"Ealey, Lee E",16709,8.99,"<30","<39.5","MEETS","MEETS","N/A","N/A",39.5,30]
["Martin Marietta","Kings Mountain Quarry - Kings Mountain","2019-07-01","#67 Stone for Electrochemical","CA48",{"$f":"VLOOKUP(Table16[[#This Row],[Facility ID]],'Coord.'!$A$1:$E$818,2,FALSE)","v":"N"},{"$f":"VLOOKUP(Table16[[#This Row],[Facility ID]],'Coord.'!$A$1:$E$818,3,FALSE)","v":35.225724},{"$f":"VLOOKUP(Table16[[#This Row],[Facility ID]],'Coord.'!$A$1:$E$818,4,FALSE)","v":"W"},{"$f":"VLOOKUP(Table16[[#This Row],[Facility ID]],'Coord.'!$A$1:$E$818,5,FALSE)","v":-81.339361999999994},970678,"Gosnell, Jimmy L",13190,9.27,"<29","<50.038","DOES NOT MEET","MEETS","N/A","N/A",50.037999999999997,29]
["Carolina Sunrock LLC","Kittrell Quarry - Kittrell","2019-02-01","#67 Stone for Electrochemical","CA304",{"$f":"VLOOKUP(Table16[[#This Row],[Facility ID]],'Coord.'!$A$1:$E$818,2,FALSE)","v":"N"},{"$f":"VLOOKUP(Table16[[#This Row],[Facility ID]],'Coord.'!$A$1:$E$818,3,FALSE)","v":36.169713000000002},{"$f":"VLOOKUP(Table16[[#This Row],[Facility ID]],'Coord.'!$A$1:$E$818,4,FALSE)","v":"W"},{"$f":"VLOOKUP(Table16[[#This Row],[Facility ID]],'Coord.'!$A$1:$E$818,5,FALSE)","v":-78.444863999999995},948021,"Skinner, III, John L",20820,9.3000000000000007,0,"<31.7","DOES NOT MEET","MEETS","N/A","N/A",31.7,0]
["Hedrick Industries","Lake Norman Quarry - Stanley","2019-07-12","#67 Stone for Electrochemical","CA168",{"$f":"VLOOKUP(Table16[[#This Row],[Facility ID]],'Coord.'!$A$1:$E$818,2,FALSE)","v":"N"},{"$f":"VLOOKUP(Table16[[#This Row],[Facility ID]],'Coord.'!$A$1:$E$818,3,FALSE)","v":35.428623999999999},{"$f":"VLOOKUP(Table16[[#This Row],[Facility ID]],'Coord.'!$A$1:$E$818,4,FALSE)","v":"W"},{"$f":"VLOOKUP(Table16[[#This Row],[Facility ID]],'Coord.'!$A$1:$E$818,5,FALSE)","v":-81.017241999999996},972392,"Gosnell, Jimmy L",7067,9.24,"<29","<71.467","DOES NOT MEET","MEETS","N/A","N/A",71.466999999999999,29]
["Martin Marietta","Lemon Springs - Sanford","2019-08-16","#67 Stone for Electrochemical","CA97",{"$f":"VLOOKUP(Table16[[#This Row],[Facility ID]],'Coord.'!$A$1:$E$818,2,FALSE)","v":0},{"$f":"VLOOKUP(Table16[[#This Row],[Facility ID]],'Coord.'!$A$1:$E$818,3,FALSE)","v":35.410660999999998},{"$f":"VLOOKUP(Table16[[#This Row],[Facility ID]],'Coord.'!$A$1:$E$818,4,FALSE)","v":0},{"$f":"VLOOKUP(Table16[[#This Row],[Facility ID]],'Coord.'!$A$1:$E$818,5,FALSE)","v":-79.206500000000005},978233,"Jackson, Brandon M",16730,9.33,"<29","<39.450","DOES NOT MEET","MEETS","N/A","N/A",39.450000000000003,29]
["Vulcan Materials Co.","Lenior Quarry - Lenoir","2006-08-25","#67 Stone for Electrochemical","CA91",{"$f":"VLOOKUP(Table16[[#This Row],[Facility ID]],'Coord.'!$A$1:$E$818,2,FALSE)","v":"N"},{"$f":"VLOOKUP(Table16[[#This Row],[Facility ID]],'Coord.'!$A$1:$E$818,3,FALSE)","v":35.935250000000003},{"$f":"VLOOKUP(Table16[[#This Row],[Facility ID]],'Coord.'!$A$1:$E$818,4,FALSE)","v":"W"},{"$f":"VLOOKUP(Table16[[#This Row],[Facility ID]],'Coord.'!$A$1:$E$818,5,FALSE)","v":-81.488753000000003},419986,"Church, Tracy G",22727,7.5,"<30","<200","MEETS","MEETS","N/A","N/A",200,30]
["Vulcan Materials Co.","Lenior Quarry - Lenoir","2006-08-25","#67 Stone for Electrochemical","CA91",{"$f":"VLOOKUP(Table16[[#This Row],[Facility ID]],'Coord.'!$A$1:$E$818,2,FALSE)","v":"N"},{"$f":"VLOOKUP(Table16[[#This Row],[Facility ID]],'Coord.'!$A$1:$E$818,3,FALSE)","v":35.935250000000003},{"$f":"VLOOKUP(Table16[[#This Row],[Facility ID]],'Coord.'!$A$1:$E$818,4,FALSE)","v":"W"},{"$f":"VLOOKUP(Table16[[#This Row],[Facility ID]],'Coord.'!$A$1:$E$818,5,FALSE)","v":-81.488753000000003},419987,"Church, Tracy G",18904,8.1,"<30","<200","MEETS","MEETS","N/A","N/A",200,30]
["Georgia Stone Products","Lynches River Quarry - Jefferson, SC","2016-02-11","#67 Stone for Electrochemical","CA325",{"$f":"VLOOKUP(Table16[[#This Row],[Facility ID]],'Coord.'!$A$1:$E$818,2,FALSE)","v":"N"},{"$f":"VLOOKUP(Table16[[#This Row],[Facility ID]],'Coord.'!$A$1:$E$818,3,FALSE)","v":34.703234999999999},{"$f":"VLOOKUP(Table16[[#This Row],[Facility ID]],'Coord.'!$A$1:$E$818,4,FALSE)","v":"W"},{"$f":"VLOOKUP(Table16[[#This Row],[Facility ID]],'Coord.'!$A$1:$E$818,5,FALSE)","v":-80.461099000000004},793641,"Jordan, Daniel H",30057,7.6,5.4,4.8,"MEETS","MEETS","N/A","N/A",4.8,5.4]
["Martin Marietta","Mallard Creek Quarry - Charlotte","2019-11-06","#67 Stone for Electrochemical","CA188",{"$f":"VLOOKUP(Table16[[#This Row],[Facility ID]],'Coord.'!$A$1:$E$818,2,FALSE)","v":"N"},{"$f":"VLOOKUP(Table16[[#This Row],[Facility ID]],'Coord.'!$A$1:$E$818,3,FALSE)","v":35.318085000000004},{"$f":"VLOOKUP(Table16[[#This Row],[Facility ID]],'Coord.'!$A$1:$E$818,4,FALSE)","v":"W"},{"$f":"VLOOKUP(Table16[[#This Row],[Facility ID]],'Coord.'!$A$1:$E$818,5,FALSE)","v":-80.728077999999996},990713,"Pegues, Jr., Henderson",17870,9.44,"<32","<36.933","DOES NOT MEET","MEETS","N/A","N/A",36.933,32]
["Hanson Aggregates Southeast, Inc.","Marlboro Plant - Bennettsville","2018-10-24","#67 Stone for Electrochemical","CA34",{"$f":"VLOOKUP(Table16[[#This Row],[Facility ID]],'Coord.'!$A$1:$E$818,2,FALSE)","v":"N"},{"$f":"VLOOKUP(Table16[[#This Row],[Facility ID]],'Coord.'!$A$1:$E$818,3,FALSE)","v":34.584676000000002},{"$f":"VLOOKUP(Table16[[#This Row],[Facility ID]],'Coord.'!$A$1:$E$818,4,FALSE)","v":"W"},{"$f":"VLOOKUP(Table16[[#This Row],[Facility ID]],'Coord.'!$A$1:$E$818,5,FALSE)","v":-79.748296999999994},936888,"Jordan, Daniel H",158500,5.9,0,"<4.2","MEETS","MEETS","N/A","N/A",4.2,0]
["Martin Marietta","Matthews Quarry - Matthews","2019-11-25","#67 Stone for Electrochemical","CA37",{"$f":"VLOOKUP(Table16[[#This Row],[Facility ID]],'Coord.'!$A$1:$E$818,2,FALSE)","v":0},{"$f":"VLOOKUP(Table16[[#This Row],[Facility ID]],'Coord.'!$A$1:$E$818,3,FALSE)","v":35.131262999999997},{"$f":"VLOOKUP(Table16[[#This Row],[Facility ID]],'Coord.'!$A$1:$E$818,4,FALSE)","v":"W"},{"$f":"VLOOKUP(Table16[[#This Row],[Facility ID]],'Coord.'!$A$1:$E$818,5,FALSE)","v":-80.720371999999998},993307,"Smith, Michael L",18460,9.3699999999999992,"<30","<35.753","DOES NOT MEET","MEETS","N/A","N/A",35.753,30]
["Blue Water Industries","Midway Quarry - Mascot, TN","2017-02-20","#67 Stone for Electrochemical","CA183",{"$f":"VLOOKUP(Table16[[#This Row],[Facility ID]],'Coord.'!$A$1:$E$818,2,FALSE)","v":"N"},{"$f":"VLOOKUP(Table16[[#This Row],[Facility ID]],'Coord.'!$A$1:$E$818,3,FALSE)","v":36.066125},{"$f":"VLOOKUP(Table16[[#This Row],[Facility ID]],'Coord.'!$A$1:$E$818,4,FALSE)","v":"W"},{"$f":"VLOOKUP(Table16[[#This Row],[Facility ID]],'Coord.'!$A$1:$E$818,5,FALSE)","v":-83.728346999999999},845872,"Rhymer, Robert C",17056,9.8000000000000007,0,38.200000000000003,"DOES NOT MEET","MEETS","N/A","N/A",38.200000000000003,0]
["Wake Stone Corp.","Moncure Quarry - Moncure","2019-02-05","#67 Stone for Electrochemical","CA100",{"$f":"VLOOKUP(Table16[[#This Row],[Facility ID]],'Coord.'!$A$1:$E$818,2,FALSE)","v":"N"},{"$f":"VLOOKUP(Table16[[#This Row],[Facility ID]],'Coord.'!$A$1:$E$818,3,FALSE)","v":35.616160000000001},{"$f":"VLOOKUP(Table16[[#This Row],[Facility ID]],'Coord.'!$A$1:$E$818,4,FALSE)","v":"W"},{"$f":"VLOOKUP(Table16[[#This Row],[Facility ID]],'Coord.'!$A$1:$E$818,5,FALSE)","v":-79.103876},948529,"Jordan, Daniel H",22870,9.4,0,"<28.859","DOES NOT MEET","MEETS","N/A","N/A",28.859000000000002,0]
["Vulcan Materials Co.","Morganton Quarry - Morganton","2016-04-21","#67 Stone for Electrochemical","CA7",{"$f":"VLOOKUP(Table16[[#This Row],[Facility ID]],'Coord.'!$A$1:$E$818,2,FALSE)","v":"N"},{"$f":"VLOOKUP(Table16[[#This Row],[Facility ID]],'Coord.'!$A$1:$E$818,3,FALSE)","v":35.461010000000002},{"$f":"VLOOKUP(Table16[[#This Row],[Facility ID]],'Coord.'!$A$1:$E$818,4,FALSE)","v":"W"},{"$f":"VLOOKUP(Table16[[#This Row],[Facility ID]],'Coord.'!$A$1:$E$818,5,FALSE)","v":-81.394000000000005},803453,"Ausley, Jeff A",22386,7.6,0,6.6,"MEETS","MEETS","N/A","N/A",6.6,0]
["Vulcan Materials Co.","North Quarry - Winston Salem","2020-02-25","#67 Stone for Electrochemical","CA72",{"$f":"VLOOKUP(Table16[[#This Row],[Facility ID]],'Coord.'!$A$1:$E$818,2,FALSE)","v":"N"},{"$f":"VLOOKUP(Table16[[#This Row],[Facility ID]],'Coord.'!$A$1:$E$818,3,FALSE)","v":36.176855000000003},{"$f":"VLOOKUP(Table16[[#This Row],[Facility ID]],'Coord.'!$A$1:$E$818,4,FALSE)","v":"W"},{"$f":"VLOOKUP(Table16[[#This Row],[Facility ID]],'Coord.'!$A$1:$E$818,5,FALSE)","v":-80.268285000000006},1000798,"Ealey, Lee E",22070,9.36,"<30","<29.905","DOES NOT MEET","MEETS","N/A","N/A",29.905000000000001,30]
["Vulcan Materials Co.","Pineville Quarry - Charlotte","2019-08-21","#67 Stone for Electrochemical","CA101",{"$f":"VLOOKUP(Table16[[#This Row],[Facility ID]],'Coord.'!$A$1:$E$818,2,FALSE)","v":"N"},{"$f":"VLOOKUP(Table16[[#This Row],[Facility ID]],'Coord.'!$A$1:$E$818,3,FALSE)","v":35.115856000000001},{"$f":"VLOOKUP(Table16[[#This Row],[Facility ID]],'Coord.'!$A$1:$E$818,4,FALSE)","v":"W"},{"$f":"VLOOKUP(Table16[[#This Row],[Facility ID]],'Coord.'!$A$1:$E$818,5,FALSE)","v":-80.896596000000002},979251,"Smith, Michael L",12880,9.39,"<32","<51.242","DOES NOT MEET","MEETS","N/A","N/A",51.241999999999997,32]
["Luck Stone Corporation","Pittsboro Quarry - Moncure","2016-03-29","#67 Stone for Electrochemical","CA292",{"$f":"VLOOKUP(Table16[[#This Row],[Facility ID]],'Coord.'!$A$1:$E$818,2,FALSE)","v":"N"},{"$f":"VLOOKUP(Table16[[#This Row],[Facility ID]],'Coord.'!$A$1:$E$818,3,FALSE)","v":35.660415999999998},{"$f":"VLOOKUP(Table16[[#This Row],[Facility ID]],'Coord.'!$A$1:$E$818,4,FALSE)","v":"W"},{"$f":"VLOOKUP(Table16[[#This Row],[Facility ID]],'Coord.'!$A$1:$E$818,5,FALSE)","v":-79.176833000000002},799656,"Jackson, Brandon M",20833,8.6,0,6.1,"MEETS","MEETS","N/A","N/A",6.1,0]
["Martin Marietta","Pomona Quarry - Greensboro","2019-05-28","#67 Stone for Electrochemical","CA51",{"$f":"VLOOKUP(Table16[[#This Row],[Facility ID]],'Coord.'!$A$1:$E$818,2,FALSE)","v":0},{"$f":"VLOOKUP(Table16[[#This Row],[Facility ID]],'Coord.'!$A$1:$E$818,3,FALSE)","v":36.060417999999999},{"$f":"VLOOKUP(Table16[[#This Row],[Facility ID]],'Coord.'!$A$1:$E$818,4,FALSE)","v":0},{"$f":"VLOOKUP(Table16[[#This Row],[Facility ID]],'Coord.'!$A$1:$E$818,5,FALSE)","v":-79.925364999999999},965377,"Waller, John M",17760,9.5,"<30","<37.162","DOES NOT MEET","MEETS","N/A","N/A",37.161999999999999,30]
["Hanson Aggregates Southeast, Inc.","Raleigh Quarry - Wake Forest","2019-01-09","#67 Stone for Electrochemical","CA67",{"$f":"VLOOKUP(Table16[[#This Row],[Facility ID]],'Coord.'!$A$1:$E$818,2,FALSE)","v":"N"},{"$f":"VLOOKUP(Table16[[#This Row],[Facility ID]],'Coord.'!$A$1:$E$818,3,FALSE)","v":35.931106999999997},{"$f":"VLOOKUP(Table16[[#This Row],[Facility ID]],'Coord.'!$A$1:$E$818,4,FALSE)","v":"W"},{"$f":"VLOOKUP(Table16[[#This Row],[Facility ID]],'Coord.'!$A$1:$E$818,5,FALSE)","v":-78.543345000000002},944668,"Skinner, III, John L",21840,9.5,0,"<30.22","DOES NOT MEET","MEETS","N/A","N/A",30.22,0]
["Martin Marietta","Raleigh-Durham Quarry - Raleigh","2019-01-18","#67 Stone for Electrochemical","CA156",{"$f":"VLOOKUP(Table16[[#This Row],[Facility ID]],'Coord.'!$A$1:$E$818,2,FALSE)","v":"N"},{"$f":"VLOOKUP(Table16[[#This Row],[Facility ID]],'Coord.'!$A$1:$E$818,3,FALSE)","v":35.894070999999997},{"$f":"VLOOKUP(Table16[[#This Row],[Facility ID]],'Coord.'!$A$1:$E$818,4,FALSE)","v":"W"},{"$f":"VLOOKUP(Table16[[#This Row],[Facility ID]],'Coord.'!$A$1:$E$818,5,FALSE)","v":-78.749120000000005},946459,"Skinner, III, John L",6298,10.7,0,"<104.795","DOES NOT MEET","DOES NOT MEET","N/A","N/A",104.795,0]
["Martin Marietta","Reidsville Quarry - Reidsville","2019-02-13","#67 Stone for Electrochemical","CA52",{"$f":"VLOOKUP(Table16[[#This Row],[Facility ID]],'Coord.'!$A$1:$E$818,2,FALSE)","v":0},{"$f":"VLOOKUP(Table16[[#This Row],[Facility ID]],'Coord.'!$A$1:$E$818,3,FALSE)","v":36.371012},{"$f":"VLOOKUP(Table16[[#This Row],[Facility ID]],'Coord.'!$A$1:$E$818,4,FALSE)","v":0},{"$f":"VLOOKUP(Table16[[#This Row],[Facility ID]],'Coord.'!$A$1:$E$818,5,FALSE)","v":-79.726775000000004},949848,"Westmoreland, Braxton J",19290,9.4,0,"<34.215","DOES NOT MEET","MEETS","N/A","N/A",34.215000000000003,0]
["Martin Marietta","Rock Hill Quarry - Rock Hill, SC","2019-09-10","#67 Stone for Electrochemical","CA271",{"$f":"VLOOKUP(Table16[[#This Row],[Facility ID]],'Coord.'!$A$1:$E$818,2,FALSE)","v":"N"},{"$f":"VLOOKUP(Table16[[#This Row],[Facility ID]],'Coord.'!$A$1:$E$818,3,FALSE)","v":34.894787000000001},{"$f":"VLOOKUP(Table16[[#This Row],[Facility ID]],'Coord.'!$A$1:$E$818,4,FALSE)","v":"W"},{"$f":"VLOOKUP(Table16[[#This Row],[Facility ID]],'Coord.'!$A$1:$E$818,5,FALSE)","v":-80.999021999999997},982307,"Adair, Mildred (Millie) L",15260,9.52,"<32","<43.25","DOES NOT MEET","MEETS","N/A","N/A",43.25,32]
["Vulcan Materials Co.","Rockingham Quarry - Rockingham","2019-08-13","#67 Stone for Electrochemical","CA94",{"$f":"VLOOKUP(Table16[[#This Row],[Facility ID]],'Coord.'!$A$1:$E$818,2,FALSE)","v":"N"},{"$f":"VLOOKUP(Table16[[#This Row],[Facility ID]],'Coord.'!$A$1:$E$818,3,FALSE)","v":34.938706000000003},{"$f":"VLOOKUP(Table16[[#This Row],[Facility ID]],'Coord.'!$A$1:$E$818,4,FALSE)","v":"W"},{"$f":"VLOOKUP(Table16[[#This Row],[Facility ID]],'Coord.'!$A$1:$E$818,5,FALSE)","v":-79.823207999999994},977703,"Jordan, Daniel H",17110,9.4499999999999993,"<29","<38.574","DOES NOT MEET","MEETS","N/A","N/A",38.573999999999998,29]
["Hanson Aggregates Southeast, Inc.","Rougemont Quarry","2019-01-11","#67 Stone for Electrochemical","CA217",{"$f":"VLOOKUP(Table16[[#This Row],[Facility ID]],'Coord.'!$A$1:$E$818,2,FALSE)","v":"N"},{"$f":"VLOOKUP(Table16[[#This Row],[Facility ID]],'Coord.'!$A$1:$E$818,3,FALSE)","v":36.224888},{"$f":"VLOOKUP(Table16[[#This Row],[Facility ID]],'Coord.'!$A$1:$E$818,4,FALSE)","v":"W"},{"$f":"VLOOKUP(Table16[[#This Row],[Facility ID]],'Coord.'!$A$1:$E$818,5,FALSE)","v":-78.951487999999998},945245,"Skinner, III, John L",22770,9.6999999999999993,0,"<28.986","DOES NOT MEET","MEETS","N/A","N/A",28.986000000000001,0]
["Martin Marietta","Salem Stone Quarry - Kernersville","2020-03-10","#67 Stone for Electrochemical","CA209",{"$f":"VLOOKUP(Table16[[#This Row],[Facility ID]],'Coord.'!$A$1:$E$818,2,FALSE)","v":"N"},{"$f":"VLOOKUP(Table16[[#This Row],[Facility ID]],'Coord.'!$A$1:$E$818,3,FALSE)","v":36.035980000000002},{"$f":"VLOOKUP(Table16[[#This Row],[Facility ID]],'Coord.'!$A$1:$E$818,4,FALSE)","v":"W"},{"$f":"VLOOKUP(Table16[[#This Row],[Facility ID]],'Coord.'!$A$1:$E$818,5,FALSE)","v":-80.106778000000006},1005503,"Ealey, Lee E",22730,9.6,"<30","<29.037","DOES NOT MEET","MEETS","N/A","N/A",29.036999999999999,30]
["Hanson Aggregates Southeast, Inc.","Sandy Flats Quarry - Taylors, SC","2016-12-14","#67 Stone for Electrochemical","CA298",{"$f":"VLOOKUP(Table16[[#This Row],[Facility ID]],'Coord.'!$A$1:$E$818,2,FALSE)","v":"N"},{"$f":"VLOOKUP(Table16[[#This Row],[Facility ID]],'Coord.'!$A$1:$E$818,3,FALSE)","v":35.008490999999999},{"$f":"VLOOKUP(Table16[[#This Row],[Facility ID]],'Coord.'!$A$1:$E$818,4,FALSE)","v":"W"},{"$f":"VLOOKUP(Table16[[#This Row],[Facility ID]],'Coord.'!$A$1:$E$818,5,FALSE)","v":-82.345754999999997},839142,"Wood, Dean Michael M",21013,7.6,0,1.6,"MEETS","MEETS","N/A","N/A",1.6,0]
["Martin Marietta","Savannah Marine Terminal","2018-12-28","#67 Stone for Electrochemical","CA425",{"$f":"VLOOKUP(Table16[[#This Row],[Facility ID]],'Coord.'!$A$1:$E$818,2,FALSE)","v":"N"},{"$f":"VLOOKUP(Table16[[#This Row],[Facility ID]],'Coord.'!$A$1:$E$818,3,FALSE)","v":32.076151000000003},{"$f":"VLOOKUP(Table16[[#This Row],[Facility ID]],'Coord.'!$A$1:$E$818,4,FALSE)","v":"W"},{"$f":"VLOOKUP(Table16[[#This Row],[Facility ID]],'Coord.'!$A$1:$E$818,5,FALSE)","v":-81.048097999999996},944230,"Maynard, William BJ T",16280,9.5,0,"<40.541","DOES NOT MEET","MEETS","N/A","N/A",40.540999999999997,0]
["Vulcan Materials Co.","Skippers Quarry - Skippers, VA","2019-02-21","#67 Stone for Electrochemical","CA55",{"$f":"VLOOKUP(Table16[[#This Row],[Facility ID]],'Coord.'!$A$1:$E$818,2,FALSE)","v":"N"},{"$f":"VLOOKUP(Table16[[#This Row],[Facility ID]],'Coord.'!$A$1:$E$818,3,FALSE)","v":36.608707000000003},{"$f":"VLOOKUP(Table16[[#This Row],[Facility ID]],'Coord.'!$A$1:$E$818,4,FALSE)","v":"W"},{"$f":"VLOOKUP(Table16[[#This Row],[Facility ID]],'Coord.'!$A$1:$E$818,5,FALSE)","v":-77.582424000000003},952208,"Thomas, Grady Q",15800,9.6,"<30","<41.772","DOES NOT MEET","MEETS","DOES NOT MEET","MEETS",41.771999999999998,30]
["Vulcan Materials Co.","Smith Grove Q. - Mocksville","2020-02-03","#67 Stone for Electrochemical","CA80",{"$f":"VLOOKUP(Table16[[#This Row],[Facility ID]],'Coord.'!$A$1:$E$818,2,FALSE)","v":"N"},{"$f":"VLOOKUP(Table16[[#This Row],[Facility ID]],'Coord.'!$A$1:$E$818,3,FALSE)","v":35.967185000000001},{"$f":"VLOOKUP(Table16[[#This Row],[Facility ID]],'Coord.'!$A$1:$E$818,4,FALSE)","v":"W"},{"$f":"VLOOKUP(Table16[[#This Row],[Facility ID]],'Coord.'!$A$1:$E$818,5,FALSE)","v":-80.530692999999999},998597,"Ealey, Lee E",23390,9.52,"<30","<28.217","DOES NOT MEET","MEETS","N/A","N/A",28.216999999999999,30]
["Salem Stone Corp.","Southside Materials - Shelton Quarry - Pelham","2019-02-28","#67 Stone for Electrochemical","CA75",{"$f":"VLOOKUP(Table16[[#This Row],[Facility ID]],'Coord.'!$A$1:$E$818,2,FALSE)","v":0},{"$f":"VLOOKUP(Table16[[#This Row],[Facility ID]],'Coord.'!$A$1:$E$818,3,FALSE)","v":36.535156999999998},{"$f":"VLOOKUP(Table16[[#This Row],[Facility ID]],'Coord.'!$A$1:$E$818,4,FALSE)","v":0},{"$f":"VLOOKUP(Table16[[#This Row],[Facility ID]],'Coord.'!$A$1:$E$818,5,FALSE)","v":-79.459670000000003},952402,"Westmoreland, Braxton J",22470,9.3000000000000007,0,"<29.372","DOES NOT MEET","MEETS","N/A","N/A",29.372,0]
["Martin Marietta","Statesville Quarry - Statesville","2019-10-09","#67 Stone for Electrochemical","CA54",{"$f":"VLOOKUP(Table16[[#This Row],[Facility ID]],'Coord.'!$A$1:$E$818,2,FALSE)","v":"N"},{"$f":"VLOOKUP(Table16[[#This Row],[Facility ID]],'Coord.'!$A$1:$E$818,3,FALSE)","v":35.804465999999998},{"$f":"VLOOKUP(Table16[[#This Row],[Facility ID]],'Coord.'!$A$1:$E$818,4,FALSE)","v":"W"},{"$f":"VLOOKUP(Table16[[#This Row],[Facility ID]],'Coord.'!$A$1:$E$818,5,FALSE)","v":-80.913083999999998},987452,"Brinson, Joseph",9875,9.41,"<30","<66.835","DOES NOT MEET","MEETS","N/A","N/A",66.834999999999994,30]
["Vulcan Materials Co.","Stokesdale Quarry - Stokesdale","2019-02-28","#67 Stone for Electrochemical","CA76",{"$f":"VLOOKUP(Table16[[#This Row],[Facility ID]],'Coord.'!$A$1:$E$818,2,FALSE)","v":0},{"$f":"VLOOKUP(Table16[[#This Row],[Facility ID]],'Coord.'!$A$1:$E$818,3,FALSE)","v":36.241660000000003},{"$f":"VLOOKUP(Table16[[#This Row],[Facility ID]],'Coord.'!$A$1:$E$818,4,FALSE)","v":"W"},{"$f":"VLOOKUP(Table16[[#This Row],[Facility ID]],'Coord.'!$A$1:$E$818,5,FALSE)","v":-79.935815000000005},952376,"Westmoreland, Braxton J",28210,9.3000000000000007,0,"<23.396","DOES NOT MEET","MEETS","N/A","N/A",23.396000000000001,0]
["Martin Marietta","Thomasville Quarry - Thomasville","2020-03-10","#67 Stone for Electrochemical","CA102",{"$f":"VLOOKUP(Table16[[#This Row],[Facility ID]],'Coord.'!$A$1:$E$818,2,FALSE)","v":"N"},{"$f":"VLOOKUP(Table16[[#This Row],[Facility ID]],'Coord.'!$A$1:$E$818,3,FALSE)","v":35.853850000000001},{"$f":"VLOOKUP(Table16[[#This Row],[Facility ID]],'Coord.'!$A$1:$E$818,4,FALSE)","v":"W"},{"$f":"VLOOKUP(Table16[[#This Row],[Facility ID]],'Coord.'!$A$1:$E$818,5,FALSE)","v":-80.160167999999999},1005547,"Ealey, Lee E",19780,9.69,"<30","<33.367","DOES NOT MEET","MEETS","N/A","N/A",33.366999999999997,30]
["Wake Stone Corp.","Triangle Quarry - Cary","2019-02-27","#67 Stone for Electrochemical","CA157",{"$f":"VLOOKUP(Table16[[#This Row],[Facility ID]],'Coord.'!$A$1:$E$818,2,FALSE)","v":"N"},{"$f":"VLOOKUP(Table16[[#This Row],[Facility ID]],'Coord.'!$A$1:$E$818,3,FALSE)","v":35.838397000000001},{"$f":"VLOOKUP(Table16[[#This Row],[Facility ID]],'Coord.'!$A$1:$E$818,4,FALSE)","v":"W"},{"$f":"VLOOKUP(Table16[[#This Row],[Facility ID]],'Coord.'!$A$1:$E$818,5,FALSE)","v":-78.767809},951911,"Skinner, III, John L",19980,9.5,0,"<33.033","DOES NOT MEET","MEETS","N/A","N/A",33.033000000000001,0]
["Harrison Construction Co., Inc.","Waynesville Quarry - Waynesville","2008-12-09","#67 Stone for Electrochemical","CA1",{"$f":"VLOOKUP(Table16[[#This Row],[Facility ID]],'Coord.'!$A$1:$E$818,2,FALSE)","v":"N"},{"$f":"VLOOKUP(Table16[[#This Row],[Facility ID]],'Coord.'!$A$1:$E$818,3,FALSE)","v":35.440697},{"$f":"VLOOKUP(Table16[[#This Row],[Facility ID]],'Coord.'!$A$1:$E$818,4,FALSE)","v":"W"},{"$f":"VLOOKUP(Table16[[#This Row],[Facility ID]],'Coord.'!$A$1:$E$818,5,FALSE)","v":-83.007457000000002},475184,"Hughes, Joseph W",6309,7.6,"<27","<200","MEETS","MEETS","N/A","N/A",200,27]
["Martin Marietta","Woodleaf Quarry - Salisbury","2020-03-03","#67 Stone for Electrochemical","CA56",{"$f":"VLOOKUP(Table16[[#This Row],[Facility ID]],'Coord.'!$A$1:$E$818,2,FALSE)","v":"N"},{"$f":"VLOOKUP(Table16[[#This Row],[Facility ID]],'Coord.'!$A$1:$E$818,3,FALSE)","v":35.773539},{"$f":"VLOOKUP(Table16[[#This Row],[Facility ID]],'Coord.'!$A$1:$E$818,4,FALSE)","v":"W"},{"$f":"VLOOKUP(Table16[[#This Row],[Facility ID]],'Coord.'!$A$1:$E$818,5,FALSE)","v":-80.598793000000001},1005348,"Ealey, Lee E",16770,9.4499999999999993,"<30","<39.356","DOES NOT MEET","MEETS","N/A","N/A",39.356000000000002,30]
["Carolina Sunrock LLC","Woodsdale Quarry - Roxboro","2019-01-11","#67 Stone for Electrochemical","CA329",{"$f":"VLOOKUP(Table16[[#This Row],[Facility ID]],'Coord.'!$A$1:$E$818,2,FALSE)","v":"N"},{"$f":"VLOOKUP(Table16[[#This Row],[Facility ID]],'Coord.'!$A$1:$E$818,3,FALSE)","v":36.516776},{"$f":"VLOOKUP(Table16[[#This Row],[Facility ID]],'Coord.'!$A$1:$E$818,4,FALSE)","v":"W"},{"$f":"VLOOKUP(Table16[[#This Row],[Facility ID]],'Coord.'!$A$1:$E$818,5,FALSE)","v":-78.963525000000004},945250,"Skinner, III, John L",22230,9.5,0,"<29.69","DOES NOT MEET","MEETS","N/A","N/A",29.69,0]
["Vulcan Materials Co.","115 Quarry - N. Wilkesboro","2018-05-10","#57 Stone for Electrochemical","CA79",{"$f":"VLOOKUP(Table16[[#This Row],[Facility ID]],'Coord.'!$A$1:$E$818,2,FALSE)","v":"N"},{"$f":"VLOOKUP(Table16[[#This Row],[Facility ID]],'Coord.'!$A$1:$E$818,3,FALSE)","v":36.106467000000002},{"$f":"VLOOKUP(Table16[[#This Row],[Facility ID]],'Coord.'!$A$1:$E$818,4,FALSE)","v":"W"},{"$f":"VLOOKUP(Table16[[#This Row],[Facility ID]],'Coord.'!$A$1:$E$818,5,FALSE)","v":-81.099030999999997},910653,"Patrie, Garin T",19387,8.8000000000000007,0,29.4,"MEETS","MEETS","N/A","N/A",29.4,0]
["Blue Water Industries","Abingdon Quarry","2016-09-28","#57 Stone for Electrochemical","CA251",{"$f":"VLOOKUP(Table16[[#This Row],[Facility ID]],'Coord.'!$A$1:$E$818,2,FALSE)","v":"N"},{"$f":"VLOOKUP(Table16[[#This Row],[Facility ID]],'Coord.'!$A$1:$E$818,3,FALSE)","v":36.695324999999997},{"$f":"VLOOKUP(Table16[[#This Row],[Facility ID]],'Coord.'!$A$1:$E$818,4,FALSE)","v":"W"},{"$f":"VLOOKUP(Table16[[#This Row],[Facility ID]],'Coord.'!$A$1:$E$818,5,FALSE)","v":-81.982737},828584,"Church, Tracy G",8741,7.7,0,14.2,"MEETS","MEETS","N/A","N/A",14.2,0]
["Martin Marietta","American Stone - Carrboro","2016-03-02","#57 Stone for Electrochemical","CA2",{"$f":"VLOOKUP(Table16[[#This Row],[Facility ID]],'Coord.'!$A$1:$E$818,2,FALSE)","v":"N"},{"$f":"VLOOKUP(Table16[[#This Row],[Facility ID]],'Coord.'!$A$1:$E$818,3,FALSE)","v":35.927264999999998},{"$f":"VLOOKUP(Table16[[#This Row],[Facility ID]],'Coord.'!$A$1:$E$818,4,FALSE)","v":"W"},{"$f":"VLOOKUP(Table16[[#This Row],[Facility ID]],'Coord.'!$A$1:$E$818,5,FALSE)","v":-79.153772000000004},795851,"Fosque, Robert W",22989,8.9,0,4,"MEETS","MEETS","N/A","N/A",4,0]
["Hedrick Industries","Aquadale Quarry - Norwood","2019-09-24","#57 Stone for Electrochemical","CA274",{"$f":"VLOOKUP(Table16[[#This Row],[Facility ID]],'Coord.'!$A$1:$E$818,2,FALSE)","v":"N"},{"$f":"VLOOKUP(Table16[[#This Row],[Facility ID]],'Coord.'!$A$1:$E$818,3,FALSE)","v":35.236497999999997},{"$f":"VLOOKUP(Table16[[#This Row],[Facility ID]],'Coord.'!$A$1:$E$818,4,FALSE)","v":"W"},{"$f":"VLOOKUP(Table16[[#This Row],[Facility ID]],'Coord.'!$A$1:$E$818,5,FALSE)","v":-80.239287000000004},984751,"Smith, Michael L",11040,8.92,"<32","<59.783","MEETS","MEETS","N/A","N/A",59.783000000000001,32]
["Martin Marietta","Arrowood Quarry - Charlotte","2016-02-24","#57 Stone for Electrochemical","CA31",{"$f":"VLOOKUP(Table16[[#This Row],[Facility ID]],'Coord.'!$A$1:$E$818,2,FALSE)","v":"N"},{"$f":"VLOOKUP(Table16[[#This Row],[Facility ID]],'Coord.'!$A$1:$E$818,3,FALSE)","v":35.111865000000002},{"$f":"VLOOKUP(Table16[[#This Row],[Facility ID]],'Coord.'!$A$1:$E$818,4,FALSE)","v":"W"},{"$f":"VLOOKUP(Table16[[#This Row],[Facility ID]],'Coord.'!$A$1:$E$818,5,FALSE)","v":-80.921875},796031,"Adair, Mildred (Millie) L",22826,7.7,0,9.6999999999999993,"MEETS","MEETS","N/A","N/A",9.6999999999999993,0]
["Martin Marietta","Asheboro Quarry - Asheboro","2019-08-22","#57 Stone for Electrochemical","CA30",{"$f":"VLOOKUP(Table16[[#This Row],[Facility ID]],'Coord.'!$A$1:$E$818,2,FALSE)","v":"N"},{"$f":"VLOOKUP(Table16[[#This Row],[Facility ID]],'Coord.'!$A$1:$E$818,3,FALSE)","v":35.766084999999997},{"$f":"VLOOKUP(Table16[[#This Row],[Facility ID]],'Coord.'!$A$1:$E$818,4,FALSE)","v":"W"},{"$f":"VLOOKUP(Table16[[#This Row],[Facility ID]],'Coord.'!$A$1:$E$818,5,FALSE)","v":-79.823999000000001},979357,"Jackson, Brandon M",18060,9.17,"<29","<36.545","DOES NOT MEET","MEETS","N/A","N/A",36.545000000000002,29]
["Martin Marietta","Bakers Quarry - Monroe","2019-11-27","#57 Stone for Electrochemical","CA32",{"$f":"VLOOKUP(Table16[[#This Row],[Facility ID]],'Coord.'!$A$1:$E$818,2,FALSE)","v":"N"},{"$f":"VLOOKUP(Table16[[#This Row],[Facility ID]],'Coord.'!$A$1:$E$818,3,FALSE)","v":35.027617999999997},{"$f":"VLOOKUP(Table16[[#This Row],[Facility ID]],'Coord.'!$A$1:$E$818,4,FALSE)","v":"W"},{"$f":"VLOOKUP(Table16[[#This Row],[Facility ID]],'Coord.'!$A$1:$E$818,5,FALSE)","v":-80.603740999999999},993357,"Smith, Michael L",22460,9.34,"<30","<29.386","DOES NOT MEET","MEETS","N/A","N/A",29.385999999999999,30]
["Radford Quarries Of Boone, Inc.","Bamboo Quarry","2016-02-08","#57 Stone for Electrochemical","CA122",{"$f":"VLOOKUP(Table16[[#This Row],[Facility ID]],'Coord.'!$A$1:$E$818,2,FALSE)","v":"N"},{"$f":"VLOOKUP(Table16[[#This Row],[Facility ID]],'Coord.'!$A$1:$E$818,3,FALSE)","v":36.215747},{"$f":"VLOOKUP(Table16[[#This Row],[Facility ID]],'Coord.'!$A$1:$E$818,4,FALSE)","v":"W"},{"$f":"VLOOKUP(Table16[[#This Row],[Facility ID]],'Coord.'!$A$1:$E$818,5,FALSE)","v":-81.636511999999996},793016,"Church, Tracy G",19073,7.4,0,6.7,"MEETS","MEETS","N/A","N/A",6.7,0]
["Martin Marietta","Benson Quarry - Benson","2016-03-16","#57 Stone for Electrochemical","CA176",{"$f":"VLOOKUP(Table16[[#This Row],[Facility ID]],'Coord.'!$A$1:$E$818,2,FALSE)","v":"N"},{"$f":"VLOOKUP(Table16[[#This Row],[Facility ID]],'Coord.'!$A$1:$E$818,3,FALSE)","v":35.422584999999998},{"$f":"VLOOKUP(Table16[[#This Row],[Facility ID]],'Coord.'!$A$1:$E$818,4,FALSE)","v":"W"},{"$f":"VLOOKUP(Table16[[#This Row],[Facility ID]],'Coord.'!$A$1:$E$818,5,FALSE)","v":-78.501491999999999},798243,"Raines, James R",27917,7.7,0,0,"MEETS","MEETS","N/A","N/A",0,0]
["Sloan Construction Co.","Blacksburg Quarry - Blacksburg, SC","2019-08-22","#57 Stone for Electrochemical","CA382",{"$f":"VLOOKUP(Table16[[#This Row],[Facility ID]],'Coord.'!$A$1:$E$818,2,FALSE)","v":"N"},{"$f":"VLOOKUP(Table16[[#This Row],[Facility ID]],'Coord.'!$A$1:$E$818,3,FALSE)","v":35.136633000000003},{"$f":"VLOOKUP(Table16[[#This Row],[Facility ID]],'Coord.'!$A$1:$E$818,4,FALSE)","v":"W"},{"$f":"VLOOKUP(Table16[[#This Row],[Facility ID]],'Coord.'!$A$1:$E$818,5,FALSE)","v":81.528683000000001},979539,"Brinson, Joseph",48690,7.52,"<29","<13.555","MEETS","MEETS","N/A","N/A",13.555,29]
["Appalachian Aggregates, LLC","Bluefield Plant","2017-03-22","#57 Stone for Electrochemical","CA307",{"$f":"VLOOKUP(Table16[[#This Row],[Facility ID]],'Coord.'!$A$1:$E$818,2,FALSE)","v":"N"},{"$f":"VLOOKUP(Table16[[#This Row],[Facility ID]],'Coord.'!$A$1:$E$818,3,FALSE)","v":37.236153999999999},{"$f":"VLOOKUP(Table16[[#This Row],[Facility ID]],'Coord.'!$A$1:$E$818,4,FALSE)","v":"W"},{"$f":"VLOOKUP(Table16[[#This Row],[Facility ID]],'Coord.'!$A$1:$E$818,5,FALSE)","v":-81.319535000000002},850413,"Church, Tracy G",16706,9.4,0,36.799999999999997,"DOES NOT MEET","MEETS","N/A","N/A",36.799999999999997,0]
["Martin Marietta","Bonds Quarry - Concord","2018-09-10","#57 Stone for Electrochemical","CA276",{"$f":"VLOOKUP(Table16[[#This Row],[Facility ID]],'Coord.'!$A$1:$E$818,2,FALSE)","v":"N"},{"$f":"VLOOKUP(Table16[[#This Row],[Facility ID]],'Coord.'!$A$1:$E$818,3,FALSE)","v":35.379277999999999},{"$f":"VLOOKUP(Table16[[#This Row],[Facility ID]],'Coord.'!$A$1:$E$818,4,FALSE)","v":"W"},{"$f":"VLOOKUP(Table16[[#This Row],[Facility ID]],'Coord.'!$A$1:$E$818,5,FALSE)","v":-80.698134999999994},930587,"Pegues, Jr., Henderson",14640,9.5,7.5,"<45.97",{"$f":"IF(AND(4.5 <= $M194, $M194 <= 9), \"MEETS\", \"DOES NOT MEET\")","v":"DOES NOT MEET"},{"$f":"IF(AND(5 <= $M194, $M194 <= 10), \"MEETS\", \"DOES NOT MEET\")","v":"MEETS"},"N/A","N/A",{"$f":"IF(LEFT(O194, 1)=\"<\", VALUE(RIGHT(O194,LEN(O194)-1)), O194)","v":45.97},{"$f":"IF(LEFT(N194, 1)=\"<\", VALUE(RIGHT(N194,LEN(N194)-1)), N194)","v":7.5}]
["Vulcan Materials Co.","Boone Quarry - Boone","2019-11-22","#57 Stone for Electrochemical","CA21",{"$f":"VLOOKUP(Table16[[#This Row],[Facility ID]],'Coord.'!$A$1:$E$818,2,FALSE)","v":"N"},{"$f":"VLOOKUP(Table16[[#This Row],[Facility ID]],'Coord.'!$A$1:$E$818,3,FALSE)","v":36.205551},{"$f":"VLOOKUP(Table16[[#This Row],[Facility ID]],'Coord.'!$A$1:$E$818,4,FALSE)","v":"W"},{"$f":"VLOOKUP(Table16[[#This Row],[Facility ID]],'Coord.'!$A$1:$E$818,5,FALSE)","v":-81.718419999999995},993803,"Church, Tracy G",81740,7.97,"<30","<8.074","MEETS","MEETS","N/A","N/A",8.0739999999999998,30]
["Martin Marietta","Burlington Quarry - Burlington","2016-02-29","#57 Stone for Electrochemical","CA39",{"$f":"VLOOKUP(Table16[[#This Row],[Facility ID]],'Coord.'!$A$1:$E$818,2,FALSE)","v":"N"},{"$f":"VLOOKUP(Table16[[#This Row],[Facility ID]],'Coord.'!$A$1:$E$818,3,FALSE)","v":36.051876},{"$f":"VLOOKUP(Table16[[#This Row],[Facility ID]],'Coord.'!$A$1:$E$818,4,FALSE)","v":"W"},{"$f":"VLOOKUP(Table16[[#This Row],[Facility ID]],'Coord.'!$A$1:$E$818,5,FALSE)","v":-79.508236999999994},795917,"Loshinskiy, Roman",18420,8.9,0,4,"MEETS","MEETS","N/A","N/A",4,0]
["Carolina Sunrock LLC","Butner Quarry - Butner","2016-02-08","#57 Stone for Electrochemical","CA178",{"$f":"VLOOKUP(Table16[[#This Row],[Facility ID]],'Coord.'!$A$1:$E$818,2,FALSE)","v":"N"},{"$f":"VLOOKUP(Table16[[#This Row],[Facility ID]],'Coord.'!$A$1:$E$818,3,FALSE)","v":36.121974999999999},{"$f":"VLOOKUP(Table16[[#This Row],[Facility ID]],'Coord.'!$A$1:$E$818,4,FALSE)","v":"W"},{"$f":"VLOOKUP(Table16[[#This Row],[Facility ID]],'Coord.'!$A$1:$E$818,5,FALSE)","v":-78.772541000000004},793015,"Skinner, III, John L",19697,9.1999999999999993,0,0,"DOES NOT MEET","MEETS","N/A","N/A",0,0]
["Vulcan Materials Co.","Cabarrus Quarry - Concord","2019-09-24","#57 Stone for Electrochemical","CA186",{"$f":"VLOOKUP(Table16[[#This Row],[Facility ID]],'Coord.'!$A$1:$E$818,2,FALSE)","v":"N"},{"$f":"VLOOKUP(Table16[[#This Row],[Facility ID]],'Coord.'!$A$1:$E$818,3,FALSE)","v":35.404029999999999},{"$f":"VLOOKUP(Table16[[#This Row],[Facility ID]],'Coord.'!$A$1:$E$818,4,FALSE)","v":"W"},{"$f":"VLOOKUP(Table16[[#This Row],[Facility ID]],'Coord.'!$A$1:$E$818,5,FALSE)","v":-80.704829000000004},984941,"Cero, Kevin M",15810,9.58,"<32","<41.746","DOES NOT MEET","MEETS","N/A","N/A",41.746000000000002,32]
["Salem Stone Corp.","Cardinal Quarries - Smethport Quarry - W. Jefferson","2016-08-02","#57 Stone for Electrochemical","CA123",{"$f":"VLOOKUP(Table16[[#This Row],[Facility ID]],'Coord.'!$A$1:$E$818,2,FALSE)","v":"N"},{"$f":"VLOOKUP(Table16[[#This Row],[Facility ID]],'Coord.'!$A$1:$E$818,3,FALSE)","v":36.439355999999997},{"$f":"VLOOKUP(Table16[[#This Row],[Facility ID]],'Coord.'!$A$1:$E$818,4,FALSE)","v":"W"},{"$f":"VLOOKUP(Table16[[#This Row],[Facility ID]],'Coord.'!$A$1:$E$818,5,FALSE)","v":-81.488720000000001},819961,"Church, Tracy G",14002,9.1999999999999993,0,17.3,"DOES NOT MEET","MEETS","N/A","N/A",17.3,0]
["Salem Stone Corp.","Cardinal Realty - Galax Quarry - Galax, VA","2016-03-07","#57 Stone for Electrochemical","CA11",{"$f":"VLOOKUP(Table16[[#This Row],[Facility ID]],'Coord.'!$A$1:$E$818,2,FALSE)","v":"N"},{"$f":"VLOOKUP(Table16[[#This Row],[Facility ID]],'Coord.'!$A$1:$E$818,3,FALSE)","v":36.574818999999998},{"$f":"VLOOKUP(Table16[[#This Row],[Facility ID]],'Coord.'!$A$1:$E$818,4,FALSE)","v":"W"},{"$f":"VLOOKUP(Table16[[#This Row],[Facility ID]],'Coord.'!$A$1:$E$818,5,FALSE)","v":-80.929176999999996},797284,"Whitley, Christopher D",14977,7.8,0,5.6,"MEETS","MEETS","N/A","N/A",5.6,0]
["Martin Marietta","Castle Hayne Quarry - Castle Hayne","2016-08-16","#57 Stone for Electrochemical","CA40",{"$f":"VLOOKUP(Table16[[#This Row],[Facility ID]],'Coord.'!$A$1:$E$818,2,FALSE)","v":"N"},{"$f":"VLOOKUP(Table16[[#This Row],[Facility ID]],'Coord.'!$A$1:$E$818,3,FALSE)","v":34.356884000000001},{"$f":"VLOOKUP(Table16[[#This Row],[Facility ID]],'Coord.'!$A$1:$E$818,4,FALSE)","v":"W"},{"$f":"VLOOKUP(Table16[[#This Row],[Facility ID]],'Coord.'!$A$1:$E$818,5,FALSE)","v":-77.864245999999994},821247,"Cahill, Luke R",4174,8.1999999999999993,4.3,69.2,"MEETS","MEETS","N/A","N/A",69.2,4.3]
["Martin Marietta","Castle Hayne Yard - Castle Hayne","2016-08-16","#57 Stone for Electrochemical","CA319",{"$f":"VLOOKUP(Table16[[#This Row],[Facility ID]],'Coord.'!$A$1:$E$818,2,FALSE)","v":"N"},{"$f":"VLOOKUP(Table16[[#This Row],[Facility ID]],'Coord.'!$A$1:$E$818,3,FALSE)","v":34.359216000000004},{"$f":"VLOOKUP(Table16[[#This Row],[Facility ID]],'Coord.'!$A$1:$E$818,4,FALSE)","v":"W"},{"$f":"VLOOKUP(Table16[[#This Row],[Facility ID]],'Coord.'!$A$1:$E$818,5,FALSE)","v":-77.857907999999995},821246,"Cahill, Luke R",20125,9.3000000000000007,0,3.8,"DOES NOT MEET","MEETS",{"$f":"IF(OR(ISBLANK(L202), NOT(ISNUMBER(MATCH($E202, Coastal,0)))), \"N/A\", IF(AND(4.5 <= $M202, $M202 <= 9),IF($L202>=5000,IF($U202<=100,IF($T202<=200,\"MEETS\",\"DOES NOT MEET\"),\"DOES NOT MEET\"),\"DOES NOT MEET\"),\"DOES NOT MEET\"))","v":"DOES NOT MEET"},{"$f":"IF(OR(ISBLANK(M202), NOT(ISNUMBER(MATCH($E202, Coastal, 0)))), \"N/A\", IF(AND(5 <= $M202, $M202 <= 10),IF($L202>=5000,IF($U202<=100,IF($T202<=200,\"MEETS\",\"DOES NOT MEET\"),\"DOES NOT MEET\"),\"DOES NOT MEET\"),\"DOES NOT MEET\"))","v":"MEETS"},3.8,0]
["Martin Marietta","Central Rock Quarry - Greensboro","2019-06-04","#57 Stone for Electrochemical","CA28",{"$f":"VLOOKUP(Table16[[#This Row],[Facility ID]],'Coord.'!$A$1:$E$818,2,FALSE)","v":"N"},{"$f":"VLOOKUP(Table16[[#This Row],[Facility ID]],'Coord.'!$A$1:$E$818,3,FALSE)","v":36.005654},{"$f":"VLOOKUP(Table16[[#This Row],[Facility ID]],'Coord.'!$A$1:$E$818,4,FALSE)","v":"W"},{"$f":"VLOOKUP(Table16[[#This Row],[Facility ID]],'Coord.'!$A$1:$E$818,5,FALSE)","v":-79.748210999999998},966790,"Waller, John M",17480,9.49,"<30","<37.757","DOES NOT MEET","MEETS","N/A","N/A",37.756999999999998,30]
["Martin Marietta","Charlotte Quarry - Charlotte","2019-07-10","#57 Stone for Electrochemical","CA41",{"$f":"VLOOKUP(Table16[[#This Row],[Facility ID]],'Coord.'!$A$1:$E$818,2,FALSE)","v":"N"},{"$f":"VLOOKUP(Table16[[#This Row],[Facility ID]],'Coord.'!$A$1:$E$818,3,FALSE)","v":35.297229000000002},{"$f":"VLOOKUP(Table16[[#This Row],[Facility ID]],'Coord.'!$A$1:$E$818,4,FALSE)","v":"W"},{"$f":"VLOOKUP(Table16[[#This Row],[Facility ID]],'Coord.'!$A$1:$E$818,5,FALSE)","v":-80.863066000000003},972755,"Pegues, Jr., Henderson",17300,9.56,"<29","<38.150","DOES NOT MEET","MEETS","N/A","N/A",38.15,29]
["Vulcan Materials Co.","Clear Creek Q. - Charlotte","2020-02-04","#57 Stone for Electrochemical","CA249",{"$f":"VLOOKUP(Table16[[#This Row],[Facility ID]],'Coord.'!$A$1:$E$818,2,FALSE)","v":"N"},{"$f":"VLOOKUP(Table16[[#This Row],[Facility ID]],'Coord.'!$A$1:$E$818,3,FALSE)","v":35.220500000000001},{"$f":"VLOOKUP(Table16[[#This Row],[Facility ID]],'Coord.'!$A$1:$E$818,4,FALSE)","v":"W"},{"$f":"VLOOKUP(Table16[[#This Row],[Facility ID]],'Coord.'!$A$1:$E$818,5,FALSE)","v":-80.647542000000001},998428,"Pegues, Jr., Henderson",24690,9.57,"<30","<26.731","DOES NOT MEET","MEETS","N/A","N/A",26.731000000000002,30]
["Hanson Aggregates Southeast, Inc.","Crabtree Quarry - Raleigh","2016-02-19","#57 Stone for Electrochemical","CA61",{"$f":"VLOOKUP(Table16[[#This Row],[Facility ID]],'Coord.'!$A$1:$E$818,2,FALSE)","v":"N"},{"$f":"VLOOKUP(Table16[[#This Row],[Facility ID]],'Coord.'!$A$1:$E$818,3,FALSE)","v":35.846781999999997},{"$f":"VLOOKUP(Table16[[#This Row],[Facility ID]],'Coord.'!$A$1:$E$818,4,FALSE)","v":"W"},{"$f":"VLOOKUP(Table16[[#This Row],[Facility ID]],'Coord.'!$A$1:$E$818,5,FALSE)","v":-78.710387999999995},794467,"Skinner, III, John L",24396,7.9,0,3.8,"MEETS","MEETS","N/A","N/A",3.8,0]
["Martin Marietta","Cumberland Quarry","2011-10-28","#57 Stone for Electrochemical","CA339",{"$f":"VLOOKUP(Table16[[#This Row],[Facility ID]],'Coord.'!$A$1:$E$818,2,FALSE)","v":"N"},{"$f":"VLOOKUP(Table16[[#This Row],[Facility ID]],'Coord.'!$A$1:$E$818,3,FALSE)","v":35.215510000000002},{"$f":"VLOOKUP(Table16[[#This Row],[Facility ID]],'Coord.'!$A$1:$E$818,4,FALSE)","v":"W"},{"$f":"VLOOKUP(Table16[[#This Row],[Facility ID]],'Coord.'!$A$1:$E$818,5,FALSE)","v":-78.933400000000006},606382,"Stewart, Ernest C",11507,7.4,0,0,"MEETS","MEETS","N/A","N/A",0,0]
["Young & McQueen","Dellinger Waste Area (Area 1)","2014-03-12","#57 Stone for Electrochemical","CA391",{"$f":"VLOOKUP(Table16[[#This Row],[Facility ID]],'Coord.'!$A$1:$E$818,2,FALSE)","v":"N"},{"$f":"VLOOKUP(Table16[[#This Row],[Facility ID]],'Coord.'!$A$1:$E$818,3,FALSE)","v":35.912036999999998},{"$f":"VLOOKUP(Table16[[#This Row],[Facility ID]],'Coord.'!$A$1:$E$818,4,FALSE)","v":"W"},{"$f":"VLOOKUP(Table16[[#This Row],[Facility ID]],'Coord.'!$A$1:$E$818,5,FALSE)","v":-82.232461999999998},700493,"Rhymer, Robert C",15074,6.5,0,0,"MEETS","MEETS","N/A","N/A",0,0]
["Young & McQueen","Dellinger Waste Area (Area 2)","2013-09-18","#57 Stone for Electrochemical","CA378",{"$f":"VLOOKUP(Table16[[#This Row],[Facility ID]],'Coord.'!$A$1:$E$818,2,FALSE)","v":"N"},{"$f":"VLOOKUP(Table16[[#This Row],[Facility ID]],'Coord.'!$A$1:$E$818,3,FALSE)","v":35.912036999999998},{"$f":"VLOOKUP(Table16[[#This Row],[Facility ID]],'Coord.'!$A$1:$E$818,4,FALSE)","v":"W"},{"$f":"VLOOKUP(Table16[[#This Row],[Facility ID]],'Coord.'!$A$1:$E$818,5,FALSE)","v":-82.232461999999998},681225,"Rhymer, Robert C",4484,6.9,"","","MEETS","MEETS","N/A","N/A","",""]
["Martin Marietta","Denver Quarry - Denver","2019-09-20","#57 Stone for Electrochemical","CA169",{"$f":"VLOOKUP(Table16[[#This Row],[Facility ID]],'Coord.'!$A$1:$E$818,2,FALSE)","v":"N"},{"$f":"VLOOKUP(Table16[[#This Row],[Facility ID]],'Coord.'!$A$1:$E$818,3,FALSE)","v":35.527092000000003},{"$f":"VLOOKUP(Table16[[#This Row],[Facility ID]],'Coord.'!$A$1:$E$818,4,FALSE)","v":"W"},{"$f":"VLOOKUP(Table16[[#This Row],[Facility ID]],'Coord.'!$A$1:$E$818,5,FALSE)","v":-81.026443999999998},983979,"Myers, Jesse J",14160,8.98,"<32","<46.610","MEETS","MEETS","N/A","N/A",46.61,32]
["Harrison Construction Co., Inc.","Dillsboro Quarry - Dillsboro","2019-02-13","#57 Stone for Electrochemical","CA15",{"$f":"VLOOKUP(Table16[[#This Row],[Facility ID]],'Coord.'!$A$1:$E$818,2,FALSE)","v":"N"},{"$f":"VLOOKUP(Table16[[#This Row],[Facility ID]],'Coord.'!$A$1:$E$818,3,FALSE)","v":35.365220999999998},{"$f":"VLOOKUP(Table16[[#This Row],[Facility ID]],'Coord.'!$A$1:$E$818,4,FALSE)","v":"W"},{"$f":"VLOOKUP(Table16[[#This Row],[Facility ID]],'Coord.'!$A$1:$E$818,5,FALSE)","v":-83.261218},949672,"Ledford, Brandon S",10630,8.9,0,"<62.088","MEETS","MEETS","N/A","N/A",62.088000000000001,0]
["Martin Marietta","East Alamance Quarry - Haw River","2018-09-10","#57 Stone for Electrochemical","CA201",{"$f":"VLOOKUP(Table16[[#This Row],[Facility ID]],'Coord.'!$A$1:$E$818,2,FALSE)","v":0},{"$f":"VLOOKUP(Table16[[#This Row],[Facility ID]],'Coord.'!$A$1:$E$818,3,FALSE)","v":36.131428},{"$f":"VLOOKUP(Table16[[#This Row],[Facility ID]],'Coord.'!$A$1:$E$818,4,FALSE)","v":0},{"$f":"VLOOKUP(Table16[[#This Row],[Facility ID]],'Coord.'!$A$1:$E$818,5,FALSE)","v":-79.34957},930500,"Waller, John M",20310,9.6,15,"<29.34","DOES NOT MEET","MEETS","N/A","N/A",29.34,15]
["Martin Marietta","East Alamance Sales Yard","2016-02-08","#57 Stone for Electrochemical","CA377",{"$f":"VLOOKUP(Table16[[#This Row],[Facility ID]],'Coord.'!$A$1:$E$818,2,FALSE)","v":"N"},{"$f":"VLOOKUP(Table16[[#This Row],[Facility ID]],'Coord.'!$A$1:$E$818,3,FALSE)","v":36.126730000000002},{"$f":"VLOOKUP(Table16[[#This Row],[Facility ID]],'Coord.'!$A$1:$E$818,4,FALSE)","v":"W"},{"$f":"VLOOKUP(Table16[[#This Row],[Facility ID]],'Coord.'!$A$1:$E$818,5,FALSE)","v":-79.347309999999993},793260,"Westmoreland, Braxton J",19350,7,5,11.1,"MEETS","MEETS","N/A","N/A",11.1,5]
["Vulcan Materials Co.","East Forsyth Quarry - Kernersville","2020-02-24","#57 Stone for Electrochemical","CA139",{"$f":"VLOOKUP(Table16[[#This Row],[Facility ID]],'Coord.'!$A$1:$E$818,2,FALSE)","v":"N"},{"$f":"VLOOKUP(Table16[[#This Row],[Facility ID]],'Coord.'!$A$1:$E$818,3,FALSE)","v":36.024622999999998},{"$f":"VLOOKUP(Table16[[#This Row],[Facility ID]],'Coord.'!$A$1:$E$818,4,FALSE)","v":"W"},{"$f":"VLOOKUP(Table16[[#This Row],[Facility ID]],'Coord.'!$A$1:$E$818,5,FALSE)","v":-80.060130000000001},1000306,"Ealey, Lee E",19230,9.3800000000000008,"<30","<34.321","DOES NOT MEET","MEETS","N/A","N/A",34.320999999999998,30]
["Ararat Rock Products","Eden Quarry - Eden","2019-03-12","#57 Stone for Electrochemical","CA374",{"$f":"VLOOKUP(Table16[[#This Row],[Facility ID]],'Coord.'!$A$1:$E$818,2,FALSE)","v":"N"},{"$f":"VLOOKUP(Table16[[#This Row],[Facility ID]],'Coord.'!$A$1:$E$818,3,FALSE)","v":36.541252},{"$f":"VLOOKUP(Table16[[#This Row],[Facility ID]],'Coord.'!$A$1:$E$818,4,FALSE)","v":"W"},{"$f":"VLOOKUP(Table16[[#This Row],[Facility ID]],'Coord.'!$A$1:$E$818,5,FALSE)","v":-79.665728000000001},954433,"Westmoreland, Braxton J",9873,9,0,"<66.849","MEETS","MEETS","N/A","N/A",66.849000000000004,0]
["Blue Water Industries","Elizabethton Quarry","2016-09-28","#57 Stone for Electrochemical","CA401",{"$f":"VLOOKUP(Table16[[#This Row],[Facility ID]],'Coord.'!$A$1:$E$818,2,FALSE)","v":"N"},{"$f":"VLOOKUP(Table16[[#This Row],[Facility ID]],'Coord.'!$A$1:$E$818,3,FALSE)","v":36.379508999999999},{"$f":"VLOOKUP(Table16[[#This Row],[Facility ID]],'Coord.'!$A$1:$E$818,4,FALSE)","v":"W"},{"$f":"VLOOKUP(Table16[[#This Row],[Facility ID]],'Coord.'!$A$1:$E$818,5,FALSE)","v":-82.183282000000005},828607,"Church, Tracy G",15265,7.3,0,9.6999999999999993,"MEETS","MEETS","N/A","N/A",9.6999999999999993,0]
["Vulcan Materials Co.","Elkin Quarry - Elkin","2006-01-04","#57 Stone for Electrochemical","CA68",{"$f":"VLOOKUP(Table16[[#This Row],[Facility ID]],'Coord.'!$A$1:$E$818,2,FALSE)","v":"N"},{"$f":"VLOOKUP(Table16[[#This Row],[Facility ID]],'Coord.'!$A$1:$E$818,3,FALSE)","v":36.256413999999999},{"$f":"VLOOKUP(Table16[[#This Row],[Facility ID]],'Coord.'!$A$1:$E$818,4,FALSE)","v":"W"},{"$f":"VLOOKUP(Table16[[#This Row],[Facility ID]],'Coord.'!$A$1:$E$818,5,FALSE)","v":-80.811103000000003},400141,"Wagoner, Roy M",34560,7.1,"< 30","< 200","MEETS","MEETS","N/A","N/A",200,30]
["Vulcan Materials Co.","Enka Quarry - Enka","2019-09-05","#57 Stone for Electrochemical","CA69",{"$f":"VLOOKUP(Table16[[#This Row],[Facility ID]],'Coord.'!$A$1:$E$818,2,FALSE)","v":"N"},{"$f":"VLOOKUP(Table16[[#This Row],[Facility ID]],'Coord.'!$A$1:$E$818,3,FALSE)","v":35.323700000000002},{"$f":"VLOOKUP(Table16[[#This Row],[Facility ID]],'Coord.'!$A$1:$E$818,4,FALSE)","v":"W"},{"$f":"VLOOKUP(Table16[[#This Row],[Facility ID]],'Coord.'!$A$1:$E$818,5,FALSE)","v":-82.400899999999993},981847,"Rhymer, Robert C",12720,8.17,"<32","<51.887","MEETS","MEETS","N/A","N/A",51.887,32]
["Boxley Materials Company","Fieldale Quarry - Martinsville, VA","2019-03-05","#57 Stone for Electrochemical","CA142",{"$f":"VLOOKUP(Table16[[#This Row],[Facility ID]],'Coord.'!$A$1:$E$818,2,FALSE)","v":"N"},{"$f":"VLOOKUP(Table16[[#This Row],[Facility ID]],'Coord.'!$A$1:$E$818,3,FALSE)","v":36.688294999999997},{"$f":"VLOOKUP(Table16[[#This Row],[Facility ID]],'Coord.'!$A$1:$E$818,4,FALSE)","v":"W"},{"$f":"VLOOKUP(Table16[[#This Row],[Facility ID]],'Coord.'!$A$1:$E$818,5,FALSE)","v":-79.938883000000004},953147,"Westmoreland, Braxton J",13260,8.9,0,"<49.774","MEETS","MEETS","N/A","N/A",49.774000000000001,0]
["Martin Marietta","Fountain Quarry - Fountain","2020-09-25","#57 Stone for Electrochemical","CA42",{"$f":"VLOOKUP(Table16[[#This Row],[Facility ID]],'Coord.'!$A$1:$E$818,2,FALSE)","v":"N"},{"$f":"VLOOKUP(Table16[[#This Row],[Facility ID]],'Coord.'!$A$1:$E$818,3,FALSE)","v":35.668506000000001},{"$f":"VLOOKUP(Table16[[#This Row],[Facility ID]],'Coord.'!$A$1:$E$818,4,FALSE)","v":"W"},{"$f":"VLOOKUP(Table16[[#This Row],[Facility ID]],'Coord.'!$A$1:$E$818,5,FALSE)","v":-77.630317000000005},1021240,"Cobb, James R",22540,9.2200000000000006,"<30","<29.281","DOES NOT MEET","MEETS","DOES NOT MEET","MEETS",29.280999999999999,30]
["Harrison Construction Co., Inc.","Franklin Quarry - Franklin","2019-01-17","#57 Stone for Electrochemical","CA16",{"$f":"VLOOKUP(Table16[[#This Row],[Facility ID]],'Coord.'!$A$1:$E$818,2,FALSE)","v":"N"},{"$f":"VLOOKUP(Table16[[#This Row],[Facility ID]],'Coord.'!$A$1:$E$818,3,FALSE)","v":35.163902},{"$f":"VLOOKUP(Table16[[#This Row],[Facility ID]],'Coord.'!$A$1:$E$818,4,FALSE)","v":"W"},{"$f":"VLOOKUP(Table16[[#This Row],[Facility ID]],'Coord.'!$A$1:$E$818,5,FALSE)","v":-83.425331},946029,"Ledford, Brandon S",20250,7.8,0,"<32.593","MEETS","MEETS","N/A","N/A",32.593000000000004,0]
["Martin Marietta","Franklin Quarry - Franklinton","2019-03-27","#57 Stone for Electrochemical","CA270",{"$f":"VLOOKUP(Table16[[#This Row],[Facility ID]],'Coord.'!$A$1:$E$818,2,FALSE)","v":"N"},{"$f":"VLOOKUP(Table16[[#This Row],[Facility ID]],'Coord.'!$A$1:$E$818,3,FALSE)","v":36.070531000000003},{"$f":"VLOOKUP(Table16[[#This Row],[Facility ID]],'Coord.'!$A$1:$E$818,4,FALSE)","v":"W"},{"$f":"VLOOKUP(Table16[[#This Row],[Facility ID]],'Coord.'!$A$1:$E$818,5,FALSE)","v":-78.485541999999995},956770,"Skinner, III, John L",21320,9.6,"<30","<30.957","DOES NOT MEET","MEETS","N/A","N/A",30.957000000000001,30]
["Martin Marietta","Fuquay Quarry - Fuquay-Varina","2019-01-31","#57 Stone for Electrochemical","CA220",{"$f":"VLOOKUP(Table16[[#This Row],[Facility ID]],'Coord.'!$A$1:$E$818,2,FALSE)","v":0},{"$f":"VLOOKUP(Table16[[#This Row],[Facility ID]],'Coord.'!$A$1:$E$818,3,FALSE)","v":35.579534000000002},{"$f":"VLOOKUP(Table16[[#This Row],[Facility ID]],'Coord.'!$A$1:$E$818,4,FALSE)","v":"W"},{"$f":"VLOOKUP(Table16[[#This Row],[Facility ID]],'Coord.'!$A$1:$E$818,5,FALSE)","v":-78.875698999999997},947851,"Skinner, III, John L",25920,9.4,0,"<25.463","DOES NOT MEET","MEETS","N/A","N/A",25.463000000000001,0]
["Vulcan Materials Co.","Gold Hill Quarry - Gold Hill","2020-02-20","#57 Stone for Electrochemical","CA85",{"$f":"VLOOKUP(Table16[[#This Row],[Facility ID]],'Coord.'!$A$1:$E$818,2,FALSE)","v":"N"},{"$f":"VLOOKUP(Table16[[#This Row],[Facility ID]],'Coord.'!$A$1:$E$818,3,FALSE)","v":35.507567999999999},{"$f":"VLOOKUP(Table16[[#This Row],[Facility ID]],'Coord.'!$A$1:$E$818,4,FALSE)","v":"W"},{"$f":"VLOOKUP(Table16[[#This Row],[Facility ID]],'Coord.'!$A$1:$E$818,5,FALSE)","v":-80.323988},1000215,"Ealey, Lee E",7432,8.4499999999999993,"<30","<88.805","MEETS","MEETS","N/A","N/A",88.805000000000007,30]
["Vulcan Materials Co.","Greystone Quarry - Henderson","2016-02-10","#57 Stone for Electrochemical","CA70",{"$f":"VLOOKUP(Table16[[#This Row],[Facility ID]],'Coord.'!$A$1:$E$818,2,FALSE)","v":"N"},{"$f":"VLOOKUP(Table16[[#This Row],[Facility ID]],'Coord.'!$A$1:$E$818,3,FALSE)","v":36.355213999999997},{"$f":"VLOOKUP(Table16[[#This Row],[Facility ID]],'Coord.'!$A$1:$E$818,4,FALSE)","v":"W"},{"$f":"VLOOKUP(Table16[[#This Row],[Facility ID]],'Coord.'!$A$1:$E$818,5,FALSE)","v":-78.348459000000005},793394,"Skinner, III, John L",24225,8.9,0,0,"MEETS","MEETS","N/A","N/A",0,0]
["Hedrick Industries","Grove Stone Quarry - Black Mountain","2019-04-23","#57 Stone for Electrochemical","CA146",{"$f":"VLOOKUP(Table16[[#This Row],[Facility ID]],'Coord.'!$A$1:$E$818,2,FALSE)","v":"N"},{"$f":"VLOOKUP(Table16[[#This Row],[Facility ID]],'Coord.'!$A$1:$E$818,3,FALSE)","v":35.610683999999999},{"$f":"VLOOKUP(Table16[[#This Row],[Facility ID]],'Coord.'!$A$1:$E$818,4,FALSE)","v":"W"},{"$f":"VLOOKUP(Table16[[#This Row],[Facility ID]],'Coord.'!$A$1:$E$818,5,FALSE)","v":-82.364768999999995},960223,"Rhymer, Robert C",17500,9.4,"<30","<37.714","DOES NOT MEET","MEETS","N/A","N/A",37.713999999999999,30]
["Harrison Construction Co., Inc.","Hayesville Quarry - Hayesville","2016-07-15","#57 Stone for Electrochemical","CA195",{"$f":"VLOOKUP(Table16[[#This Row],[Facility ID]],'Coord.'!$A$1:$E$818,2,FALSE)","v":"N"},{"$f":"VLOOKUP(Table16[[#This Row],[Facility ID]],'Coord.'!$A$1:$E$818,3,FALSE)","v":34.991819999999997},{"$f":"VLOOKUP(Table16[[#This Row],[Facility ID]],'Coord.'!$A$1:$E$818,4,FALSE)","v":"W"},{"$f":"VLOOKUP(Table16[[#This Row],[Facility ID]],'Coord.'!$A$1:$E$818,5,FALSE)","v":-83.848622000000006},816317,"Ledford, Brandon S",17449,8.8000000000000007,2.1,28.9,"MEETS","MEETS","N/A","N/A",28.9,2.1]
["Vulcan Materials Co.","Hendersonville Quarry - Hendersonville","2020-07-27","#57 Stone for Electrochemical","CA81",{"$f":"VLOOKUP(Table16[[#This Row],[Facility ID]],'Coord.'!$A$1:$E$818,2,FALSE)","v":"N"},{"$f":"VLOOKUP(Table16[[#This Row],[Facility ID]],'Coord.'!$A$1:$E$818,3,FALSE)","v":35.364775000000002},{"$f":"VLOOKUP(Table16[[#This Row],[Facility ID]],'Coord.'!$A$1:$E$818,4,FALSE)","v":"W"},{"$f":"VLOOKUP(Table16[[#This Row],[Facility ID]],'Coord.'!$A$1:$E$818,5,FALSE)","v":-82.454474000000005},1015163,"Wood, Dean Michael M",27630,9.5399999999999991,"<30","<23.887","DOES NOT MEET","MEETS","N/A","N/A",23.887,30]
["Rogers Group, Inc.","Henrietta Quarry - Mooresboro","2019-04-30","#57 Stone for Electrochemical","CA369",{"$f":"VLOOKUP(Table16[[#This Row],[Facility ID]],'Coord.'!$A$1:$E$818,2,FALSE)","v":"N"},{"$f":"VLOOKUP(Table16[[#This Row],[Facility ID]],'Coord.'!$A$1:$E$818,3,FALSE)","v":35.239412999999999},{"$f":"VLOOKUP(Table16[[#This Row],[Facility ID]],'Coord.'!$A$1:$E$818,4,FALSE)","v":"W"},{"$f":"VLOOKUP(Table16[[#This Row],[Facility ID]],'Coord.'!$A$1:$E$818,5,FALSE)","v":-81.814165000000003},961358,"Rhymer, Robert C",23820,9.4,"<30","<27.696","DOES NOT MEET","MEETS","N/A","N/A",27.696000000000002,30]
["L.B.M. Industries","Hewitt Quarry - Topton","2011-07-26","#57 Stone for Electrochemical","CA23",{"$f":"VLOOKUP(Table16[[#This Row],[Facility ID]],'Coord.'!$A$1:$E$818,2,FALSE)","v":"N"},{"$f":"VLOOKUP(Table16[[#This Row],[Facility ID]],'Coord.'!$A$1:$E$818,3,FALSE)","v":35.18289},{"$f":"VLOOKUP(Table16[[#This Row],[Facility ID]],'Coord.'!$A$1:$E$818,4,FALSE)","v":"W"},{"$f":"VLOOKUP(Table16[[#This Row],[Facility ID]],'Coord.'!$A$1:$E$818,5,FALSE)","v":-83.389880000000005},595688,"Cross, Adam D",17301,8.9,0,0,"MEETS","MEETS","N/A","N/A",0,0]
["Martin Marietta","Hickory Quarry - Hickory","2019-07-08","#57 Stone for Electrochemical","CA43",{"$f":"VLOOKUP(Table16[[#This Row],[Facility ID]],'Coord.'!$A$1:$E$818,2,FALSE)","v":"N"},{"$f":"VLOOKUP(Table16[[#This Row],[Facility ID]],'Coord.'!$A$1:$E$818,3,FALSE)","v":35.717019999999998},{"$f":"VLOOKUP(Table16[[#This Row],[Facility ID]],'Coord.'!$A$1:$E$818,4,FALSE)","v":"W"},{"$f":"VLOOKUP(Table16[[#This Row],[Facility ID]],'Coord.'!$A$1:$E$818,5,FALSE)","v":-81.301822999999999},971761,"Gosnell, Jimmy L",22040,9.4,"<29","<29.946","DOES NOT MEET","MEETS","N/A","N/A",29.946000000000002,29]
["Martin Marietta","Hicone Quarry","2003-12-02","#57 Stone for Electrochemical","CA44",{"$f":"VLOOKUP(Table16[[#This Row],[Facility ID]],'Coord.'!$A$1:$E$818,2,FALSE)","v":0},{"$f":"VLOOKUP(Table16[[#This Row],[Facility ID]],'Coord.'!$A$1:$E$818,3,FALSE)","v":0},{"$f":"VLOOKUP(Table16[[#This Row],[Facility ID]],'Coord.'!$A$1:$E$818,4,FALSE)","v":0},{"$f":"VLOOKUP(Table16[[#This Row],[Facility ID]],'Coord.'!$A$1:$E$818,5,FALSE)","v":0},320591,"Cassada, James Tim",24160,7.2,26,"","MEETS","MEETS","N/A","N/A","",26]
["Hanson Aggregates Southeast, Inc.","Holly Springs Quarry","2016-02-26","#57 Stone for Electrochemical","CA282",{"$f":"VLOOKUP(Table16[[#This Row],[Facility ID]],'Coord.'!$A$1:$E$818,2,FALSE)","v":"N"},{"$f":"VLOOKUP(Table16[[#This Row],[Facility ID]],'Coord.'!$A$1:$E$818,3,FALSE)","v":35.602601999999997},{"$f":"VLOOKUP(Table16[[#This Row],[Facility ID]],'Coord.'!$A$1:$E$818,4,FALSE)","v":"W"},{"$f":"VLOOKUP(Table16[[#This Row],[Facility ID]],'Coord.'!$A$1:$E$818,5,FALSE)","v":-78.877609000000007},795303,"Skinner, III, John L",24313,8.1999999999999993,0,4.0999999999999996,"MEETS","MEETS","N/A","N/A",4.0999999999999996,0]
["Martin Marietta","I-40 Sales Yard (Castle Hayne)","2002-10-03","#57 Stone for Electrochemical","CA235",{"$f":"VLOOKUP(Table16[[#This Row],[Facility ID]],'Coord.'!$A$1:$E$818,2,FALSE)","v":"N"},{"$f":"VLOOKUP(Table16[[#This Row],[Facility ID]],'Coord.'!$A$1:$E$818,3,FALSE)","v":0},{"$f":"VLOOKUP(Table16[[#This Row],[Facility ID]],'Coord.'!$A$1:$E$818,4,FALSE)","v":"W"},{"$f":"VLOOKUP(Table16[[#This Row],[Facility ID]],'Coord.'!$A$1:$E$818,5,FALSE)","v":0},278281,"Allen, Daniel W",14706,8.8000000000000007,26,"","MEETS","MEETS","N/A","N/A","",26]
["Martin Marietta","Jamestown Quarry - Jamestown","2004-10-19","#57 Stone for Electrochemical","CA46",{"$f":"VLOOKUP(Table16[[#This Row],[Facility ID]],'Coord.'!$A$1:$E$818,2,FALSE)","v":0},{"$f":"VLOOKUP(Table16[[#This Row],[Facility ID]],'Coord.'!$A$1:$E$818,3,FALSE)","v":35.964756000000001},{"$f":"VLOOKUP(Table16[[#This Row],[Facility ID]],'Coord.'!$A$1:$E$818,4,FALSE)","v":"W"},{"$f":"VLOOKUP(Table16[[#This Row],[Facility ID]],'Coord.'!$A$1:$E$818,5,FALSE)","v":-79.920193999999995},356100,"Crissman, Albert Lynn",23320,8.3000000000000007,"<26","<400","MEETS","MEETS","N/A","N/A",400,26]
["Hanson Aggregates Southeast, Inc.","Jefferson Quarry - Jefferson, SC","2019-09-13","#57 Stone for Electrochemical","CA120",{"$f":"VLOOKUP(Table16[[#This Row],[Facility ID]],'Coord.'!$A$1:$E$818,2,FALSE)","v":"N"},{"$f":"VLOOKUP(Table16[[#This Row],[Facility ID]],'Coord.'!$A$1:$E$818,3,FALSE)","v":34.699689999999997},{"$f":"VLOOKUP(Table16[[#This Row],[Facility ID]],'Coord.'!$A$1:$E$818,4,FALSE)","v":"W"},{"$f":"VLOOKUP(Table16[[#This Row],[Facility ID]],'Coord.'!$A$1:$E$818,5,FALSE)","v":-80.332674999999995},982912,"Jordan, Daniel H",32700,9.15,"<32","<20.183","DOES NOT MEET","MEETS","N/A","N/A",20.183,32]
["Martin Marietta","Kannapolis Quarry - Landis","2020-02-26","#57 Stone for Electrochemical","CA47",{"$f":"VLOOKUP(Table16[[#This Row],[Facility ID]],'Coord.'!$A$1:$E$818,2,FALSE)","v":"N"},{"$f":"VLOOKUP(Table16[[#This Row],[Facility ID]],'Coord.'!$A$1:$E$818,3,FALSE)","v":35.520546000000003},{"$f":"VLOOKUP(Table16[[#This Row],[Facility ID]],'Coord.'!$A$1:$E$818,4,FALSE)","v":"W"},{"$f":"VLOOKUP(Table16[[#This Row],[Facility ID]],'Coord.'!$A$1:$E$818,5,FALSE)","v":-80.584057999999999},1000981,"Ealey, Lee E",24350,9.39,"<30","<27.105","DOES NOT MEET","MEETS","N/A","N/A",27.105,30]
["Carolina Sunrock LLC","Kittrell Quarry - Kittrell","2016-02-04","#57 Stone for Electrochemical","CA304",{"$f":"VLOOKUP(Table16[[#This Row],[Facility ID]],'Coord.'!$A$1:$E$818,2,FALSE)","v":"N"},{"$f":"VLOOKUP(Table16[[#This Row],[Facility ID]],'Coord.'!$A$1:$E$818,3,FALSE)","v":36.169713000000002},{"$f":"VLOOKUP(Table16[[#This Row],[Facility ID]],'Coord.'!$A$1:$E$818,4,FALSE)","v":"W"},{"$f":"VLOOKUP(Table16[[#This Row],[Facility ID]],'Coord.'!$A$1:$E$818,5,FALSE)","v":-78.444863999999995},792553,"Skinner, III, John L",20044,8.6,5,33.1,"MEETS","MEETS","N/A","N/A",33.1,5]
["Wake Stone Corp.","Knightdale Quarry - Knightdale","2019-01-15","#57 Stone for Electrochemical","CA98",{"$f":"VLOOKUP(Table16[[#This Row],[Facility ID]],'Coord.'!$A$1:$E$818,2,FALSE)","v":"N"},{"$f":"VLOOKUP(Table16[[#This Row],[Facility ID]],'Coord.'!$A$1:$E$818,3,FALSE)","v":35.797772999999999},{"$f":"VLOOKUP(Table16[[#This Row],[Facility ID]],'Coord.'!$A$1:$E$818,4,FALSE)","v":"W"},{"$f":"VLOOKUP(Table16[[#This Row],[Facility ID]],'Coord.'!$A$1:$E$818,5,FALSE)","v":-78.502251000000001},945614,"Skinner, III, John L",22880,9.4,0,"<28.846","DOES NOT MEET","MEETS","N/A","N/A",28.846,0]
["Hedrick Industries","Lake Norman Quarry - Stanley","2019-07-12","#57 Stone for Electrochemical","CA168",{"$f":"VLOOKUP(Table16[[#This Row],[Facility ID]],'Coord.'!$A$1:$E$818,2,FALSE)","v":"N"},{"$f":"VLOOKUP(Table16[[#This Row],[Facility ID]],'Coord.'!$A$1:$E$818,3,FALSE)","v":35.428623999999999},{"$f":"VLOOKUP(Table16[[#This Row],[Facility ID]],'Coord.'!$A$1:$E$818,4,FALSE)","v":"W"},{"$f":"VLOOKUP(Table16[[#This Row],[Facility ID]],'Coord.'!$A$1:$E$818,5,FALSE)","v":-81.017241999999996},972391,"Gosnell, Jimmy L",7776,9.24,"<29","<84.877","DOES NOT MEET","MEETS","N/A","N/A",84.876999999999995,29]
["Martin Marietta","Lemon Springs - Sanford","2019-08-16","#57 Stone for Electrochemical","CA97",{"$f":"VLOOKUP(Table16[[#This Row],[Facility ID]],'Coord.'!$A$1:$E$818,2,FALSE)","v":0},{"$f":"VLOOKUP(Table16[[#This Row],[Facility ID]],'Coord.'!$A$1:$E$818,3,FALSE)","v":35.410660999999998},{"$f":"VLOOKUP(Table16[[#This Row],[Facility ID]],'Coord.'!$A$1:$E$818,4,FALSE)","v":0},{"$f":"VLOOKUP(Table16[[#This Row],[Facility ID]],'Coord.'!$A$1:$E$818,5,FALSE)","v":-79.206500000000005},978230,"Jackson, Brandon M",16210,9.4600000000000009,"<29","<40.716","DOES NOT MEET","MEETS","N/A","N/A",40.716000000000001,29]
["Vulcan Materials Co.","Lenior Quarry - Lenoir","2016-06-24","#57 Stone for Electrochemical","CA91",{"$f":"VLOOKUP(Table16[[#This Row],[Facility ID]],'Coord.'!$A$1:$E$818,2,FALSE)","v":"N"},{"$f":"VLOOKUP(Table16[[#This Row],[Facility ID]],'Coord.'!$A$1:$E$818,3,FALSE)","v":35.935250000000003},{"$f":"VLOOKUP(Table16[[#This Row],[Facility ID]],'Coord.'!$A$1:$E$818,4,FALSE)","v":"W"},{"$f":"VLOOKUP(Table16[[#This Row],[Facility ID]],'Coord.'!$A$1:$E$818,5,FALSE)","v":-81.488753000000003},815305,"Church, Tracy G",18751,9.1999999999999993,2.1,15,"DOES NOT MEET","MEETS","N/A","N/A",15,2.1]
["McCrary Stone","Low Gap Quarry - Burnsville","2019-03-05","#57 Stone for Electrochemical","CA244",{"$f":"VLOOKUP(Table16[[#This Row],[Facility ID]],'Coord.'!$A$1:$E$818,2,FALSE)","v":"N"},{"$f":"VLOOKUP(Table16[[#This Row],[Facility ID]],'Coord.'!$A$1:$E$818,3,FALSE)","v":35.523000000000003},{"$f":"VLOOKUP(Table16[[#This Row],[Facility ID]],'Coord.'!$A$1:$E$818,4,FALSE)","v":"W"},{"$f":"VLOOKUP(Table16[[#This Row],[Facility ID]],'Coord.'!$A$1:$E$818,5,FALSE)","v":-82.175399999999996},952978,"Kindley, Wallace Quint",3609,3.9,"<30","<182.876","DOES NOT MEET","DOES NOT MEET","N/A","N/A",182.876,30]
["Georgia Stone Products","Lynches River Quarry - Jefferson, SC","2019-07-10","#57 Stone for Electrochemical","CA325",{"$f":"VLOOKUP(Table16[[#This Row],[Facility ID]],'Coord.'!$A$1:$E$818,2,FALSE)","v":"N"},{"$f":"VLOOKUP(Table16[[#This Row],[Facility ID]],'Coord.'!$A$1:$E$818,3,FALSE)","v":34.703234999999999},{"$f":"VLOOKUP(Table16[[#This Row],[Facility ID]],'Coord.'!$A$1:$E$818,4,FALSE)","v":"W"},{"$f":"VLOOKUP(Table16[[#This Row],[Facility ID]],'Coord.'!$A$1:$E$818,5,FALSE)","v":-80.461099000000004},971836,"Jordan, Daniel H",26750,9.5,"<29","<24.673","DOES NOT MEET","MEETS","N/A","N/A",24.672999999999998,29]
["Martin Marietta","Mallard Creek Quarry - Charlotte","2018-11-12","#57 Stone for Electrochemical","CA188",{"$f":"VLOOKUP(Table16[[#This Row],[Facility ID]],'Coord.'!$A$1:$E$818,2,FALSE)","v":"N"},{"$f":"VLOOKUP(Table16[[#This Row],[Facility ID]],'Coord.'!$A$1:$E$818,3,FALSE)","v":35.318085000000004},{"$f":"VLOOKUP(Table16[[#This Row],[Facility ID]],'Coord.'!$A$1:$E$818,4,FALSE)","v":"W"},{"$f":"VLOOKUP(Table16[[#This Row],[Facility ID]],'Coord.'!$A$1:$E$818,5,FALSE)","v":-80.728077999999996},939062,"Pegues, Jr., Henderson",25090,9.6,0,"<26.3","DOES NOT MEET","MEETS","N/A","N/A",26.3,0]
["McCrary Stone","Marshall Quarry - Marshall","2019-08-12","#57 Stone for Electrochemical","CA113",{"$f":"VLOOKUP(Table16[[#This Row],[Facility ID]],'Coord.'!$A$1:$E$818,2,FALSE)","v":"N"},{"$f":"VLOOKUP(Table16[[#This Row],[Facility ID]],'Coord.'!$A$1:$E$818,3,FALSE)","v":35.792836000000001},{"$f":"VLOOKUP(Table16[[#This Row],[Facility ID]],'Coord.'!$A$1:$E$818,4,FALSE)","v":"W"},{"$f":"VLOOKUP(Table16[[#This Row],[Facility ID]],'Coord.'!$A$1:$E$818,5,FALSE)","v":-82.655023},978212,"Kindley, Wallace Quint",16190,9.3800000000000008,"<29","<40.766","DOES NOT MEET","MEETS","N/A","N/A",40.765999999999998,29]
["Harrison Construction Co., Inc.","Massey Branch Quarry - Robbinsville","2001-08-09","#57 Stone for Electrochemical","CA193",{"$f":"VLOOKUP(Table16[[#This Row],[Facility ID]],'Coord.'!$A$1:$E$818,2,FALSE)","v":"N"},{"$f":"VLOOKUP(Table16[[#This Row],[Facility ID]],'Coord.'!$A$1:$E$818,3,FALSE)","v":35.335340000000002},{"$f":"VLOOKUP(Table16[[#This Row],[Facility ID]],'Coord.'!$A$1:$E$818,4,FALSE)","v":"W"},{"$f":"VLOOKUP(Table16[[#This Row],[Facility ID]],'Coord.'!$A$1:$E$818,5,FALSE)","v":-83.836816999999996},225525,"Wallace, Robert R",83300,7.9,"","","MEETS","MEETS","N/A","N/A","",""]
["Mathis Quarries, Inc.","Mathis Quarry","2016-05-24","#57 Stone for Electrochemical","CA359",{"$f":"VLOOKUP(Table16[[#This Row],[Facility ID]],'Coord.'!$A$1:$E$818,2,FALSE)","v":"N"},{"$f":"VLOOKUP(Table16[[#This Row],[Facility ID]],'Coord.'!$A$1:$E$818,3,FALSE)","v":36.148826},{"$f":"VLOOKUP(Table16[[#This Row],[Facility ID]],'Coord.'!$A$1:$E$818,4,FALSE)","v":"W"},{"$f":"VLOOKUP(Table16[[#This Row],[Facility ID]],'Coord.'!$A$1:$E$818,5,FALSE)","v":-81.029984999999996},808610,"Whitley, Christopher D",17176,9.1,4.3,17.3,"DOES NOT MEET","MEETS","N/A","N/A",17.3,4.3]
["Martin Marietta","Matthews Quarry - Matthews","2019-11-25","#57 Stone for Electrochemical","CA37",{"$f":"VLOOKUP(Table16[[#This Row],[Facility ID]],'Coord.'!$A$1:$E$818,2,FALSE)","v":0},{"$f":"VLOOKUP(Table16[[#This Row],[Facility ID]],'Coord.'!$A$1:$E$818,3,FALSE)","v":35.131262999999997},{"$f":"VLOOKUP(Table16[[#This Row],[Facility ID]],'Coord.'!$A$1:$E$818,4,FALSE)","v":"W"},{"$f":"VLOOKUP(Table16[[#This Row],[Facility ID]],'Coord.'!$A$1:$E$818,5,FALSE)","v":-80.720371999999998},993304,"Smith, Michael L",19880,9.3800000000000008,"<30","<33.199","DOES NOT MEET","MEETS","N/A","N/A",33.198999999999998,30]
["Thompson Contractors","Miller Creek Quarry - Rutherfordton","2019-09-27","#57 Stone for Electrochemical","CA59",{"$f":"VLOOKUP(Table16[[#This Row],[Facility ID]],'Coord.'!$A$1:$E$818,2,FALSE)","v":"N"},{"$f":"VLOOKUP(Table16[[#This Row],[Facility ID]],'Coord.'!$A$1:$E$818,3,FALSE)","v":35.213900000000002},{"$f":"VLOOKUP(Table16[[#This Row],[Facility ID]],'Coord.'!$A$1:$E$818,4,FALSE)","v":"W"},{"$f":"VLOOKUP(Table16[[#This Row],[Facility ID]],'Coord.'!$A$1:$E$818,5,FALSE)","v":-82.002099999999999},985267,"Norton, Stephen S",19130,9.5299999999999994,"<30","<34.501","DOES NOT MEET","MEETS","N/A","N/A",34.500999999999998,30]
["Rogers Group, Inc.","Mitchell County Stone","2016-10-25","#57 Stone for Electrochemical","CA315",{"$f":"VLOOKUP(Table16[[#This Row],[Facility ID]],'Coord.'!$A$1:$E$818,2,FALSE)","v":"N"},{"$f":"VLOOKUP(Table16[[#This Row],[Facility ID]],'Coord.'!$A$1:$E$818,3,FALSE)","v":35.899016000000003},{"$f":"VLOOKUP(Table16[[#This Row],[Facility ID]],'Coord.'!$A$1:$E$818,4,FALSE)","v":"W"},{"$f":"VLOOKUP(Table16[[#This Row],[Facility ID]],'Coord.'!$A$1:$E$818,5,FALSE)","v":-82.100712000000001},832455,"Rhymer, Robert C",82508,8.1,0,0.4,"MEETS","MEETS","N/A","N/A",0.4,0]
["Wake Stone Corp.","Moncure Quarry - Moncure","2020-10-14","#57 Stone for Electrochemical","CA100",{"$f":"VLOOKUP(Table16[[#This Row],[Facility ID]],'Coord.'!$A$1:$E$818,2,FALSE)","v":"N"},{"$f":"VLOOKUP(Table16[[#This Row],[Facility ID]],'Coord.'!$A$1:$E$818,3,FALSE)","v":35.616160000000001},{"$f":"VLOOKUP(Table16[[#This Row],[Facility ID]],'Coord.'!$A$1:$E$818,4,FALSE)","v":"W"},{"$f":"VLOOKUP(Table16[[#This Row],[Facility ID]],'Coord.'!$A$1:$E$818,5,FALSE)","v":-79.103876},1023283,"Braly, James R",18550,9.49,"<30","<35.58","DOES NOT MEET","MEETS","N/A","N/A",35.58,30]
["NC Granite Corp.","Mount Airy Quarry","2016-03-08","#57 Stone for Electrochemical","CA24",{"$f":"VLOOKUP(Table16[[#This Row],[Facility ID]],'Coord.'!$A$1:$E$818,2,FALSE)","v":"N"},{"$f":"VLOOKUP(Table16[[#This Row],[Facility ID]],'Coord.'!$A$1:$E$818,3,FALSE)","v":36.507544000000003},{"$f":"VLOOKUP(Table16[[#This Row],[Facility ID]],'Coord.'!$A$1:$E$818,4,FALSE)","v":"W"},{"$f":"VLOOKUP(Table16[[#This Row],[Facility ID]],'Coord.'!$A$1:$E$818,5,FALSE)","v":-80.591076000000001},797321,"Whitley, Christopher D",24913,7.8,0,6,"MEETS","MEETS","N/A","N/A",6,0]
["Mountain Materials, Inc.","Mouth of Wilson Quarry - VA","2019-07-12","#57 Stone for Electrochemical","CA180",{"$f":"VLOOKUP(Table16[[#This Row],[Facility ID]],'Coord.'!$A$1:$E$818,2,FALSE)","v":"N"},{"$f":"VLOOKUP(Table16[[#This Row],[Facility ID]],'Coord.'!$A$1:$E$818,3,FALSE)","v":36.584158000000002},{"$f":"VLOOKUP(Table16[[#This Row],[Facility ID]],'Coord.'!$A$1:$E$818,4,FALSE)","v":"W"},{"$f":"VLOOKUP(Table16[[#This Row],[Facility ID]],'Coord.'!$A$1:$E$818,5,FALSE)","v":-81.307518000000002},972577,"Church, Tracy G",12890,8.85,"<29","<51.202","MEETS","MEETS","N/A","N/A",51.201999999999998,29]
["Ararat Rock Products","Mt. Airy Quarry - Mt. Airy","2017-01-31","#57 Stone for Electrochemical","CA3",{"$f":"VLOOKUP(Table16[[#This Row],[Facility ID]],'Coord.'!$A$1:$E$818,2,FALSE)","v":"N"},{"$f":"VLOOKUP(Table16[[#This Row],[Facility ID]],'Coord.'!$A$1:$E$818,3,FALSE)","v":36.461475999999998},{"$f":"VLOOKUP(Table16[[#This Row],[Facility ID]],'Coord.'!$A$1:$E$818,4,FALSE)","v":"W"},{"$f":"VLOOKUP(Table16[[#This Row],[Facility ID]],'Coord.'!$A$1:$E$818,5,FALSE)","v":-80.593323999999996},843860,"Whitley, Christopher D",12816,8,0,48.7,"MEETS","MEETS","N/A","N/A",48.7,0]
["Wake Stone Corp.","Nash County Quarry - Battleboro","2016-03-11","#57 Stone for Electrochemical","CA223",{"$f":"VLOOKUP(Table16[[#This Row],[Facility ID]],'Coord.'!$A$1:$E$818,2,FALSE)","v":"N"},{"$f":"VLOOKUP(Table16[[#This Row],[Facility ID]],'Coord.'!$A$1:$E$818,3,FALSE)","v":36.060037000000001},{"$f":"VLOOKUP(Table16[[#This Row],[Facility ID]],'Coord.'!$A$1:$E$818,4,FALSE)","v":"W"},{"$f":"VLOOKUP(Table16[[#This Row],[Facility ID]],'Coord.'!$A$1:$E$818,5,FALSE)","v":-77.83229},797386,"Raines, James R",24746,8,0,4.5,"MEETS","MEETS","N/A","N/A",4.5,0]
["Hanson Aggregates Southeast, Inc.","Neverson Quarry - Sims","2016-03-15","#57 Stone for Electrochemical","CA66",{"$f":"VLOOKUP(Table16[[#This Row],[Facility ID]],'Coord.'!$A$1:$E$818,2,FALSE)","v":"N"},{"$f":"VLOOKUP(Table16[[#This Row],[Facility ID]],'Coord.'!$A$1:$E$818,3,FALSE)","v":35.766500999999998},{"$f":"VLOOKUP(Table16[[#This Row],[Facility ID]],'Coord.'!$A$1:$E$818,4,FALSE)","v":"W"},{"$f":"VLOOKUP(Table16[[#This Row],[Facility ID]],'Coord.'!$A$1:$E$818,5,FALSE)","v":-78.084275000000005},798232,"Raines, James R",22080,7.7,0,5.8,"MEETS","MEETS","N/A","N/A",5.8,0]
["Maymead Materials, Inc.","North 321 Stone","2008-10-03","#57 Stone for Electrochemical","CA273",{"$f":"VLOOKUP(Table16[[#This Row],[Facility ID]],'Coord.'!$A$1:$E$818,2,FALSE)","v":"N"},{"$f":"VLOOKUP(Table16[[#This Row],[Facility ID]],'Coord.'!$A$1:$E$818,3,FALSE)","v":36.019967999999999},{"$f":"VLOOKUP(Table16[[#This Row],[Facility ID]],'Coord.'!$A$1:$E$818,4,FALSE)","v":"W"},{"$f":"VLOOKUP(Table16[[#This Row],[Facility ID]],'Coord.'!$A$1:$E$818,5,FALSE)","v":-81.576071999999996},470680,"Wagoner, Roy M",15630,7.3,"<27","<200",{"$f":"IF(AND(4.5 <= $M258, $M258 <= 9), \"MEETS\", \"DOES NOT MEET\")","v":"MEETS"},{"$f":"IF(AND(5 <= $M258, $M258 <= 10), \"MEETS\", \"DOES NOT MEET\")","v":"MEETS"},"N/A","N/A",{"$f":"IF(LEFT(O258, 1)=\"<\", VALUE(RIGHT(O258,LEN(O258)-1)), O258)","v":200},{"$f":"IF(LEFT(N258, 1)=\"<\", VALUE(RIGHT(N258,LEN(N258)-1)), N258)","v":27}]
["Hedrick Industries","North Buncombe Quarry - Asheville","2019-04-29","#57 Stone for Electrochemical","CA131",{"$f":"VLOOKUP(Table16[[#This Row],[Facility ID]],'Coord.'!$A$1:$E$818,2,FALSE)","v":"N"},{"$f":"VLOOKUP(Table16[[#This Row],[Facility ID]],'Coord.'!$A$1:$E$818,3,FALSE)","v":35.687100000000001},{"$f":"VLOOKUP(Table16[[#This Row],[Facility ID]],'Coord.'!$A$1:$E$818,4,FALSE)","v":"W"},{"$f":"VLOOKUP(Table16[[#This Row],[Facility ID]],'Coord.'!$A$1:$E$818,5,FALSE)","v":-82.6083},961081,"Kindley, Wallace Quint",10350,9.1,"<30","<63.678","DOES NOT MEET","MEETS","N/A","N/A",63.677999999999997,30]
["Vulcan Materials Co.","North Quarry - Winston Salem","2020-02-25","#57 Stone for Electrochemical","CA72",{"$f":"VLOOKUP(Table16[[#This Row],[Facility ID]],'Coord.'!$A$1:$E$818,2,FALSE)","v":"N"},{"$f":"VLOOKUP(Table16[[#This Row],[Facility ID]],'Coord.'!$A$1:$E$818,3,FALSE)","v":36.176855000000003},{"$f":"VLOOKUP(Table16[[#This Row],[Facility ID]],'Coord.'!$A$1:$E$818,4,FALSE)","v":"W"},{"$f":"VLOOKUP(Table16[[#This Row],[Facility ID]],'Coord.'!$A$1:$E$818,5,FALSE)","v":-80.268285000000006},1000797,"Ealey, Lee E",21160,9.3800000000000008,"<30","<31.191","DOES NOT MEET","MEETS","N/A","N/A",31.190999999999999,30]
["Martin Marietta","Onslow Quarry - Richlands","2015-09-30","#57 Stone for Electrochemical","CA259",{"$f":"VLOOKUP(Table16[[#This Row],[Facility ID]],'Coord.'!$A$1:$E$818,2,FALSE)","v":"N"},{"$f":"VLOOKUP(Table16[[#This Row],[Facility ID]],'Coord.'!$A$1:$E$818,3,FALSE)","v":34.840071999999999},{"$f":"VLOOKUP(Table16[[#This Row],[Facility ID]],'Coord.'!$A$1:$E$818,4,FALSE)","v":"W"},{"$f":"VLOOKUP(Table16[[#This Row],[Facility ID]],'Coord.'!$A$1:$E$818,5,FALSE)","v":-77.540515999999997},778060,"Cahill, Luke R",4480,6.8,0,0,"MEETS","MEETS","DOES NOT MEET","DOES NOT MEET",0,0]
["Vulcan Materials Co.","Pacolet Quarry - Pacolet, SC","2019-08-01","#57 Stone for Electrochemical","CA83",{"$f":"VLOOKUP(Table16[[#This Row],[Facility ID]],'Coord.'!$A$1:$E$818,2,FALSE)","v":"N"},{"$f":"VLOOKUP(Table16[[#This Row],[Facility ID]],'Coord.'!$A$1:$E$818,3,FALSE)","v":34.907637000000001},{"$f":"VLOOKUP(Table16[[#This Row],[Facility ID]],'Coord.'!$A$1:$E$818,4,FALSE)","v":"W"},{"$f":"VLOOKUP(Table16[[#This Row],[Facility ID]],'Coord.'!$A$1:$E$818,5,FALSE)","v":-81.784471999999994},975598,"Gosnell, Jimmy L",3415,7.86,"<29","<193.265","MEETS","MEETS","N/A","N/A",193.26499999999999,29]
["Vulcan Materials Co.","Penrose Quarry - Pisgah Forest","2017-03-07","#57 Stone for Electrochemical","CA12",{"$f":"VLOOKUP(Table16[[#This Row],[Facility ID]],'Coord.'!$A$1:$E$818,2,FALSE)","v":"N"},{"$f":"VLOOKUP(Table16[[#This Row],[Facility ID]],'Coord.'!$A$1:$E$818,3,FALSE)","v":35.273408000000003},{"$f":"VLOOKUP(Table16[[#This Row],[Facility ID]],'Coord.'!$A$1:$E$818,4,FALSE)","v":"W"},{"$f":"VLOOKUP(Table16[[#This Row],[Facility ID]],'Coord.'!$A$1:$E$818,5,FALSE)","v":-82.641863999999998},848230,"Wood, Dean Michael M",23084,9.4,0,26.7,"DOES NOT MEET","MEETS","N/A","N/A",26.7,0]
["Vulcan Materials Co.","Pineville Quarry - Charlotte","2019-03-15","#57 Stone for Electrochemical","CA101",{"$f":"VLOOKUP(Table16[[#This Row],[Facility ID]],'Coord.'!$A$1:$E$818,2,FALSE)","v":"N"},{"$f":"VLOOKUP(Table16[[#This Row],[Facility ID]],'Coord.'!$A$1:$E$818,3,FALSE)","v":35.115856000000001},{"$f":"VLOOKUP(Table16[[#This Row],[Facility ID]],'Coord.'!$A$1:$E$818,4,FALSE)","v":"W"},{"$f":"VLOOKUP(Table16[[#This Row],[Facility ID]],'Coord.'!$A$1:$E$818,5,FALSE)","v":-80.896596000000002},954940,"Adair, Mildred (Millie) L",24760,9.1999999999999993,"<30","<26.656","DOES NOT MEET","MEETS","N/A","N/A",26.655999999999999,30]
["Vulcan Materials Co.","Pineville Quarry - Charlotte","2019-03-15","#57 Stone for Electrochemical","CA101",{"$f":"VLOOKUP(Table16[[#This Row],[Facility ID]],'Coord.'!$A$1:$E$818,2,FALSE)","v":"N"},{"$f":"VLOOKUP(Table16[[#This Row],[Facility ID]],'Coord.'!$A$1:$E$818,3,FALSE)","v":35.115856000000001},{"$f":"VLOOKUP(Table16[[#This Row],[Facility ID]],'Coord.'!$A$1:$E$818,4,FALSE)","v":"W"},{"$f":"VLOOKUP(Table16[[#This Row],[Facility ID]],'Coord.'!$A$1:$E$818,5,FALSE)","v":-80.896596000000002},954939,"Adair, Mildred (Millie) L",12860,9.3000000000000007,0,"<51.322","DOES NOT MEET","MEETS","N/A","N/A",51.322000000000003,0]
["Luck Stone Corporation","Pittsboro Quarry - Moncure","2018-11-30","#57 Stone for Electrochemical","CA292",{"$f":"VLOOKUP(Table16[[#This Row],[Facility ID]],'Coord.'!$A$1:$E$818,2,FALSE)","v":"N"},{"$f":"VLOOKUP(Table16[[#This Row],[Facility ID]],'Coord.'!$A$1:$E$818,3,FALSE)","v":35.660415999999998},{"$f":"VLOOKUP(Table16[[#This Row],[Facility ID]],'Coord.'!$A$1:$E$818,4,FALSE)","v":"W"},{"$f":"VLOOKUP(Table16[[#This Row],[Facility ID]],'Coord.'!$A$1:$E$818,5,FALSE)","v":-79.176833000000002},941282,"Jackson, Brandon M",20320,9.5,"<30","<32.48","DOES NOT MEET","MEETS",{"$f":"IF(OR(ISBLANK(L266), NOT(ISNUMBER(MATCH($E266, Coastal,0)))), \"N/A\", IF(AND(4.5 <= $M266, $M266 <= 9),IF($L266>=5000,IF($U266<=100,IF($T266<=200,\"MEETS\",\"DOES NOT MEET\"),\"DOES NOT MEET\"),\"DOES NOT MEET\"),\"DOES NOT MEET\"))","v":"N/A"},{"$f":"IF(OR(ISBLANK(M266), NOT(ISNUMBER(MATCH($E266, Coastal, 0)))), \"N/A\", IF(AND(5 <= $M266, $M266 <= 10),IF($L266>=5000,IF($U266<=100,IF($T266<=200,\"MEETS\",\"DOES NOT MEET\"),\"DOES NOT MEET\"),\"DOES NOT MEET\"),\"DOES NOT MEET\"))","v":"N/A"},32.479999999999997,30]
["Martin Marietta","Pomona Quarry - Greensboro","2019-05-28","#57 Stone for Electrochemical","CA51",{"$f":"VLOOKUP(Table16[[#This Row],[Facility ID]],'Coord.'!$A$1:$E$818,2,FALSE)","v":0},{"$f":"VLOOKUP(Table16[[#This Row],[Facility ID]],'Coord.'!$A$1:$E$818,3,FALSE)","v":36.060417999999999},{"$f":"VLOOKUP(Table16[[#This Row],[Facility ID]],'Coord.'!$A$1:$E$818,4,FALSE)","v":0},{"$f":"VLOOKUP(Table16[[#This Row],[Facility ID]],'Coord.'!$A$1:$E$818,5,FALSE)","v":-79.925364999999999},965378,"Waller, John M",20730,9.6,"<30","<31.838","DOES NOT MEET","MEETS","N/A","N/A",31.838000000000001,30]
["Hanson Aggregates Southeast, Inc.","Princeton Quarry","2016-03-24","#57 Stone for Electrochemical","CA64",{"$f":"VLOOKUP(Table16[[#This Row],[Facility ID]],'Coord.'!$A$1:$E$818,2,FALSE)","v":"N"},{"$f":"VLOOKUP(Table16[[#This Row],[Facility ID]],'Coord.'!$A$1:$E$818,3,FALSE)","v":35.472107000000001},{"$f":"VLOOKUP(Table16[[#This Row],[Facility ID]],'Coord.'!$A$1:$E$818,4,FALSE)","v":"W"},{"$f":"VLOOKUP(Table16[[#This Row],[Facility ID]],'Coord.'!$A$1:$E$818,5,FALSE)","v":-78.137972000000005},799116,"Raines, James R",13717,7.6,0,4.0999999999999996,"MEETS","MEETS","MEETS","MEETS",4.0999999999999996,0]
["Vulcan Materials Co.","Puddledock Quarry - Prince George, VA","2020-09-21","#57 Stone for Electrochemical","CA224",{"$f":"VLOOKUP(Table16[[#This Row],[Facility ID]],'Coord.'!$A$1:$E$818,2,FALSE)","v":"N"},{"$f":"VLOOKUP(Table16[[#This Row],[Facility ID]],'Coord.'!$A$1:$E$818,3,FALSE)","v":37.260108000000002},{"$f":"VLOOKUP(Table16[[#This Row],[Facility ID]],'Coord.'!$A$1:$E$818,4,FALSE)","v":"W"},{"$f":"VLOOKUP(Table16[[#This Row],[Facility ID]],'Coord.'!$A$1:$E$818,5,FALSE)","v":-77.364734999999996},1021103,"Bonds, Maria M",21740,4.3600000000000003,"<30","<30.359","DOES NOT MEET","DOES NOT MEET","DOES NOT MEET","DOES NOT MEET",30.359000000000002,30]
["Vulcan Materials Co.","Rabun Gap - Rabun Gap, GA","2019-03-08","#57 Stone for Electrochemical","CA25",{"$f":"VLOOKUP(Table16[[#This Row],[Facility ID]],'Coord.'!$A$1:$E$818,2,FALSE)","v":"N"},{"$f":"VLOOKUP(Table16[[#This Row],[Facility ID]],'Coord.'!$A$1:$E$818,3,FALSE)","v":34.978484000000002},{"$f":"VLOOKUP(Table16[[#This Row],[Facility ID]],'Coord.'!$A$1:$E$818,4,FALSE)","v":"W"},{"$f":"VLOOKUP(Table16[[#This Row],[Facility ID]],'Coord.'!$A$1:$E$818,5,FALSE)","v":-83.359215000000006},953618,"Ledford, Brandon S",25660,9.5,"<30","<25.721","DOES NOT MEET","MEETS","N/A","N/A",25.721,30]
["Hanson Aggregates Southeast, Inc.","Raleigh Quarry - Wake Forest","2016-02-12","#57 Stone for Electrochemical","CA67",{"$f":"VLOOKUP(Table16[[#This Row],[Facility ID]],'Coord.'!$A$1:$E$818,2,FALSE)","v":"N"},{"$f":"VLOOKUP(Table16[[#This Row],[Facility ID]],'Coord.'!$A$1:$E$818,3,FALSE)","v":35.931106999999997},{"$f":"VLOOKUP(Table16[[#This Row],[Facility ID]],'Coord.'!$A$1:$E$818,4,FALSE)","v":"W"},{"$f":"VLOOKUP(Table16[[#This Row],[Facility ID]],'Coord.'!$A$1:$E$818,5,FALSE)","v":-78.543345000000002},793719,"Skinner, III, John L",27071,9.1999999999999993,0,4.8,"DOES NOT MEET","MEETS","N/A","N/A",4.8,0]
["Martin Marietta","Raleigh-Durham Quarry - Raleigh","2016-02-05","#57 Stone for Electrochemical","CA156",{"$f":"VLOOKUP(Table16[[#This Row],[Facility ID]],'Coord.'!$A$1:$E$818,2,FALSE)","v":"N"},{"$f":"VLOOKUP(Table16[[#This Row],[Facility ID]],'Coord.'!$A$1:$E$818,3,FALSE)","v":35.894070999999997},{"$f":"VLOOKUP(Table16[[#This Row],[Facility ID]],'Coord.'!$A$1:$E$818,4,FALSE)","v":"W"},{"$f":"VLOOKUP(Table16[[#This Row],[Facility ID]],'Coord.'!$A$1:$E$818,5,FALSE)","v":-78.749120000000005},792800,"Skinner, III, John L",22894,8.9,5,28.2,"MEETS","MEETS","N/A","N/A",28.2,5]
["Martin Marietta","Reidsville Quarry - Reidsville","2019-02-13","#57 Stone for Electrochemical","CA52",{"$f":"VLOOKUP(Table16[[#This Row],[Facility ID]],'Coord.'!$A$1:$E$818,2,FALSE)","v":0},{"$f":"VLOOKUP(Table16[[#This Row],[Facility ID]],'Coord.'!$A$1:$E$818,3,FALSE)","v":36.371012},{"$f":"VLOOKUP(Table16[[#This Row],[Facility ID]],'Coord.'!$A$1:$E$818,4,FALSE)","v":0},{"$f":"VLOOKUP(Table16[[#This Row],[Facility ID]],'Coord.'!$A$1:$E$818,5,FALSE)","v":-79.726775000000004},949847,"Westmoreland, Braxton J",17820,9.5,0,"<37.037","DOES NOT MEET","MEETS","N/A","N/A",37.036999999999999,0]
["Martin Marietta","Rock Hill Quarry - Rock Hill, SC","2017-10-30","#57 Stone for Electrochemical","CA271",{"$f":"VLOOKUP(Table16[[#This Row],[Facility ID]],'Coord.'!$A$1:$E$818,2,FALSE)","v":"N"},{"$f":"VLOOKUP(Table16[[#This Row],[Facility ID]],'Coord.'!$A$1:$E$818,3,FALSE)","v":34.894787000000001},{"$f":"VLOOKUP(Table16[[#This Row],[Facility ID]],'Coord.'!$A$1:$E$818,4,FALSE)","v":"W"},{"$f":"VLOOKUP(Table16[[#This Row],[Facility ID]],'Coord.'!$A$1:$E$818,5,FALSE)","v":-80.999021999999997},885405,"Adair, Mildred (Millie) L",21739,9.3000000000000007,0,28.5,"DOES NOT MEET","MEETS","N/A","N/A",28.5,0]
["Vulcan Materials Co.","Rockingham Quarry - Rockingham","2019-08-13","#57 Stone for Electrochemical","CA94",{"$f":"VLOOKUP(Table16[[#This Row],[Facility ID]],'Coord.'!$A$1:$E$818,2,FALSE)","v":"N"},{"$f":"VLOOKUP(Table16[[#This Row],[Facility ID]],'Coord.'!$A$1:$E$818,3,FALSE)","v":34.938706000000003},{"$f":"VLOOKUP(Table16[[#This Row],[Facility ID]],'Coord.'!$A$1:$E$818,4,FALSE)","v":"W"},{"$f":"VLOOKUP(Table16[[#This Row],[Facility ID]],'Coord.'!$A$1:$E$818,5,FALSE)","v":-79.823207999999994},977702,"Jordan, Daniel H",17630,9.43,"<29","<37.436","DOES NOT MEET","MEETS","N/A","N/A",37.436,29]
["Hanson Aggregates Southeast, Inc.","Rocky Mount Quarry (#2)","2016-04-14","#57 Stone for Electrochemical","CA371",{"$f":"VLOOKUP(Table16[[#This Row],[Facility ID]],'Coord.'!$A$1:$E$818,2,FALSE)","v":"N"},{"$f":"VLOOKUP(Table16[[#This Row],[Facility ID]],'Coord.'!$A$1:$E$818,3,FALSE)","v":35.972839999999998},{"$f":"VLOOKUP(Table16[[#This Row],[Facility ID]],'Coord.'!$A$1:$E$818,4,FALSE)","v":"W"},{"$f":"VLOOKUP(Table16[[#This Row],[Facility ID]],'Coord.'!$A$1:$E$818,5,FALSE)","v":-77.760082999999995},802197,"Raines, James R",43346,7.9,0,0,"MEETS","MEETS","MEETS","MEETS",0,0]
["Hanson Aggregates Southeast, Inc.","Rougemont Quarry","2016-02-16","#57 Stone for Electrochemical","CA217",{"$f":"VLOOKUP(Table16[[#This Row],[Facility ID]],'Coord.'!$A$1:$E$818,2,FALSE)","v":"N"},{"$f":"VLOOKUP(Table16[[#This Row],[Facility ID]],'Coord.'!$A$1:$E$818,3,FALSE)","v":36.224888},{"$f":"VLOOKUP(Table16[[#This Row],[Facility ID]],'Coord.'!$A$1:$E$818,4,FALSE)","v":"W"},{"$f":"VLOOKUP(Table16[[#This Row],[Facility ID]],'Coord.'!$A$1:$E$818,5,FALSE)","v":-78.951487999999998},793930,"Skinner, III, John L",29940,9.4,5,8.3000000000000007,"DOES NOT MEET","MEETS","N/A","N/A",8.3000000000000007,5]
["Martin Marietta","Salem Stone Quarry - Kernersville","2020-03-10","#57 Stone for Electrochemical","CA209",{"$f":"VLOOKUP(Table16[[#This Row],[Facility ID]],'Coord.'!$A$1:$E$818,2,FALSE)","v":"N"},{"$f":"VLOOKUP(Table16[[#This Row],[Facility ID]],'Coord.'!$A$1:$E$818,3,FALSE)","v":36.035980000000002},{"$f":"VLOOKUP(Table16[[#This Row],[Facility ID]],'Coord.'!$A$1:$E$818,4,FALSE)","v":"W"},{"$f":"VLOOKUP(Table16[[#This Row],[Facility ID]],'Coord.'!$A$1:$E$818,5,FALSE)","v":-80.106778000000006},1005499,"Ealey, Lee E",25960,9.61,"<30","<25.424","DOES NOT MEET","MEETS","N/A","N/A",25.423999999999999,30]
["Hanson Aggregates Southeast, Inc.","Sandy Flats Quarry - Taylors, SC","2016-12-14","#57 Stone for Electrochemical","CA298",{"$f":"VLOOKUP(Table16[[#This Row],[Facility ID]],'Coord.'!$A$1:$E$818,2,FALSE)","v":"N"},{"$f":"VLOOKUP(Table16[[#This Row],[Facility ID]],'Coord.'!$A$1:$E$818,3,FALSE)","v":35.008490999999999},{"$f":"VLOOKUP(Table16[[#This Row],[Facility ID]],'Coord.'!$A$1:$E$818,4,FALSE)","v":"W"},{"$f":"VLOOKUP(Table16[[#This Row],[Facility ID]],'Coord.'!$A$1:$E$818,5,FALSE)","v":-82.345754999999997},839140,"Wood, Dean Michael M",18152,7.7,0,2,"MEETS","MEETS","N/A","N/A",2,0]
["Vulcan Materials Co.","Skippers Quarry - Skippers, VA","2020-02-05","#57 Stone for Electrochemical","CA55",{"$f":"VLOOKUP(Table16[[#This Row],[Facility ID]],'Coord.'!$A$1:$E$818,2,FALSE)","v":"N"},{"$f":"VLOOKUP(Table16[[#This Row],[Facility ID]],'Coord.'!$A$1:$E$818,3,FALSE)","v":36.608707000000003},{"$f":"VLOOKUP(Table16[[#This Row],[Facility ID]],'Coord.'!$A$1:$E$818,4,FALSE)","v":"W"},{"$f":"VLOOKUP(Table16[[#This Row],[Facility ID]],'Coord.'!$A$1:$E$818,5,FALSE)","v":-77.582424000000003},998836,"Thomas, Grady Q",11680,9.23,"<30","<56.507","DOES NOT MEET","MEETS","DOES NOT MEET","MEETS",56.506999999999998,30]
["Vulcan Materials Co.","Smith Grove Q. - Mocksville","2020-02-03","#57 Stone for Electrochemical","CA80",{"$f":"VLOOKUP(Table16[[#This Row],[Facility ID]],'Coord.'!$A$1:$E$818,2,FALSE)","v":"N"},{"$f":"VLOOKUP(Table16[[#This Row],[Facility ID]],'Coord.'!$A$1:$E$818,3,FALSE)","v":35.967185000000001},{"$f":"VLOOKUP(Table16[[#This Row],[Facility ID]],'Coord.'!$A$1:$E$818,4,FALSE)","v":"W"},{"$f":"VLOOKUP(Table16[[#This Row],[Facility ID]],'Coord.'!$A$1:$E$818,5,FALSE)","v":-80.530692999999999},998601,"Ealey, Lee E",24340,9.56,"<30","<27.116","DOES NOT MEET","MEETS","N/A","N/A",27.116,30]
["Hedrick Industries","South McDowell Quarry - Marion","2019-01-24","#57 Stone for Electrochemical","CA283",{"$f":"VLOOKUP(Table16[[#This Row],[Facility ID]],'Coord.'!$A$1:$E$818,2,FALSE)","v":"N"},{"$f":"VLOOKUP(Table16[[#This Row],[Facility ID]],'Coord.'!$A$1:$E$818,3,FALSE)","v":35.632061},{"$f":"VLOOKUP(Table16[[#This Row],[Facility ID]],'Coord.'!$A$1:$E$818,4,FALSE)","v":"W"},{"$f":"VLOOKUP(Table16[[#This Row],[Facility ID]],'Coord.'!$A$1:$E$818,5,FALSE)","v":-81.961977000000005},946847,"Rhymer, Robert C",22238,9.3000000000000007,0,"<29.679","DOES NOT MEET","MEETS","N/A","N/A",29.678999999999998,0]
["Salem Stone Corp.","Southside Materials - S. Boston Quarry (VA)","2019-05-21","#57 Stone for Electrochemical","CA78",{"$f":"VLOOKUP(Table16[[#This Row],[Facility ID]],'Coord.'!$A$1:$E$818,2,FALSE)","v":"N"},{"$f":"VLOOKUP(Table16[[#This Row],[Facility ID]],'Coord.'!$A$1:$E$818,3,FALSE)","v":36.727434000000002},{"$f":"VLOOKUP(Table16[[#This Row],[Facility ID]],'Coord.'!$A$1:$E$818,4,FALSE)","v":"W"},{"$f":"VLOOKUP(Table16[[#This Row],[Facility ID]],'Coord.'!$A$1:$E$818,5,FALSE)","v":-78.846988999999994},964760,"Westmoreland, Braxton J",22400,9.6,"<30","<29.464","DOES NOT MEET","MEETS","N/A","N/A",29.463999999999999,30]
["Salem Stone Corp.","Southside Materials - Shelton Quarry - Pelham","2019-02-28","#57 Stone for Electrochemical","CA75",{"$f":"VLOOKUP(Table16[[#This Row],[Facility ID]],'Coord.'!$A$1:$E$818,2,FALSE)","v":0},{"$f":"VLOOKUP(Table16[[#This Row],[Facility ID]],'Coord.'!$A$1:$E$818,3,FALSE)","v":36.535156999999998},{"$f":"VLOOKUP(Table16[[#This Row],[Facility ID]],'Coord.'!$A$1:$E$818,4,FALSE)","v":0},{"$f":"VLOOKUP(Table16[[#This Row],[Facility ID]],'Coord.'!$A$1:$E$818,5,FALSE)","v":-79.459670000000003},952399,"Westmoreland, Braxton J",27050,9.1,"<30","<24.399","DOES NOT MEET","MEETS","N/A","N/A",24.399000000000001,30]
["Vulcan Materials Co.","Spruce Pine Quarry - Bakersville","2019-09-16","#57 Stone for Electrochemical","CA111",{"$f":"VLOOKUP(Table16[[#This Row],[Facility ID]],'Coord.'!$A$1:$E$818,2,FALSE)","v":"N"},{"$f":"VLOOKUP(Table16[[#This Row],[Facility ID]],'Coord.'!$A$1:$E$818,3,FALSE)","v":35.583199999999998},{"$f":"VLOOKUP(Table16[[#This Row],[Facility ID]],'Coord.'!$A$1:$E$818,4,FALSE)","v":"W"},{"$f":"VLOOKUP(Table16[[#This Row],[Facility ID]],'Coord.'!$A$1:$E$818,5,FALSE)","v":-82.054100000000005},983085,"Norton, Stephen S",17960,9.24,"<32","<36.748","DOES NOT MEET","MEETS","N/A","N/A",36.747999999999998,32]
["Martin Marietta","Statesville Quarry - Statesville","2019-07-08","#57 Stone for Electrochemical","CA54",{"$f":"VLOOKUP(Table16[[#This Row],[Facility ID]],'Coord.'!$A$1:$E$818,2,FALSE)","v":"N"},{"$f":"VLOOKUP(Table16[[#This Row],[Facility ID]],'Coord.'!$A$1:$E$818,3,FALSE)","v":35.804465999999998},{"$f":"VLOOKUP(Table16[[#This Row],[Facility ID]],'Coord.'!$A$1:$E$818,4,FALSE)","v":"W"},{"$f":"VLOOKUP(Table16[[#This Row],[Facility ID]],'Coord.'!$A$1:$E$818,5,FALSE)","v":-80.913083999999998},971770,"Gosnell, Jimmy L",17290,9.42,"<29","<38.172","DOES NOT MEET","MEETS","N/A","N/A",38.171999999999997,29]
["Vulcan Materials Co.","Stokesdale Quarry - Stokesdale","2019-02-28","#57 Stone for Electrochemical","CA76",{"$f":"VLOOKUP(Table16[[#This Row],[Facility ID]],'Coord.'!$A$1:$E$818,2,FALSE)","v":0},{"$f":"VLOOKUP(Table16[[#This Row],[Facility ID]],'Coord.'!$A$1:$E$818,3,FALSE)","v":36.241660000000003},{"$f":"VLOOKUP(Table16[[#This Row],[Facility ID]],'Coord.'!$A$1:$E$818,4,FALSE)","v":"W"},{"$f":"VLOOKUP(Table16[[#This Row],[Facility ID]],'Coord.'!$A$1:$E$818,5,FALSE)","v":-79.935815000000005},952379,"Westmoreland, Braxton J",25310,9.6,0,"<26.077","DOES NOT MEET","MEETS","N/A","N/A",26.077000000000002,0]
["Martin Marietta","Thomasville Quarry - Thomasville","2020-03-10","#57 Stone for Electrochemical","CA102",{"$f":"VLOOKUP(Table16[[#This Row],[Facility ID]],'Coord.'!$A$1:$E$818,2,FALSE)","v":"N"},{"$f":"VLOOKUP(Table16[[#This Row],[Facility ID]],'Coord.'!$A$1:$E$818,3,FALSE)","v":35.853850000000001},{"$f":"VLOOKUP(Table16[[#This Row],[Facility ID]],'Coord.'!$A$1:$E$818,4,FALSE)","v":"W"},{"$f":"VLOOKUP(Table16[[#This Row],[Facility ID]],'Coord.'!$A$1:$E$818,5,FALSE)","v":-80.160167999999999},1005546,"Ealey, Lee E",22040,9.6300000000000008,"<30","<29.946","DOES NOT MEET","MEETS","N/A","N/A",29.946000000000002,30]
["Taylor & Murphy Const. Co., Inc.","TM-Madison County Area #3 (US19 Widening)","2011-03-23","#57 Stone for Electrochemical","CA364",{"$f":"VLOOKUP(Table16[[#This Row],[Facility ID]],'Coord.'!$A$1:$E$818,2,FALSE)","v":"N"},{"$f":"VLOOKUP(Table16[[#This Row],[Facility ID]],'Coord.'!$A$1:$E$818,3,FALSE)","v":35.876202999999997},{"$f":"VLOOKUP(Table16[[#This Row],[Facility ID]],'Coord.'!$A$1:$E$818,4,FALSE)","v":"W"},{"$f":"VLOOKUP(Table16[[#This Row],[Facility ID]],'Coord.'!$A$1:$E$818,5,FALSE)","v":-82.479816999999997},534938,"Lance, Kevin C",21929,8.4,0,0,"MEETS","MEETS","N/A","N/A",0,0]
["Taylor & Murphy Const. Co., Inc.","TM-Madison County Area #3 (US19 Widening)","2011-03-23","#57 Stone for Electrochemical","CA364",{"$f":"VLOOKUP(Table16[[#This Row],[Facility ID]],'Coord.'!$A$1:$E$818,2,FALSE)","v":"N"},{"$f":"VLOOKUP(Table16[[#This Row],[Facility ID]],'Coord.'!$A$1:$E$818,3,FALSE)","v":35.876202999999997},{"$f":"VLOOKUP(Table16[[#This Row],[Facility ID]],'Coord.'!$A$1:$E$818,4,FALSE)","v":"W"},{"$f":"VLOOKUP(Table16[[#This Row],[Facility ID]],'Coord.'!$A$1:$E$818,5,FALSE)","v":-82.479816999999997},534940,"Lance, Kevin C",19305,8.1999999999999993,134,0,"MEETS","MEETS","N/A","N/A",0,134]
["Taylor & Murphy Const. Co., Inc.","TM-Madison County Area #3 (US19 Widening)","2011-03-23","#57 Stone for Electrochemical","CA364",{"$f":"VLOOKUP(Table16[[#This Row],[Facility ID]],'Coord.'!$A$1:$E$818,2,FALSE)","v":"N"},{"$f":"VLOOKUP(Table16[[#This Row],[Facility ID]],'Coord.'!$A$1:$E$818,3,FALSE)","v":35.876202999999997},{"$f":"VLOOKUP(Table16[[#This Row],[Facility ID]],'Coord.'!$A$1:$E$818,4,FALSE)","v":"W"},{"$f":"VLOOKUP(Table16[[#This Row],[Facility ID]],'Coord.'!$A$1:$E$818,5,FALSE)","v":-82.479816999999997},534939,"Lance, Kevin C",23529,8.1,146,0,"MEETS","MEETS","N/A","N/A",0,146]
["Wake Stone Corp.","Triangle Quarry - Cary","2016-02-12","#57 Stone for Electrochemical","CA157",{"$f":"VLOOKUP(Table16[[#This Row],[Facility ID]],'Coord.'!$A$1:$E$818,2,FALSE)","v":"N"},{"$f":"VLOOKUP(Table16[[#This Row],[Facility ID]],'Coord.'!$A$1:$E$818,3,FALSE)","v":35.838397000000001},{"$f":"VLOOKUP(Table16[[#This Row],[Facility ID]],'Coord.'!$A$1:$E$818,4,FALSE)","v":"W"},{"$f":"VLOOKUP(Table16[[#This Row],[Facility ID]],'Coord.'!$A$1:$E$818,5,FALSE)","v":-78.767809},793925,"Skinner, III, John L",24631,7.7,5,4,"MEETS","MEETS","N/A","N/A",4,5]
["J.T. Russell & Sons, Inc.","Troy Sales Yard","2016-05-19","#57 Stone for Electrochemical","CA403",{"$f":"VLOOKUP(Table16[[#This Row],[Facility ID]],'Coord.'!$A$1:$E$818,2,FALSE)","v":"N"},{"$f":"VLOOKUP(Table16[[#This Row],[Facility ID]],'Coord.'!$A$1:$E$818,3,FALSE)","v":35.345421000000002},{"$f":"VLOOKUP(Table16[[#This Row],[Facility ID]],'Coord.'!$A$1:$E$818,4,FALSE)","v":"W"},{"$f":"VLOOKUP(Table16[[#This Row],[Facility ID]],'Coord.'!$A$1:$E$818,5,FALSE)","v":-79.914164999999997},807584,"Tucker, Rusty J",72098,7.4,0,5.3,"MEETS","MEETS","N/A","N/A",5.3,0]
["Maymead Materials, Inc.","Turnip Patch Quarry - Mountain City, TN","2019-05-23","#57 Stone for Electrochemical","CA153",{"$f":"VLOOKUP(Table16[[#This Row],[Facility ID]],'Coord.'!$A$1:$E$818,2,FALSE)","v":"N"},{"$f":"VLOOKUP(Table16[[#This Row],[Facility ID]],'Coord.'!$A$1:$E$818,3,FALSE)","v":36.426709000000002},{"$f":"VLOOKUP(Table16[[#This Row],[Facility ID]],'Coord.'!$A$1:$E$818,4,FALSE)","v":"W"},{"$f":"VLOOKUP(Table16[[#This Row],[Facility ID]],'Coord.'!$A$1:$E$818,5,FALSE)","v":-81.773808000000002},965559,"Church, Tracy G",20440,9.34,"<30","<32.29","DOES NOT MEET","MEETS","N/A","N/A",32.29,30]
["Blue Water Industries","Watauga Quarry","2016-09-28","#57 Stone for Electrochemical","CA133",{"$f":"VLOOKUP(Table16[[#This Row],[Facility ID]],'Coord.'!$A$1:$E$818,2,FALSE)","v":"N"},{"$f":"VLOOKUP(Table16[[#This Row],[Facility ID]],'Coord.'!$A$1:$E$818,3,FALSE)","v":36.370564999999999},{"$f":"VLOOKUP(Table16[[#This Row],[Facility ID]],'Coord.'!$A$1:$E$818,4,FALSE)","v":"W"},{"$f":"VLOOKUP(Table16[[#This Row],[Facility ID]],'Coord.'!$A$1:$E$818,5,FALSE)","v":-82.296366000000006},828603,"Church, Tracy G",16139,6.7,0,6.1,"MEETS","MEETS","N/A","N/A",6.1,0]
["Harrison Construction Co., Inc.","Waynesville Quarry - Waynesville","2019-07-29","#57 Stone for Electrochemical","CA1",{"$f":"VLOOKUP(Table16[[#This Row],[Facility ID]],'Coord.'!$A$1:$E$818,2,FALSE)","v":"N"},{"$f":"VLOOKUP(Table16[[#This Row],[Facility ID]],'Coord.'!$A$1:$E$818,3,FALSE)","v":35.440697},{"$f":"VLOOKUP(Table16[[#This Row],[Facility ID]],'Coord.'!$A$1:$E$818,4,FALSE)","v":"W"},{"$f":"VLOOKUP(Table16[[#This Row],[Facility ID]],'Coord.'!$A$1:$E$818,5,FALSE)","v":-83.007457000000002},974809,"Kindley, Wallace Quint",12180,9.0299999999999994,"<29","<54.187","DOES NOT MEET","MEETS","N/A","N/A",54.186999999999998,29]
["LBM Industries","Whitewater Falls Quarry - Sapphire","2019-08-21","#57 Stone for Electrochemical","CA119",{"$f":"VLOOKUP(Table16[[#This Row],[Facility ID]],'Coord.'!$A$1:$E$818,2,FALSE)","v":"N"},{"$f":"VLOOKUP(Table16[[#This Row],[Facility ID]],'Coord.'!$A$1:$E$818,3,FALSE)","v":35.056310000000003},{"$f":"VLOOKUP(Table16[[#This Row],[Facility ID]],'Coord.'!$A$1:$E$818,4,FALSE)","v":"W"},{"$f":"VLOOKUP(Table16[[#This Row],[Facility ID]],'Coord.'!$A$1:$E$818,5,FALSE)","v":-82.582790000000003},979122,"Wood, Dean Michael M",39270,9.1,"<32","<16.807","DOES NOT MEET","MEETS","N/A","N/A",16.806999999999999,32]
["Boone's Concrete Supply, LLC","Woodlawn Quarry - Marion","2019-09-23","#57 Stone for Electrochemical","CA190",{"$f":"VLOOKUP(Table16[[#This Row],[Facility ID]],'Coord.'!$A$1:$E$818,2,FALSE)","v":"N"},{"$f":"VLOOKUP(Table16[[#This Row],[Facility ID]],'Coord.'!$A$1:$E$818,3,FALSE)","v":35.787314000000002},{"$f":"VLOOKUP(Table16[[#This Row],[Facility ID]],'Coord.'!$A$1:$E$818,4,FALSE)","v":"W"},{"$f":"VLOOKUP(Table16[[#This Row],[Facility ID]],'Coord.'!$A$1:$E$818,5,FALSE)","v":-82.036208000000002},984072,"Norton, Stephen S",12400,9.7799999999999994,"<32","<53.226","DOES NOT MEET","MEETS","N/A","N/A",53.225999999999999,32]
["Martin Marietta","Woodleaf Quarry - Salisbury","2020-03-03","#57 Stone for Electrochemical","CA56",{"$f":"VLOOKUP(Table16[[#This Row],[Facility ID]],'Coord.'!$A$1:$E$818,2,FALSE)","v":"N"},{"$f":"VLOOKUP(Table16[[#This Row],[Facility ID]],'Coord.'!$A$1:$E$818,3,FALSE)","v":35.773539},{"$f":"VLOOKUP(Table16[[#This Row],[Facility ID]],'Coord.'!$A$1:$E$818,4,FALSE)","v":"W"},{"$f":"VLOOKUP(Table16[[#This Row],[Facility ID]],'Coord.'!$A$1:$E$818,5,FALSE)","v":-80.598793000000001},1005347,"Ealey, Lee E",24680,9.4600000000000009,"<30","<26.742","DOES NOT MEET","MEETS","N/A","N/A"]

{"sheet":"Historical Data CoarseAggregate","index":2,"n_rows":945,"n_cols":20,"rows_kept":945,"cut":false,"hidden":false,"merged":[]}
["Producer Name","Facility Name","Sample Date","Material Description","Facility ID","Sample ID","Sampled By","Resistivity [ohm-cm]:","pH Units:","Chloride [ppm]:","Sulfate [ppm]:","Geosynthetic Spec","Steel Spec","Coastal Plain Geosynthetic Spec","Coastal Plain Steel Spec","SO4","Cl",null,null," Coastal Plain Aggregates"]
["Wake Stone Corp.","Moncure Quarry - Moncure","2020-10-14","#57 Stone for Electrochemical","CA100",1023283,"Braly, James R",18550,9.49,"<30","<35.58",{"$f":"IF(AND(4.5 <= $I2, $I2 <= 9), \"MEETS\", \"DOES NOT MEET\")","v":"DOES NOT MEET"},{"$f":"IF(AND(5 <= $I2, $I2 <= 10), \"MEETS\", \"DOES NOT MEET\")","v":"MEETS"},{"$f":"IF(OR(ISBLANK(H2), NOT(ISNUMBER(MATCH($E2, Coastal,0)))), \"N/A\", IF(AND(4.5 <= $I2, $I2 <= 9),IF($H2>=5000,IF($Q2<=100,IF($P2<=200,\"MEETS\",\"DOES NOT MEET\"),\"DOES NOT MEET\"),\"DOES NOT MEET\"),\"DOES NOT MEET\"))","v":"N/A"},{"$f":"IF(OR(ISBLANK(I2), NOT(ISNUMBER(MATCH($E2, Coastal, 0)))), \"N/A\", IF(AND(5 <= $I2, $I2 <= 10),IF($H2>=5000,IF($Q2<=100,IF($P2<=200,\"MEETS\",\"DOES NOT MEET\"),\"DOES NOT MEET\"),\"DOES NOT MEET\"),\"DOES NOT MEET\"))","v":"N/A"},{"$f":"IF(LEFT(K2, 1)=\"<\", VALUE(RIGHT(K2,LEN(K2)-1)), K2)","v":35.58},{"$f":"IF(LEFT(J2, 1)=\"<\", VALUE(RIGHT(J2,LEN(J2)-1)), J2)","v":30},null,null,"CA345"]
["Wake Stone Corp.","Moncure Quarry - Moncure","2020-10-14","#78-M Stone for Electrochemical","CA100",1023300,"Braly, James R",14920,9.1999999999999993,"<30","<44.236","DOES NOT MEET","MEETS","N/A","N/A",44.235999999999997,30,null,null,"CA224"]
["Martin Marietta","Fountain Quarry - Fountain","2020-09-25","#57 Stone for Electrochemical","CA42",1021240,"Cobb, James R",22540,9.2200000000000006,"<30","<29.281","DOES NOT MEET","MEETS","DOES NOT MEET","MEETS",29.280999999999999,30,null,null,"CA137"]
["Martin Marietta","Fountain Quarry - Fountain","2020-09-25","#78-M Stone for Electrochemical","CA42",1021241,"Cobb, James R",14210,9.44,"<30","<46.446","DOES NOT MEET","MEETS","DOES NOT MEET","MEETS",46.445999999999998,30,null,null,"CA337"]
["Vulcan Materials Co.","Jack Quarry - Petersburg, VA","2020-09-21","#78-M Stone for Electrochemical","CA137",1021105,"Bonds, Maria M",10330,9.51,"<30","<63.892","DOES NOT MEET","MEETS","DOES NOT MEET","MEETS",63.892000000000003,30,null,null,"CA411"]
["Vulcan Materials Co.","Jack Quarry - Petersburg, VA","2020-09-21","#67 Stone for Electrochemical","CA137",1021106,"Bonds, Maria M",19570,9.52,"<30","<33.725","DOES NOT MEET","MEETS","DOES NOT MEET","MEETS",33.725000000000001,30,null,null,"CA216"]
["Vulcan Materials Co.","Havre De Grace Quarry - Havre De Grace, MD","2020-09-21","Miscellaneous Material for Electrochemical","CA345",1021092,"Bonds, Maria M",21050,8.7799999999999994,"<30","<31.354","MEETS","MEETS","MEETS","MEETS",31.353999999999999,30,null,null,"CA55"]
["Vulcan Materials Co.","Havre De Grace Quarry - Havre De Grace, MD","2020-09-21","#67 Stone for Electrochemical","CA345",1021094,"Bonds, Maria M",13710,9.31,"<30","<48.140","DOES NOT MEET","MEETS","DOES NOT MEET","MEETS",48.14,30,null,null,"CA223"]
["Vulcan Materials Co.","Puddledock Quarry - Prince George, VA","2020-09-21","#78-M Stone for Electrochemical","CA224",1021102,"Bonds, Maria M",38360,4.87,"<30","<17.205","MEETS","DOES NOT MEET","MEETS","DOES NOT MEET",17.204999999999998,30,null,null,"CA371"]
["Vulcan Materials Co.","Puddledock Quarry - Prince George, VA","2020-09-21","#57 Stone for Electrochemical","CA224",1021103,"Bonds, Maria M",21740,4.3600000000000003,"<30","<30.359","DOES NOT MEET","DOES NOT MEET","DOES NOT MEET","DOES NOT MEET",30.359000000000002,30,null,null,"CA288"]
["Wake Stone Corp.","Knightdale Quarry - Knightdale","2020-09-14","#78-M Stone for Electrochemical","CA98",1020095,"Skinner, III, John L",16560,9.51,"<30","<39.855","DOES NOT MEET","MEETS","N/A","N/A",39.854999999999997,30,null,null,"CA66"]
["Vulcan Materials Co.","Hendersonville Quarry - Hendersonville","2020-07-27","#57 Stone for Electrochemical","CA81",1015163,"Wood, Dean Michael M",27630,9.5399999999999991,"<30","<23.887","DOES NOT MEET","MEETS","N/A","N/A",23.887,30,null,null,"CA42"]
["Wake Stone Corp.","Knightdale Quarry - Knightdale","2020-05-19","Coarse Aggregate, #78M","CA98",1009036,"Riddle, Andrew T",18200,8.74,"<30","<36","MEETS","MEETS","N/A","N/A",36,30,null,null,"CA64"]
["Carolina Stalite Corp.","Gold Hill (Light Wt.) - Gold Hill","2020-04-07","#67 Stone for Electrochemical","CA226",1004812,"Whitley, Christopher D",8852,9.4499999999999993,"<30","<74.56","DOES NOT MEET","MEETS","N/A","N/A",74.56,30,null,null,"CA380"]
["Carolina Stalite Corp.","Gold Hill (Light Wt.) - Gold Hill","2020-04-07","#78-M Stone for Electrochemical","CA226",1004822,"Whitley, Christopher D",4816,9.67,"<30","<137.0","DOES NOT MEET","MEETS","N/A","N/A",137,30,null,null,"CA390"]
["Wake Stone Corp.","Knightdale Quarry - Knightdale","2020-03-13","Coarse Aggregate, #78M","CA98",1002358,"Cheeves, Patrick",16340,9.26,"<30","<40.392","DOES NOT MEET","MEETS","N/A","N/A",40.392000000000003,30,null,null,"CA189"]
["Martin Marietta","Salem Stone Quarry - Kernersville","2020-03-10","#57 Stone for Electrochemical","CA209",1005499,"Ealey, Lee E",25960,9.61,"<30","<25.424","DOES NOT MEET","MEETS","N/A","N/A",25.423999999999999,30,null,null,"CA38"]
["Martin Marietta","Salem Stone Quarry - Kernersville","2020-03-10","#67 Stone for Electrochemical","CA209",1005503,"Ealey, Lee E",22730,9.6,"<30","<29.037","DOES NOT MEET","MEETS","N/A","N/A",29.036999999999999,30,null,null,"CA381"]
["Martin Marietta","Salem Stone Quarry - Kernersville","2020-03-10","#78-M Stone for Electrochemical","CA209",1005506,"Ealey, Lee E",22540,9.2799999999999994,"<30","<29.281","DOES NOT MEET","MEETS","N/A","N/A",29.280999999999999,30,null,null,"CA408"]
["Martin Marietta","Thomasville Quarry - Thomasville","2020-03-10","#57 Stone for Electrochemical","CA102",1005546,"Ealey, Lee E",22040,9.6300000000000008,"<30","<29.946","DOES NOT MEET","MEETS","N/A","N/A",29.946000000000002,30,null,null,"CA259"]
["Martin Marietta","Thomasville Quarry - Thomasville","2020-03-10","#67 Stone for Electrochemical","CA102",1005547,"Ealey, Lee E",19780,9.69,"<30","<33.367","DOES NOT MEET","MEETS","N/A","N/A",33.366999999999997,30,null,null,"CA380"]
["Martin Marietta","Thomasville Quarry - Thomasville","2020-03-10","#78-M Stone for Electrochemical","CA102",1005551,"Ealey, Lee E",17700,9.57,"<30","<37.288","DOES NOT MEET","MEETS","N/A","N/A",37.287999999999997,30,null,null,"CA319"]
["Martin Marietta","Woodleaf Quarry - Salisbury","2020-03-03","#57 Stone for Electrochemical","CA56",1005347,"Ealey, Lee E",24680,9.4600000000000009,"<30","<26.742","DOES NOT MEET","MEETS","N/A","N/A",26.742000000000001,30,null,null,"CA349"]
["Martin Marietta","Woodleaf Quarry - Salisbury","2020-03-03","#67 Stone for Electrochemical","CA56",1005348,"Ealey, Lee E",16770,9.4499999999999993,"<30","<39.356","DOES NOT MEET","MEETS","N/A","N/A",39.356000000000002,30,null,null,"CA272"]
["Martin Marietta","Woodleaf Quarry - Salisbury","2020-03-03","#78-M Stone for Electrochemical","CA56",1005350,"Ealey, Lee E",17540,9.48,"<30","<37.628","DOES NOT MEET","MEETS","N/A","N/A",37.628,30,null,null,"CA289"]
["Martin Marietta","Kannapolis Quarry - Landis","2020-02-26","#57 Stone for Electrochemical","CA47",1000981,"Ealey, Lee E",24350,9.39,"<30","<27.105","DOES NOT MEET","MEETS","N/A","N/A",27.105,30,null,null,"CA310"]
["Martin Marietta","Kannapolis Quarry - Landis","2020-02-26","#67 Stone for Electrochemical","CA47",1000982,"Ealey, Lee E",16709,8.99,"<30","<39.5","MEETS","MEETS","N/A","N/A",39.5,30,null,null,"CA138"]
["Martin Marietta","Kannapolis Quarry - Landis","2020-02-26","#78-M Stone for Electrochemical","CA47",1000984,"Ealey, Lee E",20890,9.1300000000000008,"<30","<31.594","DOES NOT MEET","MEETS","N/A","N/A",31.594000000000001,30,null,null,"CA63"]
["Wake Stone Corp.","Knightdale Quarry - Knightdale","2020-02-25","#78-M Stone for Electrochemical","CA98",1000356,"Skinner, III, John L",17070,9.1999999999999993,"<30","<38.664","DOES NOT MEET","MEETS","N/A","N/A",38.664000000000001,30]
["Vulcan Materials Co.","North Quarry - Winston Salem","2020-02-25","#57 Stone for Electrochemical","CA72",1000797,"Ealey, Lee E",21160,9.3800000000000008,"<30","<31.191","DOES NOT MEET","MEETS","N/A","N/A",31.190999999999999,30]
["Vulcan Materials Co.","North Quarry - Winston Salem","2020-02-25","#67 Stone for Electrochemical","CA72",1000798,"Ealey, Lee E",22070,9.36,"<30","<29.905","DOES NOT MEET","MEETS","N/A","N/A",29.905000000000001,30]
["Vulcan Materials Co.","North Quarry - Winston Salem","2020-02-25","#78-M Stone for Electrochemical","CA72",1000799,"Ealey, Lee E",19050,9.24,"<30","<34.646","DOES NOT MEET","MEETS","N/A","N/A",34.646000000000001,30]
["Vulcan Materials Co.","East Forsyth Quarry - Kernersville","2020-02-24","#57 Stone for Electrochemical","CA139",1000306,"Ealey, Lee E",19230,9.3800000000000008,"<30","<34.321","DOES NOT MEET","MEETS","N/A","N/A",34.320999999999998,30]
["Vulcan Materials Co.","East Forsyth Quarry - Kernersville","2020-02-24","#67 Stone for Electrochemical","CA139",1000307,"Ealey, Lee E",21680,9.36,"<30","<30.443","DOES NOT MEET","MEETS","N/A","N/A",30.443000000000001,30]
["Vulcan Materials Co.","East Forsyth Quarry - Kernersville","2020-02-24","#78-M Stone for Electrochemical","CA139",1000310,"Ealey, Lee E",16860,9.25,"<30","<39.146","DOES NOT MEET","MEETS","N/A","N/A",39.146000000000001,30]
["Vulcan Materials Co.","Gold Hill Quarry - Gold Hill","2020-02-20","#57 Stone for Electrochemical","CA85",1000215,"Ealey, Lee E",7432,8.4499999999999993,"<30","<88.805","MEETS","MEETS","N/A","N/A",88.805000000000007,30]
["Vulcan Materials Co.","Gold Hill Quarry - Gold Hill","2020-02-20","#78-M Stone for Electrochemical","CA85",1000216,"Ealey, Lee E",6092,8.35,"<30","<108.339","MEETS","MEETS","N/A","N/A",108.339,30]
["Vulcan Materials Co.","Skippers Quarry - Skippers, VA","2020-02-05","#57 Stone for Electrochemical","CA55",998836,"Thomas, Grady Q",11680,9.23,"<30","<56.507","DOES NOT MEET","MEETS","DOES NOT MEET","MEETS",56.506999999999998,30]
["Vulcan Materials Co.","Skippers Quarry - Skippers, VA","2020-02-05","#78-M Stone for Electrochemical","CA55",998832,"Thomas, Grady Q",15140,9.33,"<30","<43.593","DOES NOT MEET","MEETS","DOES NOT MEET","MEETS",43.593000000000004,30]
["Vulcan Materials Co.","Clear Creek Q. - Charlotte","2020-02-04","#57 Stone for Electrochemical","CA249",998428,"Pegues, Jr., Henderson",24690,9.57,"<30","<26.731","DOES NOT MEET","MEETS","N/A","N/A",26.731000000000002,30]
["Vulcan Materials Co.","Clear Creek Q. - Charlotte","2020-02-04","#67 Stone for Electrochemical","CA249",998435,"Pegues, Jr., Henderson",22470,9.57,"<30","<29.372","DOES NOT MEET","MEETS","N/A","N/A",29.372,30]
["Vulcan Materials Co.","Clear Creek Q. - Charlotte","2020-02-04","#78-M Stone for Electrochemical","CA249",998424,"Pegues, Jr., Henderson",20190,9.4600000000000009,"<30","<32.689","DOES NOT MEET","MEETS","N/A","N/A",32.689,30]
["Vulcan Materials Co.","Smith Grove Q. - Mocksville","2020-02-03","#57 Stone for Electrochemical","CA80",998601,"Ealey, Lee E",24340,9.56,"<30","<27.116","DOES NOT MEET","MEETS","N/A","N/A",27.116,30]
["Vulcan Materials Co.","Smith Grove Q. - Mocksville","2020-02-03","#67 Stone for Electrochemical","CA80",998597,"Ealey, Lee E",23390,9.52,"<30","<28.217","DOES NOT MEET","MEETS","N/A","N/A",28.216999999999999,30]
["Vulcan Materials Co.","Smith Grove Q. - Mocksville","2020-02-03","#78-M Stone for Electrochemical","CA80",998595,"Ealey, Lee E",21020,9.4499999999999993,"<30","<31.399","DOES NOT MEET","MEETS","N/A","N/A",31.399000000000001,30]
["Wake Stone Corp.","Knightdale Quarry - Knightdale","2020-01-29","#78-M Stone for Electrochemical","CA98",997869,"Skinner, III, John L",19800,9.5,"<30","<33.333","DOES NOT MEET","MEETS","N/A","N/A",33.332999999999998,30]
["Martin Marietta","Bakers Quarry - Monroe","2019-11-27","#57 Stone for Electrochemical","CA32",993357,"Smith, Michael L",22460,9.34,"<30","<29.386","DOES NOT MEET","MEETS","N/A","N/A",29.385999999999999,30]
["Martin Marietta","Bakers Quarry - Monroe","2019-11-27","#67 Stone for Electrochemical","CA32",993358,"Smith, Michael L",23130,9.3800000000000008,"<30","<28.534","DOES NOT MEET","MEETS","N/A","N/A",28.533999999999999,30]
["Martin Marietta","Bakers Quarry - Monroe","2019-11-27","#78-M Stone for Electrochemical","CA32",993359,"Smith, Michael L",17070,9.27,"<30","<38.664","DOES NOT MEET","MEETS","N/A","N/A",38.664000000000001,30]
["Martin Marietta","Matthews Quarry - Matthews","2019-11-25","#57 Stone for Electrochemical","CA37",993304,"Smith, Michael L",19880,9.3800000000000008,"<30","<33.199","DOES NOT MEET","MEETS","N/A","N/A",33.198999999999998,30]
["Martin Marietta","Matthews Quarry - Matthews","2019-11-25","#67 Stone for Electrochemical","CA37",993307,"Smith, Michael L",18460,9.3699999999999992,"<30","<35.753","DOES NOT MEET","MEETS","N/A","N/A",35.753,30]
["Martin Marietta","Matthews Quarry - Matthews","2019-11-25","#78-M Stone for Electrochemical","CA37",993308,"Smith, Michael L",18410,9.25,"<30","<35.850","DOES NOT MEET","MEETS","N/A","N/A",35.85,30]
["Vulcan Materials Co.","Boone Quarry - Boone","2019-11-22","#57 Stone for Electrochemical","CA21",993803,"Church, Tracy G",81740,7.97,"<30","<8.074","MEETS","MEETS","N/A","N/A",8.0739999999999998,30]
["Martin Marietta","Mallard Creek Quarry - Charlotte","2019-11-06","#67 Stone for Electrochemical","CA188",990713,"Pegues, Jr., Henderson",17870,9.44,"<32","<36.933","DOES NOT MEET","MEETS","N/A","N/A",36.933,32]
["Martin Marietta","Mallard Creek Quarry - Charlotte","2019-11-06","#78-M Stone for Electrochemical","CA188",990711,"Pegues, Jr., Henderson",15450,9.34,"<32","<42.718","DOES NOT MEET","MEETS","N/A","N/A",42.718000000000004,32]
["Martin Marietta","Statesville Quarry - Statesville","2019-10-09","#67 Stone for Electrochemical","CA54",987452,"Brinson, Joseph",9875,9.41,"<30","<66.835","DOES NOT MEET","MEETS","N/A","N/A",66.834999999999994,30]
["Martin Marietta","Statesville Quarry - Statesville","2019-10-09","#78-M Stone for Electrochemical","CA54",987453,"Brinson, Joseph",6641,6.94,"<30","<99.383","MEETS","MEETS","N/A","N/A",99.382999999999996,30]
["Thompson Contractors","Miller Creek Quarry - Rutherfordton","2019-09-27","#57 Stone for Electrochemical","CA59",985267,"Norton, Stephen S",19130,9.5299999999999994,"<30","<34.501","DOES NOT MEET","MEETS","N/A","N/A",34.500999999999998,30]
["Thompson Contractors","Miller Creek Quarry - Rutherfordton","2019-09-27","#78-M Stone for Electrochemical","CA59",985270,"Norton, Stephen S",14090,9.34,"<30","<46.842","DOES NOT MEET","MEETS","N/A","N/A",46.841999999999999,30]
["Hedrick Industries","Aquadale Quarry - Norwood","2019-09-24","#57 Stone for Electrochemical","CA274",984751,"Smith, Michael L",11040,8.92,"<32","<59.783","MEETS","MEETS","N/A","N/A",59.783000000000001,32]
["Hedrick Industries","Aquadale Quarry - Norwood","2019-09-24","#67 Stone for Electrochemical","CA274",984693,"Smith, Michael L",14180,9.02,"<32","<46.544","DOES NOT MEET","MEETS","N/A","N/A",46.543999999999997,32]
["Hedrick Industries","Aquadale Quarry - Norwood","2019-09-24","#78-M Stone for Electrochemical","CA274",984802,"Smith, Michael L",9018,8.86,"<32","<73.187","MEETS","MEETS","N/A","N/A",73.186999999999998,32]
["Vulcan Materials Co.","Cabarrus Quarry - Concord","2019-09-24","#57 Stone for Electrochemical","CA186",984941,"Cero, Kevin M",15810,9.58,"<32","<41.746","DOES NOT MEET","MEETS","N/A","N/A",41.746000000000002,32]
["Vulcan Materials Co.","Cabarrus Quarry - Concord","2019-09-24","#67 Stone for Electrochemical","CA186",984943,"Cero, Kevin M",17720,9.65,"<32","<37.246","DOES NOT MEET","MEETS","N/A","N/A",37.246000000000002,32]
["Vulcan Materials Co.","Cabarrus Quarry - Concord","2019-09-24","#78-M Stone for Electrochemical","CA186",984945,"Cero, Kevin M",15200,9.73,"<32","<43.421",{"$f":"IF(AND(4.5 <= $I66, $I66 <= 9), \"MEETS\", \"DOES NOT MEET\")","v":"DOES NOT MEET"},{"$f":"IF(AND(5 <= $I66, $I66 <= 10), \"MEETS\", \"DOES NOT MEET\")","v":"MEETS"},{"$f":"IF(OR(ISBLANK(H66), NOT(ISNUMBER(MATCH($E66, Coastal,0)))), \"N/A\", IF(AND(4.5 <= $I66, $I66 <= 9),IF($H66>=5000,IF($Q66<=100,IF($P66<=200,\"MEETS\",\"DOES NOT MEET\"),\"DOES NOT MEET\"),\"DOES NOT MEET\"),\"DOES NOT MEET\"))","v":"N/A"},{"$f":"IF(OR(ISBLANK(I66), NOT(ISNUMBER(MATCH($E66, Coastal, 0)))), \"N/A\", IF(AND(5 <= $I66, $I66 <= 10),IF($H66>=5000,IF($Q66<=100,IF($P66<=200,\"MEETS\",\"DOES NOT MEET\"),\"DOES NOT MEET\"),\"DOES NOT MEET\"),\"DOES NOT MEET\"))","v":"N/A"},{"$f":"IF(LEFT(K66, 1)=\"<\", VALUE(RIGHT(K66,LEN(K66)-1)), K66)","v":43.420999999999999},{"$f":"IF(LEFT(J66, 1)=\"<\", VALUE(RIGHT(J66,LEN(J66)-1)), J66)","v":32}]
["Boone's Concrete Supply, LLC","Woodlawn Quarry - Marion","2019-09-23","#57 Stone for Electrochemical","CA190",984072,"Norton, Stephen S",12400,9.7799999999999994,"<32","<53.226","DOES NOT MEET","MEETS","N/A","N/A",53.225999999999999,32]
["Boone's Concrete Supply, LLC","Woodlawn Quarry - Marion","2019-09-23","#78-M Stone for Electrochemical","CA190",984074,"Norton, Stephen S",11100,9.93,"<32","<59.459","DOES NOT MEET","MEETS","N/A","N/A",59.459000000000003,32]
["Martin Marietta","Denver Quarry - Denver","2019-09-20","#57 Stone for Electrochemical","CA169",983979,"Myers, Jesse J",14160,8.98,"<32","<46.610","MEETS","MEETS","N/A","N/A",46.61,32]
["Martin Marietta","Denver Quarry - Denver","2019-09-20","#78-M Stone for Electrochemical","CA169",983981,"Myers, Jesse J",10780,8.52,"<32","<61.224","MEETS","MEETS","N/A","N/A",61.223999999999997,32]
["Martin Marietta","Arrowood Quarry - Charlotte","2019-09-18","#67 Stone for Electrochemical","CA31",983522,"Smith, Michael L",10830,9.15,"<32","<60.942","DOES NOT MEET","MEETS","N/A","N/A",60.942,32]
["Martin Marietta","Arrowood Quarry - Charlotte","2019-09-18","#78-M Stone for Electrochemical","CA31",983524,"Smith, Michael L",9789,9.0299999999999994,"<32","<67.423","DOES NOT MEET","MEETS","N/A","N/A",67.423000000000002,32]
["Vulcan Materials Co.","Spruce Pine Quarry - Bakersville","2019-09-16","#57 Stone for Electrochemical","CA111",983085,"Norton, Stephen S",17960,9.24,"<32","<36.748","DOES NOT MEET","MEETS","N/A","N/A",36.747999999999998,32]
["Vulcan Materials Co.","Spruce Pine Quarry - Bakersville","2019-09-16","#78-M Stone for Electrochemical","CA111",983086,"Norton, Stephen S",12260,7.61,"<32","<53.834","MEETS","MEETS","N/A","N/A",53.834000000000003,32]
["Martin Marietta","Clarks Quarry - New Bern","2019-09-13","#67 Stone for Electrochemical","CA189",982797,"Cobb, James R",4048,8.2200000000000006,"<32","<163.043","MEETS","MEETS","DOES NOT MEET","DOES NOT MEET",163.04300000000001,32]
["Martin Marietta","Clarks Quarry - New Bern","2019-09-13","#78-M Stone for Electrochemical","CA189",982804,"Cobb, James R",3934,8.0500000000000007,"<32","<167.768","MEETS","MEETS","DOES NOT MEET","DOES NOT MEET",167.768,32]
["Hanson Aggregates Southeast, Inc.","Jefferson Quarry - Jefferson, SC","2019-09-13","#57 Stone for Electrochemical","CA120",982912,"Jordan, Daniel H",32700,9.15,"<32","<20.183","DOES NOT MEET","MEETS","N/A","N/A",20.183,32]
["Hanson Aggregates Southeast, Inc.","Jefferson Quarry - Jefferson, SC","2019-09-13","#67 Stone for Electrochemical","CA120",982914,"Jordan, Daniel H",29240,9.25,"<32","<22.573","DOES NOT MEET","MEETS","N/A","N/A",22.573,32]
["Hanson Aggregates Southeast, Inc.","Jefferson Quarry - Jefferson, SC","2019-09-13","#78-M Stone for Electrochemical","CA120",982918,"Jordan, Daniel H",55150,7.86,"<32","<11.967","MEETS","MEETS","N/A","N/A",11.967000000000001,32]
["Martin Marietta","Rock Hill Quarry - Rock Hill, SC","2019-09-10","#67 Stone for Electrochemical","CA271",982307,"Adair, Mildred (Millie) L",15260,9.52,"<32","<43.25","DOES NOT MEET","MEETS","N/A","N/A",43.25,32]
["Martin Marietta","Rock Hill Quarry - Rock Hill, SC","2019-09-10","#78-M Stone for Electrochemical","CA271",982310,"Adair, Mildred (Millie) L",16020,9.4700000000000006,"<32","<41.199","DOES NOT MEET","MEETS","N/A","N/A",41.198999999999998,32]
["Vulcan Materials Co.","Enka Quarry - Enka","2019-09-05","#57 Stone for Electrochemical","CA69",981847,"Rhymer, Robert C",12720,8.17,"<32","<51.887","MEETS","MEETS","N/A","N/A",51.887,32]
["Vulcan Materials Co.","Enka Quarry - Enka","2019-09-05","#78-M Stone for Electrochemical","CA69",981853,"Rhymer, Robert C",11350,8.64,"<32","<58.150","MEETS","MEETS","N/A","N/A",58.15,32]
["Martin Marietta","Bonds Quarry - Concord","2019-09-04","#67 Stone for Electrochemical","CA276",981560,"Cero, Kevin M",19640,9.7200000000000006,"<32","<33.605","DOES NOT MEET","MEETS","N/A","N/A",33.604999999999997,32]
["Martin Marietta","Bonds Quarry - Concord","2019-09-04","#78-M Stone for Electrochemical","CA276",981563,"Cero, Kevin M",19530,9.43,"<32","<33.794","DOES NOT MEET","MEETS","N/A","N/A",33.793999999999997,32]
["Martin Marietta","Denver Quarry - Denver","2019-08-28","#57 Stone for Electrochemical","CA169",980193,"Brinson, Joseph",2399,4.54,"<32","<275.115","MEETS","DOES NOT MEET","N/A","N/A",275.11500000000001,32]
["Martin Marietta","Denver Quarry - Denver","2019-08-28","#67 Stone for Electrochemical","CA169",980194,"Brinson, Joseph",2476,3.97,"<32","<266.559","DOES NOT MEET","DOES NOT MEET","N/A","N/A",266.55900000000003,32]
["Martin Marietta","Denver Quarry - Denver","2019-08-28","#78-M Stone for Electrochemical","CA169",980195,"Brinson, Joseph",2501,4.78,"<32","<263.894","MEETS","DOES NOT MEET","N/A","N/A",263.89400000000001,32]
["Vulcan Materials Co.","Havre De Grace Quarry - Havre De Grace, MD","2019-08-26","#67 Stone for Electrochemical","CA345",980140,"Bonds, Maria M",15510,9.25,"<29","<42.553","DOES NOT MEET","MEETS","DOES NOT MEET","MEETS",42.552999999999997,29]
["Vulcan Materials Co.","Jack Quarry - Petersburg, VA","2019-08-26","#67 Stone for Electrochemical","CA137",980166,"Bonds, Maria M",16700,9.56,"<29","<39.521","DOES NOT MEET","MEETS","DOES NOT MEET","MEETS",39.521000000000001,29]
["Vulcan Materials Co.","Jack Quarry - Petersburg, VA","2019-08-26","#78-M Stone for Electrochemical","CA137",980164,"Bonds, Maria M",17590,9.57,"<29","<37.521","DOES NOT MEET","MEETS","DOES NOT MEET","MEETS",37.521000000000001,29]
["Vulcan Materials Co.","Puddledock Quarry - Prince George, VA","2019-08-26","#57 Stone for Electrochemical","CA224",980146,"Bonds, Maria M",51280,4.87,"<29","<12.871","MEETS","DOES NOT MEET","MEETS","DOES NOT MEET",12.871,29]
["Vulcan Materials Co.","Puddledock Quarry - Prince George, VA","2019-08-26","#78-M Stone for Electrochemical","CA224",980145,"Bonds, Maria M",59680,4.67,"<29","<11.059","MEETS","DOES NOT MEET","MEETS","DOES NOT MEET",11.058999999999999,29]
["Martin Marietta","Asheboro Quarry - Asheboro","2019-08-22","#57 Stone for Electrochemical","CA30",979357,"Jackson, Brandon M",18060,9.17,"<29","<36.545","DOES NOT MEET","MEETS","N/A","N/A",36.545000000000002,29]
["Martin Marietta","Asheboro Quarry - Asheboro","2019-08-22","#67 Stone for Electrochemical","CA30",979365,"Jackson, Brandon M",17770,9.0500000000000007,"<29","<37.141","DOES NOT MEET","MEETS","N/A","N/A",37.140999999999998,29]
["Martin Marietta","Asheboro Quarry - Asheboro","2019-08-22","#78-M Stone for Electrochemical","CA30",979366,"Jackson, Brandon M",18550,9.11,"<29","<35.580","DOES NOT MEET","MEETS","N/A","N/A",35.58,29]
["Sloan Construction Co.","Blacksburg Quarry - Blacksburg, SC","2019-08-22","#57 Stone for Electrochemical","CA382",979539,"Brinson, Joseph",48690,7.52,"<29","<13.555","MEETS","MEETS","N/A","N/A",13.555,29]
["Sloan Construction Co.","Blacksburg Quarry - Blacksburg, SC","2019-08-22","#67 Stone for Electrochemical","CA382",979540,"Brinson, Joseph",24510,7.76,"<29","<26.928","MEETS","MEETS","N/A","N/A",26.928000000000001,29]
["Vulcan Materials Co.","Pineville Quarry - Charlotte","2019-08-21","#67 Stone for Electrochemical","CA101",979251,"Smith, Michael L",12880,9.39,"<32","<51.242","DOES NOT MEET","MEETS","N/A","N/A",51.241999999999997,32]
["Vulcan Materials Co.","Pineville Quarry - Charlotte","2019-08-21","#78-M Stone for Electrochemical","CA101",979253,"Smith, Michael L",12210,9.2899999999999991,"<32","<54.054","DOES NOT MEET","MEETS","N/A","N/A",54.054000000000002,32]
["LBM Industries","Whitewater Falls Quarry - Sapphire","2019-08-21","#57 Stone for Electrochemical","CA119",979122,"Wood, Dean Michael M",39270,9.1,"<32","<16.807","DOES NOT MEET","MEETS","N/A","N/A",16.806999999999999,32]
["LBM Industries","Whitewater Falls Quarry - Sapphire","2019-08-21","#78-M Stone for Electrochemical","CA119",979124,"Wood, Dean Michael M",24020,9.58,"<32","<27.477","DOES NOT MEET","MEETS","N/A","N/A",27.477,32]
["Martin Marietta","Lemon Springs - Sanford","2019-08-16","#57 Stone for Electrochemical","CA97",978230,"Jackson, Brandon M",16210,9.4600000000000009,"<29","<40.716","DOES NOT MEET","MEETS","N/A","N/A",40.716000000000001,29]
["Martin Marietta","Lemon Springs - Sanford","2019-08-16","#67 Stone for Electrochemical","CA97",978233,"Jackson, Brandon M",16730,9.33,"<29","<39.450","DOES NOT MEET","MEETS","N/A","N/A",39.450000000000003,29]
["Martin Marietta","Lemon Springs - Sanford","2019-08-16","#78-M Stone for Electrochemical","CA97",978234,"Jackson, Brandon M",15270,9.23,"<29","<43.222","DOES NOT MEET","MEETS","N/A","N/A",43.222000000000001,29]
["Vulcan Materials Co.","Gold Hill Quarry - Gold Hill","2019-08-13","#78-M Stone for Electrochemical","CA85",977727,"Jordan, Daniel H",7103,8.41,"<29","<92.92","MEETS","MEETS","N/A","N/A",92.92,29]
["Vulcan Materials Co.","Rockingham Quarry - Rockingham","2019-08-13","#57 Stone for Electrochemical","CA94",977702,"Jordan, Daniel H",17630,9.43,"<29","<37.436","DOES NOT MEET","MEETS","N/A","N/A",37.436,29]
["Vulcan Materials Co.","Rockingham Quarry - Rockingham","2019-08-13","#67 Stone for Electrochemical","CA94",977703,"Jordan, Daniel H",17110,9.4499999999999993,"<29","<38.574","DOES NOT MEET","MEETS","N/A","N/A",38.573999999999998,29]
["Vulcan Materials Co.","Rockingham Quarry - Rockingham","2019-08-13","#78-M Stone for Electrochemical","CA94",977705,"Jordan, Daniel H",13960,9.42,"<29","<47.278","DOES NOT MEET","MEETS","N/A","N/A",47.277999999999999,29]
["McCrary Stone","Marshall Quarry - Marshall","2019-08-12","#57 Stone for Electrochemical","CA113",978212,"Kindley, Wallace Quint",16190,9.3800000000000008,"<29","<40.766","DOES NOT MEET","MEETS","N/A","N/A",40.765999999999998,29]
["McCrary Stone","Marshall Quarry - Marshall","2019-08-12","#78-M Stone for Electrochemical","CA113",978213,"Kindley, Wallace Quint",11310,8.83,"<29","<58.355","MEETS","MEETS","N/A","N/A",58.354999999999997,29]
["Vulcan Materials Co.","115 Quarry - N. Wilkesboro","2019-08-05","#67 Stone for Electrochemical","CA79",976211,"Church, Tracy G",15980,9.1999999999999993,"<29","<41.302","DOES NOT MEET","MEETS","N/A","N/A",41.302,29]
["Vulcan Materials Co.","Pacolet Quarry - Pacolet, SC","2019-08-01","#57 Stone for Electrochemical","CA83",975598,"Gosnell, Jimmy L",3415,7.86,"<29","<193.265","MEETS","MEETS","N/A","N/A",193.26499999999999,29]
["Vulcan Materials Co.","Blacksburg Quarry - Blacksburg, SC","2019-07-30","#67 Stone for Electrochemical","CA82",975112,"Gosnell, Jimmy L",12450,9.73,"<29","<53.012","DOES NOT MEET","MEETS","N/A","N/A",53.012,29]
["Vulcan Materials Co.","Blacksburg Quarry - Blacksburg, SC","2019-07-30","#78-M Stone for Electrochemical","CA82",975113,"Gosnell, Jimmy L",12430,9.82,"<29","<53.097","DOES NOT MEET","MEETS","N/A","N/A",53.097000000000001,29]
["Harrison Construction Co., Inc.","Waynesville Quarry - Waynesville","2019-07-29","#57 Stone for Electrochemical","CA1",974809,"Kindley, Wallace Quint",12180,9.0299999999999994,"<29","<54.187","DOES NOT MEET","MEETS","N/A","N/A",54.186999999999998,29]
["Harrison Construction Co., Inc.","Waynesville Quarry - Waynesville","2019-07-29","#78-M Stone for Electrochemical","CA1",974813,"Kindley, Wallace Quint",8835,8.83,"<29","<74.70","MEETS","MEETS","N/A","N/A",74.7,29]
["Martin Marietta","Denver Quarry - Denver","2019-07-25","#57 Stone for Electrochemical","CA169",974525,"Gosnell, Jimmy L",3976,4.6100000000000003,"<29","<165.996","MEETS","DOES NOT MEET","N/A","N/A",165.99600000000001,29]
["Martin Marietta","Denver Quarry - Denver","2019-07-25","#67 Stone for Electrochemical","CA169",974526,"Gosnell, Jimmy L",28270,9.61,"<29","<23.346","DOES NOT MEET","MEETS","N/A","N/A",23.346,29]
["Martin Marietta","Denver Quarry - Denver","2019-07-25","#78-M Stone for Electrochemical","CA169",974527,"Gosnell, Jimmy L",3053,6.05,"<29","<216.181","MEETS","MEETS","N/A","N/A",216.18100000000001,29]
["Hedrick Industries","Lake Norman Quarry - Stanley","2019-07-12","#57 Stone for Electrochemical","CA168",972391,"Gosnell, Jimmy L",7776,9.24,"<29","<84.877","DOES NOT MEET","MEETS","N/A","N/A",84.876999999999995,29]
["Hedrick Industries","Lake Norman Quarry - Stanley","2019-07-12","#67 Stone for Electrochemical","CA168",972392,"Gosnell, Jimmy L",7067,9.24,"<29","<71.467","DOES NOT MEET","MEETS","N/A","N/A",71.466999999999999,29]
["Hedrick Industries","Lake Norman Quarry - Stanley","2019-07-12","#78-M Stone for Electrochemical","CA168",972393,"Gosnell, Jimmy L",8980,9.0399999999999991,"<29","<73.497","DOES NOT MEET","MEETS","N/A","N/A",73.497,29]
["Mountain Materials, Inc.","Mouth of Wilson Quarry - VA","2019-07-12","#57 Stone for Electrochemical","CA180",972577,"Church, Tracy G",12890,8.85,"<29","<51.202","MEETS","MEETS","N/A","N/A",51.201999999999998,29]
["Martin Marietta","Charlotte Quarry - Charlotte","2019-07-10","#57 Stone for Electrochemical","CA41",972755,"Pegues, Jr., Henderson",17300,9.56,"<29","<38.150","DOES NOT MEET","MEETS","N/A","N/A",38.15,29]
["Martin Marietta","Charlotte Quarry - Charlotte","2019-07-10","#67 Stone for Electrochemical","CA41",972758,"Pegues, Jr., Henderson",18470,9.49,"<29","<35.734","DOES NOT MEET","MEETS","N/A","N/A",35.734000000000002,29]
["Martin Marietta","Charlotte Quarry - Charlotte","2019-07-10","#78-M Stone for Electrochemical","CA41",972759,"Pegues, Jr., Henderson",17520,9.34,"<29","<37.671","DOES NOT MEET","MEETS","N/A","N/A",37.670999999999999,29]
["Georgia Stone Products","Lynches River Quarry - Jefferson, SC","2019-07-10","#57 Stone for Electrochemical","CA325",971836,"Jordan, Daniel H",26750,9.5,"<29","<24.673","DOES NOT MEET","MEETS","N/A","N/A",24.672999999999998,29]
["Georgia Stone Products","Lynches River Quarry - Jefferson, SC","2019-07-10","#78-M Stone for Electrochemical","CA325",971840,"Jordan, Daniel H",25790,9.33,"<29","<25.591","DOES NOT MEET","MEETS","N/A","N/A",25.591000000000001,29]
["Martin Marietta","Hickory Quarry - Hickory","2019-07-08","#57 Stone for Electrochemical","CA43",971761,"Gosnell, Jimmy L",22040,9.4,"<29","<29.946",{"$f":"IF(AND(4.5 <= $I130, $I130 <= 9), \"MEETS\", \"DOES NOT MEET\")","v":"DOES NOT MEET"},{"$f":"IF(AND(5 <= $I130, $I130 <= 10), \"MEETS\", \"DOES NOT MEET\")","v":"MEETS"},{"$f":"IF(OR(ISBLANK(H130), NOT(ISNUMBER(MATCH($E130, Coastal,0)))), \"N/A\", IF(AND(4.5 <= $I130, $I130 <= 9),IF($H130>=5000,IF($Q130<=100,IF($P130<=200,\"MEETS\",\"DOES NOT MEET\"),\"DOES NOT MEET\"),\"DOES NOT MEET\"),\"DOES NOT MEET\"))","v":"N/A"},{"$f":"IF(OR(ISBLANK(I130), NOT(ISNUMBER(MATCH($E130, Coastal, 0)))), \"N/A\", IF(AND(5 <= $I130, $I130 <= 10),IF($H130>=5000,IF($Q130<=100,IF($P130<=200,\"MEETS\",\"DOES NOT MEET\"),\"DOES NOT MEET\"),\"DOES NOT MEET\"),\"DOES NOT MEET\"))","v":"N/A"},{"$f":"IF(LEFT(K130, 1)=\"<\", VALUE(RIGHT(K130,LEN(K130)-1)), K130)","v":29.946000000000002},{"$f":"IF(LEFT(J130, 1)=\"<\", VALUE(RIGHT(J130,LEN(J130)-1)), J130)","v":29}]
["Martin Marietta","Hickory Quarry - Hickory","2019-07-08","#67 Stone for Electrochemical","CA43",971762,"Gosnell, Jimmy L",22660,9.4700000000000006,"<29","<29.126","DOES NOT MEET","MEETS","N/A","N/A",29.126000000000001,29]
["Martin Marietta","Hickory Quarry - Hickory","2019-07-08","#78-M Stone for Electrochemical","CA43",971764,"Gosnell, Jimmy L",21930,9.4700000000000006,"<29","<30.096","DOES NOT MEET","MEETS","N/A","N/A",30.096,29]
["Martin Marietta","Statesville Quarry - Statesville","2019-07-08","#57 Stone for Electrochemical","CA54",971770,"Gosnell, Jimmy L",17290,9.42,"<29","<38.172","DOES NOT MEET","MEETS","N/A","N/A",38.171999999999997,29]
["Martin Marietta","Statesville Quarry - Statesville","2019-07-08","#67 Stone for Electrochemical","CA54",971771,"Gosnell, Jimmy L",16220,9.4600000000000009,"<29","<40.691","DOES NOT MEET","MEETS","N/A","N/A",40.691000000000003,29]
["Martin Marietta","Statesville Quarry - Statesville","2019-07-08","#78-M Stone for Electrochemical","CA54",971772,"Gosnell, Jimmy L",12810,9.25,"<29","<51.522","DOES NOT MEET","MEETS","N/A","N/A",51.521999999999998,29]
["Martin Marietta","Kings Mountain Quarry - Kings Mountain","2019-07-01","#67 Stone for Electrochemical","CA48",970678,"Gosnell, Jimmy L",13190,9.27,"<29","<50.038","DOES NOT MEET","MEETS","N/A","N/A",50.037999999999997,29]
["Martin Marietta","Kings Mountain Quarry - Kings Mountain","2019-07-01","#78-M Stone for Electrochemical","CA48",970680,"Gosnell, Jimmy L",12220,9.2899999999999991,"<29","<54.010","DOES NOT MEET","MEETS","N/A","N/A",54.01,29]
["Salem Stone Corp.","Cardinal Quarries - Smethport Quarry - W. Jefferson","2019-06-25","Select Material, Class VI","CA123",970103,"Murray, Brandi S",13030,9.11,"<29","<50.652","DOES NOT MEET","MEETS","N/A","N/A",50.652000000000001,29]
["Martin Marietta","Fountain Quarry - Fountain","2019-06-25","#78-M Stone for Electrochemical","CA42",969843,"Cobb, James R",18720,9.4499999999999993,"<29","<35.256","DOES NOT MEET","MEETS","DOES NOT MEET","MEETS",35.256,29]
["Maymead Materials, Inc.","Turnip Patch Quarry - Mountain City, TN","2019-06-25","Select Material, Class VI","CA153",970106,"Murray, Brandi S",22950,9.4600000000000009,"<29","<28.758","DOES NOT MEET","MEETS","N/A","N/A",28.757999999999999,29]
["Martin Marietta","Central Rock Quarry - Greensboro","2019-06-04","#57 Stone for Electrochemical","CA28",966790,"Waller, John M",17480,9.49,"<30","<37.757","DOES NOT MEET","MEETS","N/A","N/A",37.756999999999998,30]
["Martin Marietta","Central Rock Quarry - Greensboro","2019-06-04","#78-M Stone for Electrochemical","CA28",966787,"Waller, John M",15200,9.49,"<30","<43.421","DOES NOT MEET","MEETS","N/A","N/A",43.420999999999999,30]
["Martin Marietta","Jamestown Quarry - Jamestown","2019-06-04","#67 Stone for Electrochemical","CA46",966791,"Waller, John M",26120,9.15,"<30","<25.268","DOES NOT MEET","MEETS","N/A","N/A",25.268000000000001,30]
["Martin Marietta","Jamestown Quarry - Jamestown","2019-06-04","#78-M Stone for Electrochemical","CA46",966788,"Waller, John M",28310,9.1300000000000008,"<30","<23.313","DOES NOT MEET","MEETS","N/A","N/A",23.312999999999999,30]
["Martin Marietta","Burlington Quarry - Burlington","2019-05-31","#67 Stone for Electrochemical","CA39",966239,"Waller, John M",15550,9.4499999999999993,"<30","<42.444","DOES NOT MEET","MEETS","N/A","N/A",42.444000000000003,30]
["Martin Marietta","Burlington Quarry - Burlington","2019-05-31","#78-M Stone for Electrochemical","CA39",966238,"Waller, John M",13960,9.25,"<30","<47.278","DOES NOT MEET","MEETS","N/A","N/A",47.277999999999999,30]
["Martin Marietta","Pomona Quarry - Greensboro","2019-05-28","#57 Stone for Electrochemical","CA51",965378,"Waller, John M",20730,9.6,"<30","<31.838","DOES NOT MEET","MEETS","N/A","N/A",31.838000000000001,30]
["Martin Marietta","Pomona Quarry - Greensboro","2019-05-28","#67 Stone for Electrochemical","CA51",965377,"Waller, John M",17760,9.5,"<30","<37.162","DOES NOT MEET","MEETS","N/A","N/A",37.161999999999999,30]
["Martin Marietta","Pomona Quarry - Greensboro","2019-05-28","#78-M Stone for Electrochemical","CA51",965376,"Waller, John M",18800,9.5,"<30","<35.106","DOES NOT MEET","MEETS","N/A","N/A",35.106000000000002,30]
["Maymead Materials, Inc.","Turnip Patch Quarry - Mountain City, TN","2019-05-23","#57 Stone for Electrochemical","CA153",965559,"Church, Tracy G",20440,9.34,"<30","<32.29","DOES NOT MEET","MEETS","N/A","N/A",32.29,30]
["Salem Stone Corp.","Southside Materials - S. Boston Quarry (VA)","2019-05-21","#57 Stone for Electrochemical","CA78",964760,"Westmoreland, Braxton J",22400,9.6,"<30","<29.464","DOES NOT MEET","MEETS","N/A","N/A",29.463999999999999,30]
["Rogers Group, Inc.","Henrietta Quarry - Mooresboro","2019-04-30","#57 Stone for Electrochemical","CA369",961358,"Rhymer, Robert C",23820,9.4,"<30","<27.696","DOES NOT MEET","MEETS","N/A","N/A",27.696000000000002,30]
["Rogers Group, Inc.","Henrietta Quarry - Mooresboro","2019-04-30","#78-M Stone for Electrochemical","CA369",961359,"Rhymer, Robert C",18140,8.9,"<30","<36.384","MEETS","MEETS","N/A","N/A",36.384,30]
["Hedrick Industries","North Buncombe Quarry - Asheville","2019-04-29","#57 Stone for Electrochemical","CA131",961081,"Kindley, Wallace Quint",10350,9.1,"<30","<63.678","DOES NOT MEET","MEETS","N/A","N/A",63.677999999999997,30]
["Hedrick Industries","North Buncombe Quarry - Asheville","2019-04-29","#78-M Stone for Electrochemical","CA131",961088,"Kindley, Wallace Quint",8953,9.1,"<30","<73.718","DOES NOT MEET","MEETS","N/A","N/A",73.718000000000004,30]
["Radford Quarries Of Boone, Inc.","Bamboo Quarry","2019-04-26","Select Material, Class VI","CA122",960975,"Winkler, Jeffrey D",21960,9.6,"<30","<30.055","DOES NOT MEET","MEETS","N/A","N/A",30.055,30]
["Hedrick Industries","Grove Stone Quarry - Black Mountain","2019-04-23","#57 Stone for Electrochemical","CA146",960223,"Rhymer, Robert C",17500,9.4,"<30","<37.714","DOES NOT MEET","MEETS","N/A","N/A",37.713999999999999,30]
["Hedrick Industries","Grove Stone Quarry - Black Mountain","2019-04-23","#78-M Stone for Electrochemical","CA146",960224,"Rhymer, Robert C",16900,9.1999999999999993,"<30","<39.053","DOES NOT MEET","MEETS","N/A","N/A",39.052999999999997,30]
["Vulcan Materials Co.","Greystone Quarry - Henderson","2019-04-01","#67 Stone for Electrochemical","CA70",957253,"Skinner, III, John L",24930,9.5,"<30","<26.474","DOES NOT MEET","MEETS","N/A","N/A",26.474,30]
["Vulcan Materials Co.","Greystone Quarry - Henderson","2019-04-01","#78-M Stone for Electrochemical","CA70",957255,"Skinner, III, John L",24010,9.5,"<30","<27.489","DOES NOT MEET","MEETS","N/A","N/A",27.489000000000001,30]
["Hanson Aggregates Southeast, Inc.","Holly Springs Quarry","2019-03-29","#67 Stone for Electrochemical","CA282",956968,"Skinner, III, John L",16520,9.3000000000000007,"<30","<39.952","DOES NOT MEET","MEETS","N/A","N/A",39.951999999999998,30]
["Hanson Aggregates Southeast, Inc.","Holly Springs Quarry","2019-03-29","#78-M Stone for Electrochemical","CA282",956969,"Skinner, III, John L",22360,9.3000000000000007,"<30","<29.517","DOES NOT MEET","MEETS","N/A","N/A",29.516999999999999,30]
["Martin Marietta","Franklin Quarry - Franklinton","2019-03-27","#57 Stone for Electrochemical","CA270",956770,"Skinner, III, John L",21320,9.6,"<30","<30.957","DOES NOT MEET","MEETS","N/A","N/A",30.957000000000001,30]
["Martin Marietta","Franklin Quarry - Franklinton","2019-03-27","#78-M Stone for Electrochemical","CA270",956772,"Skinner, III, John L",24930,8.1,"<30","<26.474","MEETS","MEETS","N/A","N/A",26.474,30]
["Carolina Sunrock LLC","Butner Quarry - Butner","2019-03-25","#67 Stone for Electrochemical","CA178",955934,"Skinner, III, John L",10130,10.1,"<30","<65.153","DOES NOT MEET","DOES NOT MEET","N/A","N/A",65.153000000000006,30]
["Carolina Sunrock LLC","Butner Quarry - Butner","2019-03-25","#78-M Stone for Electrochemical","CA178",955935,"Skinner, III, John L",11850,10.1,"<30","<55.696","DOES NOT MEET","DOES NOT MEET","N/A","N/A",55.695999999999998,30]
["Vulcan Materials Co.","Pineville Quarry - Charlotte","2019-03-15","#57 Stone for Electrochemical","CA101",954940,"Adair, Mildred (Millie) L",24760,9.1999999999999993,"<30","<26.656","DOES NOT MEET","MEETS","N/A","N/A",26.655999999999999,30]
["Vulcan Materials Co.","Pineville Quarry - Charlotte","2019-03-15","#57 Stone for Electrochemical","CA101",954939,"Adair, Mildred (Millie) L",12860,9.3000000000000007,0,"<51.322","DOES NOT MEET","MEETS","N/A","N/A",51.322000000000003,0]
["Vulcan Materials Co.","Pineville Quarry - Charlotte","2019-03-15","#67 Stone for Electrochemical","CA101",954941,"Adair, Mildred (Millie) L",24760,9.1999999999999993,"<30","<26.656","DOES NOT MEET","MEETS","N/A","N/A",26.655999999999999,30]
["Vulcan Materials Co.","Pineville Quarry - Charlotte","2019-03-15","#67 Stone for Electrochemical","CA101",954942,"Adair, Mildred (Millie) L",12860,9.3000000000000007,0,"<51.322","DOES NOT MEET","MEETS","N/A","N/A",51.322000000000003,0]
["Vulcan Materials Co.","Pineville Quarry - Charlotte","2019-03-15","#78-M Stone for Electrochemical","CA101",954946,"Adair, Mildred (Millie) L",7593,9,"<30","<86.922","MEETS","MEETS","N/A","N/A",86.921999999999997,30]
["Vulcan Materials Co.","Pineville Quarry - Charlotte","2019-03-15","#78-M Stone for Electrochemical","CA101",954945,"Adair, Mildred (Millie) L",23010,9.3000000000000007,0,"<28.683","DOES NOT MEET","MEETS","N/A","N/A",28.683,0]
["Hanson Aggregates Southeast, Inc.","Crabtree Quarry - Raleigh","2019-03-13","#67 Stone for Electrochemical","CA61",954289,"Skinner, III, John L",18360,8.8000000000000007,0,"<35.948","MEETS","MEETS","N/A","N/A",35.948,0]
["Hanson Aggregates Southeast, Inc.","Crabtree Quarry - Raleigh","2019-03-13","#78-M Stone for Electrochemical","CA61",954290,"Skinner, III, John L",17680,9,0,"<37.330","MEETS","MEETS","N/A","N/A",37.33,0]
["Ararat Rock Products","Eden Quarry - Eden","2019-03-12","#57 Stone for Electrochemical","CA374",954433,"Westmoreland, Braxton J",9873,9,0,"<66.849","MEETS","MEETS","N/A","N/A",66.849000000000004,0]
["Ararat Rock Products","Eden Quarry - Eden","2019-03-12","#78-M Stone for Electrochemical","CA374",954434,"Westmoreland, Braxton J",7234,8.9,0,"<91.236","MEETS","MEETS","N/A","N/A",91.236000000000004,0]
["Vulcan Materials Co.","Rabun Gap - Rabun Gap, GA","2019-03-08","#57 Stone for Electrochemical","CA25",953618,"Ledford, Brandon S",25660,9.5,"<30","<25.721","DOES NOT MEET","MEETS","N/A","N/A",25.721,30]
["Boxley Materials Company","Blue Ridge Quarry - Blue Ridge, VA","2019-03-05","#78-M Stone for Electrochemical","CA334",953110,"Westmoreland, Braxton J",8427,9.1999999999999993,"<30","<78.32","DOES NOT MEET","MEETS","N/A","N/A",78.319999999999993,30]
["Boxley Materials Company","Fieldale Quarry - Martinsville, VA","2019-03-05","#57 Stone for Electrochemical","CA142",953147,"Westmoreland, Braxton J",13260,8.9,0,"<49.774","MEETS","MEETS","N/A","N/A",49.774000000000001,0]
["Boxley Materials Company","Fieldale Quarry - Martinsville, VA","2019-03-05","#67 Stone for Electrochemical","CA142",953148,"Westmoreland, Braxton J",10830,8.6999999999999993,0,"<60.942","MEETS","MEETS","N/A","N/A",60.942,0]
["Boxley Materials Company","Fieldale Quarry - Martinsville, VA","2019-03-05","#78-M Stone for Electrochemical","CA142",953149,"Westmoreland, Braxton J",7555,8.6999999999999993,0,"<87.359","MEETS","MEETS","N/A","N/A",87.358999999999995,0]
["McCrary Stone","Low Gap Quarry - Burnsville","2019-03-05","#57 Stone for Electrochemical","CA244",952978,"Kindley, Wallace Quint",3609,3.9,"<30","<182.876","DOES NOT MEET","DOES NOT MEET","N/A","N/A",182.876,30]
["McCrary Stone","Low Gap Quarry - Burnsville","2019-03-05","#78-M Stone for Electrochemical","CA244",952983,"Kindley, Wallace Quint",2687,3.4,"<30","<245.627","DOES NOT MEET","DOES NOT MEET","N/A","N/A",245.62700000000001,30]
["Salem Stone Corp.","Southside Materials - Shelton Quarry - Pelham","2019-02-28","#57 Stone for Electrochemical","CA75",952399,"Westmoreland, Braxton J",27050,9.1,"<30","<24.399","DOES NOT MEET","MEETS","N/A","N/A",24.399000000000001,30]
["Salem Stone Corp.","Southside Materials - Shelton Quarry - Pelham","2019-02-28","#67 Stone for Electrochemical","CA75",952402,"Westmoreland, Braxton J",22470,9.3000000000000007,0,"<29.372","DOES NOT MEET","MEETS","N/A","N/A",29.372,0]
["Salem Stone Corp.","Southside Materials - Shelton Quarry - Pelham","2019-02-28","#78-M Stone for Electrochemical","CA75",952400,"Westmoreland, Braxton J",33790,7.8,0,"<19.532","MEETS","MEETS","N/A","N/A",19.532,0]
["Vulcan Materials Co.","Stokesdale Quarry - Stokesdale","2019-02-28","#57 Stone for Electrochemical","CA76",952379,"Westmoreland, Braxton J",25310,9.6,0,"<26.077","DOES NOT MEET","MEETS","N/A","N/A",26.077000000000002,0]
["Vulcan Materials Co.","Stokesdale Quarry - Stokesdale","2019-02-28","#67 Stone for Electrochemical","CA76",952376,"Westmoreland, Braxton J",28210,9.3000000000000007,0,"<23.396","DOES NOT MEET","MEETS","N/A","N/A",23.396000000000001,0]
["Vulcan Materials Co.","Stokesdale Quarry - Stokesdale","2019-02-28","#78-M Stone for Electrochemical","CA76",952377,"Westmoreland, Braxton J",20110,9.3000000000000007,0,"<32.819","DOES NOT MEET","MEETS","N/A","N/A",32.819000000000003,0]
["Wake Stone Corp.","Triangle Quarry - Cary","2019-02-27","#67 Stone for Electrochemical","CA157",951911,"Skinner, III, John L",19980,9.5,0,"<33.033","DOES NOT MEET","MEETS","N/A","N/A",33.033000000000001,0]
["Wake Stone Corp.","Triangle Quarry - Cary","2019-02-27","#78-M Stone for Electrochemical","CA157",951912,"Skinner, III, John L",19140,9.4,0,"<34.483","DOES NOT MEET","MEETS","N/A","N/A",34.482999999999997,0]
["Vulcan Materials Co.","Skippers Quarry - Skippers, VA","2019-02-21","#67 Stone for Electrochemical","CA55",952208,"Thomas, Grady Q",15800,9.6,"<30","<41.772","DOES NOT MEET","MEETS","DOES NOT MEET","MEETS",41.771999999999998,30]
["Vulcan Materials Co.","Skippers Quarry - Skippers, VA","2019-02-21","#78-M Stone for Electrochemical","CA55",952200,"Thomas, Grady Q",16500,9.5,"<30","<40","DOES NOT MEET","MEETS","DOES NOT MEET","MEETS",40,30]
["Rogers Group, Inc.","Henrietta Quarry - Mooresboro","2019-02-20","#57 Stone for Electrochemical","CA369",951020,"Norton, Stephen S",24650,9.3000000000000007,0,"<26.775",{"$f":"IF(AND(4.5 <= $I194, $I194 <= 9), \"MEETS\", \"DOES NOT MEET\")","v":"DOES NOT MEET"},{"$f":"IF(AND(5 <= $I194, $I194 <= 10), \"MEETS\", \"DOES NOT MEET\")","v":"MEETS"},{"$f":"IF(OR(ISBLANK(H194), NOT(ISNUMBER(MATCH($E194, Coastal,0)))), \"N/A\", IF(AND(4.5 <= $I194, $I194 <= 9),IF($H194>=5000,IF($Q194<=100,IF($P194<=200,\"MEETS\",\"DOES NOT MEET\"),\"DOES NOT MEET\"),\"DOES NOT MEET\"),\"DOES NOT MEET\"))","v":"N/A"},{"$f":"IF(OR(ISBLANK(I194), NOT(ISNUMBER(MATCH($E194, Coastal, 0)))), \"N/A\", IF(AND(5 <= $I194, $I194 <= 10),IF($H194>=5000,IF($Q194<=100,IF($P194<=200,\"MEETS\",\"DOES NOT MEET\"),\"DOES NOT MEET\"),\"DOES NOT MEET\"),\"DOES NOT MEET\"))","v":"N/A"},{"$f":"IF(LEFT(K194, 1)=\"<\", VALUE(RIGHT(K194,LEN(K194)-1)), K194)","v":26.774999999999999},{"$f":"IF(LEFT(J194, 1)=\"<\", VALUE(RIGHT(J194,LEN(J194)-1)), J194)","v":0}]
["Rogers Group, Inc.","Henrietta Quarry - Mooresboro","2019-02-20","#78-M Stone for Electrochemical","CA369",951025,"Norton, Stephen S",23720,9.3000000000000007,0,"<27.825","DOES NOT MEET","MEETS","N/A","N/A",27.824999999999999,0]
["Martin Marietta","American Stone - Carrboro","2019-02-13","#67 Stone for Electrochemical","CA2",949790,"Westmoreland, Braxton J",16170,9.8000000000000007,0,"<40.816","DOES NOT MEET","MEETS","N/A","N/A",40.816000000000003,0]
["Martin Marietta","American Stone - Carrboro","2019-02-13","#78-M Stone for Electrochemical","CA2",949792,"Westmoreland, Braxton J",14230,8.9,0,"<46.381","MEETS","MEETS","N/A","N/A",46.381,0]
["Vulcan Materials Co.","Clear Creek Q. - Charlotte","2019-02-13","#57 Stone for Electrochemical","CA249",950363,"Pegues, Jr., Henderson",20970,9.4,0,"<31.474","DOES NOT MEET","MEETS","N/A","N/A",31.474,0]
["Vulcan Materials Co.","Clear Creek Q. - Charlotte","2019-02-13","#67 Stone for Electrochemical","CA249",950364,"Pegues, Jr., Henderson",22960,9.5,0,"<28.746","DOES NOT MEET","MEETS","N/A","N/A",28.745999999999999,0]
["Vulcan Materials Co.","Clear Creek Q. - Charlotte","2019-02-13","#78-M Stone for Electrochemical","CA249",950362,"Pegues, Jr., Henderson",21190,9.5,0,"<31.147","DOES NOT MEET","MEETS","N/A","N/A",31.146999999999998,0]
["Harrison Construction Co., Inc.","Dillsboro Quarry - Dillsboro","2019-02-13","#57 Stone for Electrochemical","CA15",949672,"Ledford, Brandon S",10630,8.9,0,"<62.088","MEETS","MEETS","N/A","N/A",62.088000000000001,0]
["Harrison Construction Co., Inc.","Dillsboro Quarry - Dillsboro","2019-02-13","#78-M Stone for Electrochemical","CA15",949677,"Ledford, Brandon S",9607,8.8000000000000007,0,"<68.7","MEETS","MEETS","N/A","N/A",68.7,0]
["Martin Marietta","Reidsville Quarry - Reidsville","2019-02-13","#57 Stone for Electrochemical","CA52",949847,"Westmoreland, Braxton J",17820,9.5,0,"<37.037","DOES NOT MEET","MEETS","N/A","N/A",37.036999999999999,0]
["Martin Marietta","Reidsville Quarry - Reidsville","2019-02-13","#67 Stone for Electrochemical","CA52",949848,"Westmoreland, Braxton J",19290,9.4,0,"<34.215","DOES NOT MEET","MEETS","N/A","N/A",34.215000000000003,0]
["Martin Marietta","Reidsville Quarry - Reidsville","2019-02-13","#78-M Stone for Electrochemical","CA52",949846,"Westmoreland, Braxton J",17310,9.5,0,"<38.128","DOES NOT MEET","MEETS","N/A","N/A",38.128,0]
["Wake Stone Corp.","Moncure Quarry - Moncure","2019-02-05","#57 Stone for Electrochemical","CA100",948524,"Jordan, Daniel H",23830,9.4,0,"<27.696","DOES NOT MEET","MEETS","N/A","N/A",27.696000000000002,0]
["Wake Stone Corp.","Moncure Quarry - Moncure","2019-02-05","#67 Stone for Electrochemical","CA100",948529,"Jordan, Daniel H",22870,9.4,0,"<28.859","DOES NOT MEET","MEETS","N/A","N/A",28.859000000000002,0]
["Wake Stone Corp.","Moncure Quarry - Moncure","2019-02-05","#78-M Stone for Electrochemical","CA100",948535,"Jordan, Daniel H",17350,9.3000000000000007,0,"<38.040","DOES NOT MEET","MEETS","N/A","N/A",38.04,0]
["Carolina Sunrock LLC","Kittrell Quarry - Kittrell","2019-02-01","#67 Stone for Electrochemical","CA304",948021,"Skinner, III, John L",20820,9.3000000000000007,0,"<31.7","DOES NOT MEET","MEETS","N/A","N/A",31.7,0]
["Carolina Sunrock LLC","Kittrell Quarry - Kittrell","2019-02-01","#78-M Stone for Electrochemical","CA304",948022,"Skinner, III, John L",18400,9.3000000000000007,0,"<35.87","DOES NOT MEET","MEETS","N/A","N/A",35.869999999999997,0]
["Martin Marietta","Fuquay Quarry - Fuquay-Varina","2019-01-31","#57 Stone for Electrochemical","CA220",947851,"Skinner, III, John L",25920,9.4,0,"<25.463","DOES NOT MEET","MEETS","N/A","N/A",25.463000000000001,0]
["Martin Marietta","Fuquay Quarry - Fuquay-Varina","2019-01-31","#78-M Stone for Electrochemical","CA220",947853,"Skinner, III, John L",20170,9.3000000000000007,0,"<32.722","DOES NOT MEET","MEETS","N/A","N/A",32.722000000000001,0]
["Martin Marietta","Garner Quarry - Garner","2019-01-29","#67 Stone for Electrochemical","CA57",947426,"Skinner, III, John L",21980,9.3000000000000007,0,"<30.027","DOES NOT MEET","MEETS","N/A","N/A",30.027000000000001,0]
["Martin Marietta","Garner Quarry - Garner","2019-01-29","#78-M Stone for Electrochemical","CA57",947428,"Skinner, III, John L",21020,9.3000000000000007,0,"<31.399","DOES NOT MEET","MEETS","N/A","N/A",31.399000000000001,0]
["Hedrick Industries","South McDowell Quarry - Marion","2019-01-24","#57 Stone for Electrochemical","CA283",946847,"Rhymer, Robert C",22238,9.3000000000000007,0,"<29.679","DOES NOT MEET","MEETS","N/A","N/A",29.678999999999998,0]
["Hedrick Industries","South McDowell Quarry - Marion","2019-01-24","#78-M Stone for Electrochemical","CA283",946849,"Rhymer, Robert C",26700,9.1999999999999993,0,"<24.719","DOES NOT MEET","MEETS","N/A","N/A",24.719000000000001,0]
["Martin Marietta","Raleigh-Durham Quarry - Raleigh","2019-01-18","#67 Stone for Electrochemical","CA156",946459,"Skinner, III, John L",6298,10.7,0,"<104.795","DOES NOT MEET","DOES NOT MEET","N/A","N/A",104.795,0]
["Martin Marietta","Raleigh-Durham Quarry - Raleigh","2019-01-18","#78-M Stone for Electrochemical","CA156",946460,"Skinner, III, John L",14230,10.1,0,"<46.381","DOES NOT MEET","DOES NOT MEET","N/A","N/A",46.381,0]
["Vulcan Materials Co.","East Forsyth Quarry - Kernersville","2019-01-17","#57 Stone for Electrochemical","CA139",946089,"Ealey, Lee E",21440,9.4,0,"<30.784","DOES NOT MEET","MEETS","N/A","N/A",30.783999999999999,0]
["Vulcan Materials Co.","East Forsyth Quarry - Kernersville","2019-01-17","#67 Stone for Electrochemical","CA139",946091,"Ealey, Lee E",12350,9.6999999999999993,"<30","<53.441","DOES NOT MEET","MEETS","N/A","N/A",53.441000000000003,30]
["Vulcan Materials Co.","East Forsyth Quarry - Kernersville","2019-01-17","#78-M Stone for Electrochemical","CA139",946093,"Ealey, Lee E",13000,9.3000000000000007,0,"<50.769","DOES NOT MEET","MEETS","N/A","N/A",50.768999999999998,0]
["Harrison Construction Co., Inc.","Franklin Quarry - Franklin","2019-01-17","#57 Stone for Electrochemical","CA16",946029,"Ledford, Brandon S",20250,7.8,0,"<32.593","MEETS","MEETS","N/A","N/A",32.593000000000004,0]
["Harrison Construction Co., Inc.","Franklin Quarry - Franklin","2019-01-17","#78-M Stone for Electrochemical","CA16",946030,"Ledford, Brandon S",11820,8.4,0,"<55.838","MEETS","MEETS","N/A","N/A",55.838000000000001,0]
["Vulcan Materials Co.","North Quarry - Winston Salem","2019-01-17","#57 Stone for Electrochemical","CA72",946011,"Ealey, Lee E",19660,9.1999999999999993,0,"<33.571","DOES NOT MEET","MEETS","N/A","N/A",33.570999999999998,0]
["Vulcan Materials Co.","North Quarry - Winston Salem","2019-01-17","#67 Stone for Electrochemical","CA72",946015,"Ealey, Lee E",18650,9,0,"<33.389","MEETS","MEETS","N/A","N/A",33.389000000000003,0]
["Vulcan Materials Co.","North Quarry - Winston Salem","2019-01-17","#78-M Stone for Electrochemical","CA72",946018,"Ealey, Lee E",16130,8.8000000000000007,0,"<40.918","MEETS","MEETS","N/A","N/A",40.917999999999999,0]
["Martin Marietta","Salem Stone Quarry - Kernersville","2019-01-17","#57 Stone for Electrochemical","CA209",946023,"Ealey, Lee E",18020,9.1,0,"<36.626","DOES NOT MEET","MEETS","N/A","N/A",36.625999999999998,0]
["Martin Marietta","Salem Stone Quarry - Kernersville","2019-01-17","#67 Stone for Electrochemical","CA209",946025,"Ealey, Lee E",19860,9.1999999999999993,0,"<33.233","DOES NOT MEET","MEETS","N/A","N/A",33.232999999999997,0]
["Martin Marietta","Salem Stone Quarry - Kernersville","2019-01-17","#78-M Stone for Electrochemical","CA209",946026,"Ealey, Lee E",13150,8.9,0,"<50.190","MEETS","MEETS","N/A","N/A",50.19,0]
["Wake Stone Corp.","Knightdale Quarry - Knightdale","2019-01-15","#57 Stone for Electrochemical","CA98",945614,"Skinner, III, John L",22880,9.4,0,"<28.846","DOES NOT MEET","MEETS","N/A","N/A",28.846,0]
["Wake Stone Corp.","Knightdale Quarry - Knightdale","2019-01-15","#78-M Stone for Electrochemical","CA98",945616,"Skinner, III, John L",22190,9.3000000000000007,0,"<29.743","DOES NOT MEET","MEETS","N/A","N/A",29.742999999999999,0]
["Martin Marietta","Kannapolis Quarry - Landis","2019-01-14","#57 Stone for Electrochemical","CA47",945417,"Ealey, Lee E",24430,9.4,0,"<27.016","DOES NOT MEET","MEETS","N/A","N/A",27.015999999999998,0]
["Martin Marietta","Kannapolis Quarry - Landis","2019-01-14","#67 Stone for Electrochemical","CA47",945419,"Ealey, Lee E",24950,9.1,0,"<26.453","DOES NOT MEET","MEETS","N/A","N/A",26.452999999999999,0]
["Martin Marietta","Kannapolis Quarry - Landis","2019-01-14","#78-M Stone for Electrochemical","CA47",945421,"Ealey, Lee E",21550,9.1999999999999993,0,"<30.626","DOES NOT MEET","MEETS","N/A","N/A",30.626000000000001,0]
["Hanson Aggregates Southeast, Inc.","Rougemont Quarry","2019-01-11","#67 Stone for Electrochemical","CA217",945245,"Skinner, III, John L",22770,9.6999999999999993,0,"<28.986","DOES NOT MEET","MEETS","N/A","N/A",28.986000000000001,0]
["Hanson Aggregates Southeast, Inc.","Rougemont Quarry","2019-01-11","#78-M Stone for Electrochemical","CA217",945247,"Skinner, III, John L",24460,9.6999999999999993,0,"<26.983","DOES NOT MEET","MEETS","N/A","N/A",26.983000000000001,0]
["Vulcan Materials Co.","Smith Grove Q. - Mocksville","2019-01-11","#57 Stone for Electrochemical","CA80",945366,"Ealey, Lee E",26940,9.4,0,"<24.499","DOES NOT MEET","MEETS","N/A","N/A",24.498999999999999,0]
["Vulcan Materials Co.","Smith Grove Q. - Mocksville","2019-01-11","#67 Stone for Electrochemical","CA80",945372,"Ealey, Lee E",16320,8.1,0,"<40.441","MEETS","MEETS","N/A","N/A",40.441000000000003,0]
["Vulcan Materials Co.","Smith Grove Q. - Mocksville","2019-01-11","#78-M Stone for Electrochemical","CA80",945373,"Ealey, Lee E",24220,9.4,0,"<27.250","DOES NOT MEET","MEETS","N/A","N/A",27.25,0]
["Martin Marietta","Woodleaf Quarry - Salisbury","2019-01-11","#57 Stone for Electrochemical","CA56",945303,"Ealey, Lee E",24360,8.6999999999999993,0,"<27.094","MEETS","MEETS","N/A","N/A",27.094000000000001,0]
["Martin Marietta","Woodleaf Quarry - Salisbury","2019-01-11","#67 Stone for Electrochemical","CA56",945308,"Ealey, Lee E",17820,7.7,0,"<37.037","MEETS","MEETS","N/A","N/A",37.036999999999999,0]
["Martin Marietta","Woodleaf Quarry - Salisbury","2019-01-11","#78-M Stone for Electrochemical","CA56",945309,"Ealey, Lee E",23480,9.1,0,"<28.109","DOES NOT MEET","MEETS","N/A","N/A",28.109000000000002,0]
["Carolina Sunrock LLC","Woodsdale Quarry - Roxboro","2019-01-11","#67 Stone for Electrochemical","CA329",945250,"Skinner, III, John L",22230,9.5,0,"<29.69","DOES NOT MEET","MEETS","N/A","N/A",29.69,0]
["Carolina Sunrock LLC","Woodsdale Quarry - Roxboro","2019-01-11","#78-M Stone for Electrochemical","CA329",945251,"Skinner, III, John L",16390,9.4,0,"<40.268","DOES NOT MEET","MEETS","N/A","N/A",40.268000000000001,0]
["Vulcan Materials Co.","Gold Hill Quarry - Gold Hill","2019-01-09","#57 Stone for Electrochemical","CA85",944780,"Ealey, Lee E",18430,9.1999999999999993,0,"<35.811","DOES NOT MEET","MEETS","N/A","N/A",35.811,0]
["Vulcan Materials Co.","Gold Hill Quarry - Gold Hill","2019-01-09","#78-M Stone for Electrochemical","CA85",944781,"Ealey, Lee E",10870,8.3000000000000007,0,"<60.718","MEETS","MEETS","N/A","N/A",60.718000000000004,0]
["Hanson Aggregates Southeast, Inc.","Raleigh Quarry - Wake Forest","2019-01-09","#67 Stone for Electrochemical","CA67",944668,"Skinner, III, John L",21840,9.5,0,"<30.22","DOES NOT MEET","MEETS","N/A","N/A",30.22,0]
["Hanson Aggregates Southeast, Inc.","Raleigh Quarry - Wake Forest","2019-01-09","#78-M Stone for Electrochemical","CA67",944670,"Skinner, III, John L",21530,9.4,0,"<30.655","DOES NOT MEET","MEETS","N/A","N/A",30.655000000000001,0]
["Martin Marietta","Thomasville Quarry - Thomasville","2019-01-09","#57 Stone for Electrochemical","CA102",944782,"Ealey, Lee E",19530,8.8000000000000007,0,"<33.794","MEETS","MEETS","N/A","N/A",33.793999999999997,0]
["Martin Marietta","Thomasville Quarry - Thomasville","2019-01-09","#67 Stone for Electrochemical","CA102",944783,"Ealey, Lee E",17600,8.6999999999999993,0,"<37.500","MEETS","MEETS","N/A","N/A",37.5,0]
["Martin Marietta","Thomasville Quarry - Thomasville","2019-01-09","#78-M Stone for Electrochemical","CA102",944784,"Ealey, Lee E",15880,8.9,0,"<41.562","MEETS","MEETS","N/A","N/A",41.561999999999998,0]
["Martin Marietta","Savannah Marine Terminal","2018-12-28","#67 Stone for Electrochemical","CA425",944230,"Maynard, William BJ T",16280,9.5,0,"<40.541","DOES NOT MEET","MEETS","N/A","N/A",40.540999999999997,0]
["Martin Marietta","Arrowood Quarry - Charlotte","2018-12-13","#67 Stone for Electrochemical","CA31",942687,"Adair, Mildred (Millie) L",22930,9.6,0,"<28.783","DOES NOT MEET","MEETS","N/A","N/A",28.783000000000001,0]
["Martin Marietta","Arrowood Quarry - Charlotte","2018-12-13","#78-M Stone for Electrochemical","CA31",942688,"Adair, Mildred (Millie) L",16010,9.4,0,"<41.224","DOES NOT MEET","MEETS","N/A","N/A",41.223999999999997,0]
["Vulcan Materials Co.","Pineville Quarry - Charlotte","2018-12-12","#67 Stone for Electrochemical","CA101",942471,"Adair, Mildred (Millie) L",19680,9.4,0,"<33.537","DOES NOT MEET","MEETS","N/A","N/A",33.536999999999999,0]
["Vulcan Materials Co.","Pineville Quarry - Charlotte","2018-12-12","#78-M Stone for Electrochemical","CA101",942472,"Adair, Mildred (Millie) L",10030,9.1,0,"<65.803","DOES NOT MEET","MEETS","N/A","N/A",65.802999999999997,0]
["Hanson Aggregates Southeast, Inc.","Jefferson Quarry - Jefferson, SC","2018-12-07","Coarse Aggregate, #57","CA120",942231,"Jordan, Daniel H",25930,9.1999999999999993,0,"<25.453","DOES NOT MEET","MEETS","N/A","N/A",25.452999999999999,0]
["Hanson Aggregates Southeast, Inc.","Jefferson Quarry - Jefferson, SC","2018-12-07","Coarse Aggregate, #67","CA120",942234,"Jordan, Daniel H",25150,9.1999999999999993,0,"<26.243",{"$f":"IF(AND(4.5 <= $I258, $I258 <= 9), \"MEETS\", \"DOES NOT MEET\")","v":"DOES NOT MEET"},{"$f":"IF(AND(5 <= $I258, $I258 <= 10), \"MEETS\", \"DOES NOT MEET\")","v":"MEETS"},{"$f":"IF(OR(ISBLANK(H258), NOT(ISNUMBER(MATCH($E258, Coastal,0)))), \"N/A\", IF(AND(4.5 <= $I258, $I258 <= 9),IF($H258>=5000,IF($Q258<=100,IF($P258<=200,\"MEETS\",\"DOES NOT MEET\"),\"DOES NOT MEET\"),\"DOES NOT MEET\"),\"DOES NOT MEET\"))","v":"N/A"},{"$f":"IF(OR(ISBLANK(I258), NOT(ISNUMBER(MATCH($E258, Coastal, 0)))), \"N/A\", IF(AND(5 <= $I258, $I258 <= 10),IF($H258>=5000,IF($Q258<=100,IF($P258<=200,\"MEETS\",\"DOES NOT MEET\"),\"DOES NOT MEET\"),\"DOES NOT MEET\"),\"DOES NOT MEET\"))","v":"N/A"},{"$f":"IF(LEFT(K258, 1)=\"<\", VALUE(RIGHT(K258,LEN(K258)-1)), K258)","v":26.242999999999999},{"$f":"IF(LEFT(J258, 1)=\"<\", VALUE(RIGHT(J258,LEN(J258)-1)), J258)","v":0}]
["Hanson Aggregates Southeast, Inc.","Jefferson Quarry - Jefferson, SC","2018-12-07","Coarse Aggregate, #78M","CA120",942227,"Jordan, Daniel H",23640,9.5,0,"<27.919","DOES NOT MEET","MEETS","N/A","N/A",27.919,0]
["Georgia Stone Products","Lynches River Quarry - Jefferson, SC","2018-12-06","Coarse Aggregate, #57","CA325",942219,"Jordan, Daniel H",29010,9.1999999999999993,0,"<22.751","DOES NOT MEET","MEETS","N/A","N/A",22.751000000000001,0]
["Georgia Stone Products","Lynches River Quarry - Jefferson, SC","2018-12-06","Coarse Aggregate, #67","CA325",942222,"Jordan, Daniel H",29200,9.1999999999999993,0,"<22.603","DOES NOT MEET","MEETS","N/A","N/A",22.603000000000002,0]
["Georgia Stone Products","Lynches River Quarry - Jefferson, SC","2018-12-06","Coarse Aggregate, #78M","CA325",942218,"Jordan, Daniel H",22100,9.3000000000000007,0,"<29.864","DOES NOT MEET","MEETS","N/A","N/A",29.864000000000001,0]
["Luck Stone Corporation","Pittsboro Quarry - Moncure","2018-11-30","#57 Stone for Electrochemical","CA292",941282,"Jackson, Brandon M",20320,9.5,"<30","<32.48","DOES NOT MEET","MEETS","N/A","N/A",32.479999999999997,30]
["Luck Stone Corporation","Pittsboro Quarry - Moncure","2018-11-30","#78-M Stone for Electrochemical","CA292",941283,"Jackson, Brandon M",18920,9.4,0,"<34.88","DOES NOT MEET","MEETS","N/A","N/A",34.880000000000003,0]
["Martin Marietta","Asheboro Quarry - Asheboro","2018-11-27","#57 Stone for Electrochemical","CA30",940712,"Jackson, Brandon M",26010,9.3000000000000007,0,"<25.375","DOES NOT MEET","MEETS","N/A","N/A",25.375,0]
["Martin Marietta","Asheboro Quarry - Asheboro","2018-11-27","#67 Stone for Electrochemical","CA30",940713,"Jackson, Brandon M",20780,9.3000000000000007,0,"<31.76","DOES NOT MEET","MEETS","N/A","N/A",31.76,0]
["Martin Marietta","Asheboro Quarry - Asheboro","2018-11-27","#78-M Stone for Electrochemical","CA30",940714,"Jackson, Brandon M",19470,9.3000000000000007,0,"<33.9","DOES NOT MEET","MEETS","N/A","N/A",33.9,0]
["Martin Marietta","Mallard Creek Quarry - Charlotte","2018-11-12","#57 Stone for Electrochemical","CA188",939062,"Pegues, Jr., Henderson",25090,9.6,0,"<26.3","DOES NOT MEET","MEETS","N/A","N/A",26.3,0]
["Martin Marietta","Mallard Creek Quarry - Charlotte","2018-11-12","#67 Stone for Electrochemical","CA188",939061,"Pegues, Jr., Henderson",26290,9.6,0,"<25.1","DOES NOT MEET","MEETS","N/A","N/A",25.1,0]
["Martin Marietta","Mallard Creek Quarry - Charlotte","2018-11-12","#78-M Stone for Electrochemical","CA188",939060,"Pegues, Jr., Henderson",22440,9.4,0,"<29.4","DOES NOT MEET","MEETS","N/A","N/A",29.4,0]
["Martin Marietta","Lemon Springs - Sanford","2018-10-29","#57 Stone for Electrochemical","CA97",937182,"Jackson, Brandon M",32090,9.4,0,"<20.6","DOES NOT MEET","MEETS","N/A","N/A",20.6,0]
["Martin Marietta","Lemon Springs - Sanford","2018-10-29","#67 Stone for Electrochemical","CA97",937183,"Jackson, Brandon M",22810,9,0,"<28.9","MEETS","MEETS","N/A","N/A",28.9,0]
["Martin Marietta","Lemon Springs - Sanford","2018-10-29","#78-M Stone for Electrochemical","CA97",937184,"Jackson, Brandon M",16280,9.1999999999999993,0,"<40.5","DOES NOT MEET","MEETS","N/A","N/A",40.5,0]
["Hanson Aggregates Southeast, Inc.","Marlboro Plant - Bennettsville","2018-10-24","#67 Stone for Electrochemical","CA34",936888,"Jordan, Daniel H",158500,5.9,0,"<4.2","MEETS","MEETS","N/A","N/A",4.2,0]
["Hanson Aggregates Southeast, Inc.","Marlboro Plant - Bennettsville","2018-10-24","#78-M Stone for Electrochemical","CA34",936887,"Jordan, Daniel H",101900,5.8,0,"<6.5","MEETS","MEETS","N/A","N/A",6.5,0]
["Vulcan Materials Co.","Cabarrus Quarry - Concord","2018-10-18","#57 Stone for Electrochemical","CA186",935923,"Cero, Kevin M",22150,9.5,0,"<29.8","DOES NOT MEET","MEETS","N/A","N/A",29.8,0]
["Vulcan Materials Co.","Cabarrus Quarry - Concord","2018-10-18","#67 Stone for Electrochemical","CA186",935924,"Cero, Kevin M",20140,9.1,0,"<32.7","DOES NOT MEET","MEETS","N/A","N/A",32.700000000000003,0]
["Vulcan Materials Co.","Cabarrus Quarry - Concord","2018-10-18","#78-M Stone for Electrochemical","CA186",935925,"Cero, Kevin M",17010,9.4,0,"<38.7","DOES NOT MEET","MEETS","N/A","N/A",38.700000000000003,0]
["Vulcan Materials Co.","Rockingham Quarry - Rockingham","2018-10-15","#57 Stone for Electrochemical","CA94",935253,"Jordan, Daniel H",19540,9.6,0,"<35.83","DOES NOT MEET","MEETS","N/A","N/A",35.83,0]
["Vulcan Materials Co.","Rockingham Quarry - Rockingham","2018-10-15","#67 Stone for Electrochemical","CA94",935254,"Jordan, Daniel H",15380,9.6,0,"<44.66","DOES NOT MEET","MEETS","N/A","N/A",44.66,0]
["Vulcan Materials Co.","Rockingham Quarry - Rockingham","2018-10-15","#78-M Stone for Electrochemical","CA94",935255,"Jordan, Daniel H",15630,9.5,0,"<46.60","DOES NOT MEET","MEETS","N/A","N/A",46.6,0]
["Vulcan Materials Co.","Pacolet Quarry - Pacolet, SC","2018-10-10","#57 Stone for Electrochemical","CA83",935069,"Gosnell, Jimmy L",2088,8.1999999999999993,0,274,"MEETS","MEETS","N/A","N/A",274,0]
["Vulcan Materials Co.","Spruce Pine Quarry - Bakersville","2018-10-08","#57 Stone for Electrochemical","CA111",934014,"Rhymer, Robert C",17310,9.3000000000000007,0,"<43.38","DOES NOT MEET","MEETS","N/A","N/A",43.38,0]
["Vulcan Materials Co.","Spruce Pine Quarry - Bakersville","2018-10-08","#78-M Stone for Electrochemical","CA111",934015,"Rhymer, Robert C",7640,8.3000000000000007,0,"<86.3","MEETS","MEETS","N/A","N/A",86.3,0]
["Vulcan Materials Co.","Enka Quarry - Enka","2018-10-05","#57 Stone for Electrochemical","CA69",933926,"Rhymer, Robert C",11760,5.0999999999999996,0,"<64.35","MEETS","MEETS","N/A","N/A",64.349999999999994,0]
["Vulcan Materials Co.","Enka Quarry - Enka","2018-10-05","#78-M Stone for Electrochemical","CA69",933927,"Rhymer, Robert C",5134,4.7,0,41.1,"MEETS","DOES NOT MEET","N/A","N/A",41.1,0]
["Boone's Concrete Supply, LLC","Woodlawn Quarry - Marion","2018-10-05","#57 Stone for Electrochemical","CA190",933918,"Rhymer, Robert C",12610,9.8000000000000007,0,"<52.55","DOES NOT MEET","MEETS","N/A","N/A",52.55,0]
["Boone's Concrete Supply, LLC","Woodlawn Quarry - Marion","2018-10-05","#78-M Stone for Electrochemical","CA190",933919,"Rhymer, Robert C",13310,9.9,0,"<57.96","DOES NOT MEET","MEETS","N/A","N/A",57.96,0]
["Sloan Construction Co.","Blacksburg Quarry - Blacksburg, SC","2018-10-04","#57 Stone for Electrochemical","CA382",934376,"Gosnell, Jimmy L",42310,7.9,0,"<17.71","MEETS","MEETS","N/A","N/A",17.71,0]
["Thompson Contractors","Miller Creek Quarry - Rutherfordton","2018-10-02","#57 Stone for Electrochemical","CA59",933259,"Rhymer, Robert C",20720,9.5,0,"<32.26","DOES NOT MEET","MEETS","N/A","N/A",32.26,0]
["Thompson Contractors","Miller Creek Quarry - Rutherfordton","2018-10-02","#78-M Stone for Electrochemical","CA59",933261,"Rhymer, Robert C",21950,9.5,0,"<32.34","DOES NOT MEET","MEETS","N/A","N/A",32.340000000000003,0]
["Martin Marietta","Denver Quarry - Denver","2018-09-26","#67 Stone for Electrochemical","CA169",932757,"Gosnell, Jimmy L",18940,9.1999999999999993,0,"<37.17","DOES NOT MEET","MEETS","N/A","N/A",37.17,0]
["Martin Marietta","Denver Quarry - Denver","2018-09-26","#78-M Stone for Electrochemical","CA169",932759,"Gosnell, Jimmy L",8341,8.6,0,"<84.02","MEETS","MEETS","N/A","N/A",84.02,0]
["Martin Marietta","Hickory Quarry - Hickory","2018-09-26","#67 Stone for Electrochemical","CA43",932400,"Brinson, Joseph",19770,9.5,0,"<36.20","DOES NOT MEET","MEETS","N/A","N/A",36.200000000000003,0]
["Martin Marietta","Hickory Quarry - Hickory","2018-09-26","#78-M Stone for Electrochemical","CA43",932402,"Brinson, Joseph",18250,9.3000000000000007,0,"<39.75","DOES NOT MEET","MEETS","N/A","N/A",39.75,0]
["McCrary Stone","Marshall Quarry - Marshall","2018-09-14","#57 Stone for Electrochemical","CA113",931133,"Kindley, Wallace Quint",18240,9.4,0,"<39.59","DOES NOT MEET","MEETS","N/A","N/A",39.590000000000003,0]
["McCrary Stone","Marshall Quarry - Marshall","2018-09-14","#78-M Stone for Electrochemical","CA113",931134,"Kindley, Wallace Quint",14510,9.3000000000000007,0,"<49.37","DOES NOT MEET","MEETS","N/A","N/A",49.37,0]
["Martin Marietta","Bonds Quarry - Concord","2018-09-10","#57 Stone for Electrochemical","CA276",930587,"Pegues, Jr., Henderson",14640,9.5,7.5,"<45.97","DOES NOT MEET","MEETS","N/A","N/A",45.97,7.5]
["Martin Marietta","Bonds Quarry - Concord","2018-09-10","#67 Stone for Electrochemical","CA276",930596,"Pegues, Jr., Henderson",19120,9.4,0,"<34.48","DOES NOT MEET","MEETS","N/A","N/A",34.479999999999997,0]
["Martin Marietta","Bonds Quarry - Concord","2018-09-10","#78-M Stone for Electrochemical","CA276",930585,"Pegues, Jr., Henderson",18650,9.3000000000000007,0,"<34.56","DOES NOT MEET","MEETS","N/A","N/A",34.56,0]
["Martin Marietta","East Alamance Quarry - Haw River","2018-09-10","#57 Stone for Electrochemical","CA201",930500,"Waller, John M",20310,9.6,15,"<29.34","DOES NOT MEET","MEETS","N/A","N/A",29.34,15]
["Vulcan Materials Co.","Cabarrus Quarry - Concord","2018-08-27","#67 Stone for Electrochemical","CA186",929279,"Thomas, Mark D",20750,9.6,0,"<29.38","DOES NOT MEET","MEETS","N/A","N/A",29.38,0]
["Vulcan Materials Co.","Cabarrus Quarry - Concord","2018-08-02","#57 Stone for Electrochemical","CA186",924257,"Thomas, Mark D",20720,9.6,0,"<30.14","DOES NOT MEET","MEETS","N/A","N/A",30.14,0]
["Vulcan Materials Co.","Cabarrus Quarry - Concord","2018-08-02","#57 Stone for Electrochemical","CA186",927538,"Thomas, Mark D",20720,9.6,0,"<30.14","DOES NOT MEET","MEETS","N/A","N/A",30.14,0]
["Martin Marietta","Mallard Creek Quarry - Charlotte","2018-08-02","#57 Stone for Electrochemical","CA188",924255,"Thomas, Mark D",18720,9.6,0,"<27.91","DOES NOT MEET","MEETS","N/A","N/A",27.91,0]
["Martin Marietta","Mallard Creek Quarry - Charlotte","2018-08-02","#57 Stone for Electrochemical","CA188",927542,"Thomas, Mark D",18720,9.6,0,"<27.91","DOES NOT MEET","MEETS","N/A","N/A",27.91,0]
["Martin Marietta","Castle Hayne Yard - Castle Hayne","2018-07-13","Coarse Aggregate, #78M","CA319",920602,"Oehman, Christopher E",16480,9.4,0,"<38.6","DOES NOT MEET","MEETS","DOES NOT MEET","MEETS",38.6,0]
["Vulcan Materials Co.","Blacksburg Quarry - Blacksburg, SC","2018-07-05","#67 Stone for Electrochemical","CA82",920661,"Gosnell, Jimmy L",7313,10,0,"<89.94","DOES NOT MEET","MEETS","N/A","N/A",89.94,0]
["Vulcan Materials Co.","Blacksburg Quarry - Blacksburg, SC","2018-07-05","#78-M Stone for Electrochemical","CA82",920663,"Gosnell, Jimmy L",5389,10.1,0,18.3,"DOES NOT MEET","DOES NOT MEET","N/A","N/A",18.3,0]
["Hedrick Industries","Lake Norman Quarry - Stanley","2018-07-05","#57 Stone for Electrochemical","CA168",920649,"Gosnell, Jimmy L",12180,9.3000000000000007,0,"<55.57","DOES NOT MEET","MEETS","N/A","N/A",55.57,0]
["Hedrick Industries","Lake Norman Quarry - Stanley","2018-07-05","#67 Stone for Electrochemical","CA168",920645,"Gosnell, Jimmy L",8206,9.1,0,"<69.45","DOES NOT MEET","MEETS","N/A","N/A",69.45,0]
["Hedrick Industries","Lake Norman Quarry - Stanley","2018-07-05","#78-M Stone for Electrochemical","CA168",920652,"Gosnell, Jimmy L",9305,9.1,0,"<69.98","DOES NOT MEET","MEETS","N/A","N/A",69.98,0]
["Hedrick Industries","Lake Norman Quarry - Stanley","2018-06-14","#57 Stone for Electrochemical","CA168",916129,"Gosnell, Jimmy L",11102,9.4,0,"<53.55","DOES NOT MEET","MEETS","N/A","N/A",53.55,0]
["Hedrick Industries","Lake Norman Quarry - Stanley","2018-06-14","#67 Stone for Electrochemical","CA168",916130,"Gosnell, Jimmy L",14839,9.5,0,"<38.39","DOES NOT MEET","MEETS","N/A","N/A",38.39,0]
["Hedrick Industries","Lake Norman Quarry - Stanley","2018-06-14","#78-M Stone for Electrochemical","CA168",916131,"Gosnell, Jimmy L",10046,9.1999999999999993,0,"<58.92","DOES NOT MEET","MEETS","N/A","N/A",58.92,0]
["Martin Marietta","Kings Mountain Quarry - Kings Mountain","2018-06-01","#67 Stone for Electrochemical","CA48",913644,"Brinson, Joseph",13679,9.1999999999999993,0,45.3,"DOES NOT MEET","MEETS","N/A","N/A",45.3,0]
["Martin Marietta","Kings Mountain Quarry - Kings Mountain","2018-06-01","#78-M Stone for Electrochemical","CA48",913645,"Brinson, Joseph",13462,9.3000000000000007,4,45.4,"DOES NOT MEET","MEETS","N/A","N/A",45.4,4]
["Vulcan Materials Co.","Rockingham Quarry - Rockingham","2018-05-11","#57 Stone for Electrochemical","CA94",911055,"Jordan, Daniel H",13935,9.6999999999999993,0,41.1,"DOES NOT MEET","MEETS","N/A","N/A",41.1,0]
["Vulcan Materials Co.","Rockingham Quarry - Rockingham","2018-05-11","#67 Stone for Electrochemical","CA94",911058,"Jordan, Daniel H",15896,9.5,0,36.799999999999997,"DOES NOT MEET","MEETS","N/A","N/A",36.799999999999997,0]
["Vulcan Materials Co.","Rockingham Quarry - Rockingham","2018-05-11","#78-M Stone for Electrochemical","CA94",911059,"Jordan, Daniel H",11663,9.4,0,50.3,"DOES NOT MEET","MEETS","N/A","N/A",50.3,0]
["Vulcan Materials Co.","115 Quarry - N. Wilkesboro","2018-05-10","#57 Stone for Electrochemical","CA79",910653,"Patrie, Garin T",19387,8.8000000000000007,0,29.4,"MEETS","MEETS","N/A","N/A",29.4,0]
["Vulcan Materials Co.","115 Quarry - N. Wilkesboro","2018-05-10","#67 Stone for Electrochemical","CA79",910654,"Patrie, Garin T",13541,8.6,0,42.4,{"$f":"IF(AND(4.5 <= $I322, $I322 <= 9), \"MEETS\", \"DOES NOT MEET\")","v":"MEETS"},{"$f":"IF(AND(5 <= $I322, $I322 <= 10), \"MEETS\", \"DOES NOT MEET\")","v":"MEETS"},{"$f":"IF(OR(ISBLANK(H322), NOT(ISNUMBER(MATCH($E322, Coastal,0)))), \"N/A\", IF(AND(4.5 <= $I322, $I322 <= 9),IF($H322>=5000,IF($Q322<=100,IF($P322<=200,\"MEETS\",\"DOES NOT MEET\"),\"DOES NOT MEET\"),\"DOES NOT MEET\"),\"DOES NOT MEET\"))","v":"N/A"},{"$f":"IF(OR(ISBLANK(I322), NOT(ISNUMBER(MATCH($E322, Coastal, 0)))), \"N/A\", IF(AND(5 <= $I322, $I322 <= 10),IF($H322>=5000,IF($Q322<=100,IF($P322<=200,\"MEETS\",\"DOES NOT MEET\"),\"DOES NOT MEET\"),\"DOES NOT MEET\"),\"DOES NOT MEET\"))","v":"N/A"},{"$f":"IF(LEFT(K322, 1)=\"<\", VALUE(RIGHT(K322,LEN(K322)-1)), K322)","v":42.4},{"$f":"IF(LEFT(J322, 1)=\"<\", VALUE(RIGHT(J322,LEN(J322)-1)), J322)","v":0}]
["Vulcan Materials Co.","115 Quarry - N. Wilkesboro","2018-05-10","#78-M Stone for Electrochemical","CA79",910655,"Patrie, Garin T",10774,8.1,0,53.4,"MEETS","MEETS","N/A","N/A",53.4,0]
["Vulcan Materials Co.","Cabarrus Quarry - Concord","2018-05-09","#57 Stone for Electrochemical","CA186",910981,"Pegues, Jr., Henderson",16984,8.9,0,34,"MEETS","MEETS","N/A","N/A",34,0]
["Vulcan Materials Co.","Cabarrus Quarry - Concord","2018-05-09","#78-M Stone for Electrochemical","CA186",910982,"Pegues, Jr., Henderson",12953,9,0,43.5,"MEETS","MEETS","N/A","N/A",43.5,0]
["Vulcan Materials Co.","Clear Creek Q. - Charlotte","2018-05-09","#57 Stone for Electrochemical","CA249",910980,"Pegues, Jr., Henderson",22743,9.3000000000000007,0,26,"DOES NOT MEET","MEETS","N/A","N/A",26,0]
["Martin Marietta","Statesville Quarry - Statesville","2018-05-09","#57 Stone for Electrochemical","CA54",911141,"Brinson, Joseph",12514,8.6,0,45.1,"MEETS","MEETS","N/A","N/A",45.1,0]
["Martin Marietta","Statesville Quarry - Statesville","2018-05-09","#67 Stone for Electrochemical","CA54",911140,"Brinson, Joseph",10220,8.6999999999999993,0,55,"MEETS","MEETS","N/A","N/A",55,0]
["Martin Marietta","Statesville Quarry - Statesville","2018-05-09","#78-M Stone for Electrochemical","CA54",911138,"Brinson, Joseph",12492,8.6,0,45.2,"MEETS","MEETS","N/A","N/A",45.2,0]
["Wake Stone Corp.","Moncure Quarry - Moncure","2018-03-29","#57 Stone for Electrochemical","CA100",904079,"Jackson, Brandon M",15901,7.7,0,35.700000000000003,"MEETS","MEETS","N/A","N/A",35.700000000000003,0]
["Wake Stone Corp.","Moncure Quarry - Moncure","2018-03-29","#67 Stone for Electrochemical","CA100",904090,"Jackson, Brandon M",11848,8.9,0,47.1,"MEETS","MEETS","N/A","N/A",47.1,0]
["Wake Stone Corp.","Moncure Quarry - Moncure","2018-03-29","#78-M Stone for Electrochemical","CA100",904091,"Jackson, Brandon M",15179,8.8000000000000007,0,36.200000000000003,"MEETS","MEETS","N/A","N/A",36.200000000000003,0]
["Martin Marietta","Kannapolis Quarry - Landis","2018-03-28","#57 Stone for Electrochemical","CA47",903949,"Wagoner, Roy M",22868,9,0,23.5,"MEETS","MEETS","N/A","N/A",23.5,0]
["Martin Marietta","Kannapolis Quarry - Landis","2018-03-28","#78-M Stone for Electrochemical","CA47",903950,"Wagoner, Roy M",24149,8.9,0,22.4,"MEETS","MEETS","N/A","N/A",22.4,0]
["Vulcan Materials Co.","115 Quarry - N. Wilkesboro","2018-03-20","#57 Stone for Electrochemical","CA79",902327,"Cox, Justin Ryan",17765,9.1,0,29.1,"DOES NOT MEET","MEETS","N/A","N/A",29.1,0]
["Martin Marietta","Castle Hayne Yard - Castle Hayne","2018-03-08","#78-M Stone for Electrochemical","CA319",900963,"Oehman, Christopher E",14881,8.5,0,43.4,"MEETS","MEETS","MEETS","MEETS",43.4,0]
["Vulcan Materials Co.","North Quarry - Winston Salem","2018-02-23","#57 Stone for Electrochemical","CA72",899210,"Wagoner, Roy M",22178,9.1,0,26.7,"DOES NOT MEET","MEETS","N/A","N/A",26.7,0]
["Vulcan Materials Co.","North Quarry - Winston Salem","2018-02-23","#67 Stone for Electrochemical","CA72",899208,"Wagoner, Roy M",24313,8.6999999999999993,0,24.1,"MEETS","MEETS","N/A","N/A",24.1,0]
["Vulcan Materials Co.","North Quarry - Winston Salem","2018-02-23","#78-M Stone for Electrochemical","CA72",899209,"Wagoner, Roy M",18871,8.8000000000000007,0,33.1,"MEETS","MEETS","N/A","N/A",33.1,0]
["Vulcan Materials Co.","Skippers Quarry - Skippers, VA","2018-02-07","#57 Stone for Electrochemical","CA55",897059,"Thomas, Grady Q",8547,9.1,13.7,73.900000000000006,"DOES NOT MEET","MEETS","DOES NOT MEET","MEETS",73.900000000000006,13.7]
["Vulcan Materials Co.","Skippers Quarry - Skippers, VA","2018-02-07","#78-M Stone for Electrochemical","CA55",897111,"Thomas, Grady Q",11421,9.3000000000000007,4.5999999999999996,54.9,"DOES NOT MEET","MEETS","DOES NOT MEET","MEETS",54.9,4.5999999999999996]
["Vulcan Materials Co.","Clear Creek Q. - Charlotte","2018-02-05","#57 Stone for Electrochemical","CA249",895551,"Pegues, Jr., Henderson",27847,8.6,0,25.4,"MEETS","MEETS","N/A","N/A",25.4,0]
["Vulcan Materials Co.","Clear Creek Q. - Charlotte","2018-02-05","#67 Stone for Electrochemical","CA249",895552,"Pegues, Jr., Henderson",23507,8.8000000000000007,0,28.5,"MEETS","MEETS","N/A","N/A",28.5,0]
["Vulcan Materials Co.","Clear Creek Q. - Charlotte","2018-02-05","#78-M Stone for Electrochemical","CA249",895553,"Pegues, Jr., Henderson",21146,8.6999999999999993,0,32.299999999999997,"MEETS","MEETS","N/A","N/A",32.299999999999997,0]
["Martin Marietta","Arrowood Quarry - Charlotte","2017-12-11","#67 Stone for Electrochemical","CA31",889712,"Adair, Mildred (Millie) L",14221,8.9,20.7,46.2,"MEETS","MEETS","N/A","N/A",46.2,20.7]
["Martin Marietta","Arrowood Quarry - Charlotte","2017-12-11","#78-M Stone for Electrochemical","CA31",889713,"Adair, Mildred (Millie) L",15785,7.7,0,41.8,"MEETS","MEETS","N/A","N/A",41.8,0]
["Vulcan Materials Co.","Pineville Quarry - Charlotte","2017-12-05","#67 Stone for Electrochemical","CA101",889566,"Adair, Mildred (Millie) L",19209,9.3000000000000007,4.0999999999999996,34.5,"DOES NOT MEET","MEETS","N/A","N/A",34.5,4.0999999999999996]
["Vulcan Materials Co.","Pineville Quarry - Charlotte","2017-12-05","#78-M Stone for Electrochemical","CA101",889568,"Adair, Mildred (Millie) L",10894,8.8000000000000007,4.0999999999999996,60,"MEETS","MEETS","N/A","N/A",60,4.0999999999999996]
["Martin Marietta","Castle Hayne Yard - Castle Hayne","2017-12-01","#78-M Stone for Electrochemical","CA319",888789,"Brotherton, Christopher R",22573,8.6999999999999993,0,28.2,"MEETS","MEETS","MEETS","MEETS",28.2,0]
["Martin Marietta","Mallard Creek Quarry - Charlotte","2017-11-30","#57 Stone for Electrochemical","CA188",888671,"Pegues, Jr., Henderson",19026,9.5,0,34.4,"DOES NOT MEET","MEETS","N/A","N/A",34.4,0]
["Martin Marietta","Mallard Creek Quarry - Charlotte","2017-11-30","#67 Stone for Electrochemical","CA188",888673,"Pegues, Jr., Henderson",20040,9.1999999999999993,0,33,"DOES NOT MEET","MEETS","N/A","N/A",33,0]
["Martin Marietta","Mallard Creek Quarry - Charlotte","2017-11-30","#78-M Stone for Electrochemical","CA188",888674,"Pegues, Jr., Henderson",21179,9.5,0,31.2,"DOES NOT MEET","MEETS","N/A","N/A",31.2,0]
["Martin Marietta","Kings Mountain Quarry - Kings Mountain","2017-11-17","#67 Stone for Electrochemical","CA48",886932,"Brinson, Joseph",8651,9.9,0,76.3,"DOES NOT MEET","MEETS","N/A","N/A",76.3,0]
["Martin Marietta","Mallard Creek Quarry - Charlotte","2017-11-07","#57 Stone for Electrochemical","CA188",885610,"Pegues, Jr., Henderson",18570,9.1999999999999993,0,31.9,"DOES NOT MEET","MEETS","N/A","N/A",31.9,0]
["Martin Marietta","Mallard Creek Quarry - Charlotte","2017-11-07","#67 Stone for Electrochemical","CA188",885612,"Pegues, Jr., Henderson",23272,9.3000000000000007,0,28.3,"DOES NOT MEET","MEETS","N/A","N/A",28.3,0]
["Martin Marietta","Mallard Creek Quarry - Charlotte","2017-11-07","#78-M Stone for Electrochemical","CA188",885614,"Pegues, Jr., Henderson",16912,9.3000000000000007,0,35.700000000000003,"DOES NOT MEET","MEETS","N/A","N/A",35.700000000000003,0]
["Martin Marietta","Kings Mountain Quarry - Kings Mountain","2017-10-30","#67 Stone for Electrochemical","CA48",883910,"Brinson, Joseph",11674,9.6,0,51.4,"DOES NOT MEET","MEETS","N/A","N/A",51.4,0]
["Martin Marietta","Kings Mountain Quarry - Kings Mountain","2017-10-30","#78-M Stone for Electrochemical","CA48",883913,"Brinson, Joseph",12404,9.5,0,48.8,"DOES NOT MEET","MEETS","N/A","N/A",48.8,0]
["Martin Marietta","Rock Hill Quarry - Rock Hill, SC","2017-10-30","#57 Stone for Electrochemical","CA271",885405,"Adair, Mildred (Millie) L",21739,9.3000000000000007,0,28.5,"DOES NOT MEET","MEETS","N/A","N/A",28.5,0]
["Martin Marietta","Rock Hill Quarry - Rock Hill, SC","2017-10-30","#78-M Stone for Electrochemical","CA271",885403,"Adair, Mildred (Millie) L",22366,8.9,0,27.4,"MEETS","MEETS","N/A","N/A",27.4,0]
["Martin Marietta","Rock Hill Quarry - Rock Hill, SC","2017-09-26","#57 Stone for Electrochemical","CA271",878996,"Adair, Mildred (Millie) L",23084,9.6,0,27,"DOES NOT MEET","MEETS","N/A","N/A",27,0]
["Martin Marietta","Rock Hill Quarry - Rock Hill, SC","2017-09-26","#67 Stone for Electrochemical","CA271",878994,"Adair, Mildred (Millie) L",20309,9.5,0,30.6,"DOES NOT MEET","MEETS","N/A","N/A",30.6,0]
["Martin Marietta","Rock Hill Quarry - Rock Hill, SC","2017-09-26","#78-M Stone for Electrochemical","CA271",878992,"Adair, Mildred (Millie) L",21000,9.1999999999999993,0,31.3,"DOES NOT MEET","MEETS","N/A","N/A",31.3,0]
["Vulcan Materials Co.","Cabarrus Quarry - Concord","2017-09-18","#57 Stone for Electrochemical","CA186",877802,"Adair, Mildred (Millie) L",17250,9.5,0,37.5,"DOES NOT MEET","MEETS","N/A","N/A",37.5,0]
["Vulcan Materials Co.","Cabarrus Quarry - Concord","2017-09-18","#78-M Stone for Electrochemical","CA186",877705,"Adair, Mildred (Millie) L",19117,9.4,0,33.4,"DOES NOT MEET","MEETS","N/A","N/A",33.4,0]
["Martin Marietta","Bonds Quarry - Concord","2017-09-05","#67 Stone for Electrochemical","CA276",875549,"Pegues, Jr., Henderson",18727,8.5,0,34.799999999999997,"MEETS","MEETS","N/A","N/A",34.799999999999997,0]
["Martin Marietta","Bonds Quarry - Concord","2017-09-05","#78-M Stone for Electrochemical","CA276",875548,"Pegues, Jr., Henderson",21848,8.5,0,28.5,"MEETS","MEETS","N/A","N/A",28.5,0]
["Martin Marietta","Clarks Quarry - New Bern","2017-08-11","#67 Stone for Electrochemical","CA189",873120,"Hughes, Sr., Daniel P",880,6.8,0,400,"MEETS","MEETS","DOES NOT MEET","DOES NOT MEET",400,0]
["Martin Marietta","Charlotte Quarry - Charlotte","2017-06-19","#67 Stone for Electrochemical","CA41",864022,"Adair, Mildred (Millie) L",15608,9.3000000000000007,0,38.4,"DOES NOT MEET","MEETS","N/A","N/A",38.4,0]
["Martin Marietta","Charlotte Quarry - Charlotte","2017-06-19","#78-M Stone for Electrochemical","CA41",864025,"Adair, Mildred (Millie) L",14885,9.1999999999999993,0,41.2,"DOES NOT MEET","MEETS","N/A","N/A",41.2,0]
["Vulcan Materials Co.","Smith Grove Q. - Mocksville","2017-05-01","#67 Stone for Electrochemical","CA80",858504,"Wagoner, Roy M",11566,9.3000000000000007,0,55.8,"DOES NOT MEET","MEETS","N/A","N/A",55.8,0]
["Carolina Stalite Corp.","Gold Hill (Light Wt.) - Gold Hill","2017-04-05","#67 Stone for Electrochemical","CA226",852427,"Tucker, Rusty J",929,11.8,0,22.9,"DOES NOT MEET","DOES NOT MEET","N/A","N/A",22.9,0]
["Vulcan Materials Co.","Clear Creek Q. - Charlotte","2017-04-04","#57 Stone for Electrochemical","CA249",852263,"Pegues, Jr., Henderson",19425,9.6,0,30.9,"DOES NOT MEET","MEETS","N/A","N/A",30.9,0]
["Appalachian Aggregates, LLC","Bluefield Plant","2017-03-22","#57 Stone for Electrochemical","CA307",850413,"Church, Tracy G",16706,9.4,0,36.799999999999997,"DOES NOT MEET","MEETS","N/A","N/A",36.799999999999997,0]
["Hedrick Industries","Aquadale Quarry - Norwood","2017-03-21","#57 Stone for Electrochemical","CA274",850258,"Thomas, Mark D",16108,8.6999999999999993,0,36.4,"MEETS","MEETS","N/A","N/A",36.4,0]
["Hedrick Industries","Aquadale Quarry - Norwood","2017-03-21","#78-M Stone for Electrochemical","CA274",850259,"Thomas, Mark D",14539,8.8000000000000007,0,40.799999999999997,"MEETS","MEETS","N/A","N/A",40.799999999999997,0]
["Vulcan Materials Co.","Penrose Quarry - Pisgah Forest","2017-03-07","#57 Stone for Electrochemical","CA12",848230,"Wood, Dean Michael M",23084,9.4,0,26.7,"DOES NOT MEET","MEETS","N/A","N/A",26.7,0]
["Vulcan Materials Co.","Penrose Quarry - Pisgah Forest","2017-03-07","#78-M Stone for Electrochemical","CA12",848232,"Wood, Dean Michael M",22784,9.4,0,26.4,"DOES NOT MEET","MEETS","N/A","N/A",26.4,0]
["Carolina Stalite Corp.","Gold Hill (Light Wt.) - Gold Hill","2017-03-03","#67 Stone for Electrochemical","CA226",847771,"Tucker, Rusty J",2847,10.7,0,45.2,"DOES NOT MEET","DOES NOT MEET","N/A","N/A",45.2,0]
["Blue Water Industries","Midway Quarry - Mascot, TN","2017-02-20","#67 Stone for Electrochemical","CA183",845872,"Rhymer, Robert C",17056,9.8000000000000007,0,38.200000000000003,"DOES NOT MEET","MEETS","N/A","N/A",38.200000000000003,0]
["Vulcan Materials Co.","Skippers Quarry - Skippers, VA","2017-02-07","#67 Stone for Electrochemical","CA55",844601,"Thomas, Grady Q",12830,8.8000000000000007,13.3,48.7,"MEETS","MEETS","MEETS","MEETS",48.7,13.3]
["Vulcan Materials Co.","Skippers Quarry - Skippers, VA","2017-02-07","#78-M Stone for Electrochemical","CA55",844605,"Thomas, Grady Q",11986,8.3000000000000007,8.9,51,"MEETS","MEETS","MEETS","MEETS",51,8.9]
["Vulcan Materials Co.","Clear Creek Q. - Charlotte","2017-02-01","#57 Stone for Electrochemical","CA249",843620,"Pegues, Jr., Henderson",26954,8.4,0,23.3,"MEETS","MEETS","N/A","N/A",23.3,0]
["Vulcan Materials Co.","Clear Creek Q. - Charlotte","2017-02-01","#67 Stone for Electrochemical","CA249",843624,"Pegues, Jr., Henderson",25272,8,0,24.7,"MEETS","MEETS","N/A","N/A",24.7,0]
["Vulcan Materials Co.","Clear Creek Q. - Charlotte","2017-02-01","#78-M Stone for Electrochemical","CA249",843616,"Pegues, Jr., Henderson",21749,8,0,28.9,"MEETS","MEETS","N/A","N/A",28.9,0]
["Ararat Rock Products","Mt. Airy Quarry - Mt. Airy","2017-01-31","#57 Stone for Electrochemical","CA3",843860,"Whitley, Christopher D",12816,8,0,48.7,{"$f":"IF(AND(4.5 <= $I386, $I386 <= 9), \"MEETS\", \"DOES NOT MEET\")","v":"MEETS"},{"$f":"IF(AND(5 <= $I386, $I386 <= 10), \"MEETS\", \"DOES NOT MEET\")","v":"MEETS"},{"$f":"IF(OR(ISBLANK(H386), NOT(ISNUMBER(MATCH($E386, Coastal,0)))), \"N/A\", IF(AND(4.5 <= $I386, $I386 <= 9),IF($H386>=5000,IF($Q386<=100,IF($P386<=200,\"MEETS\",\"DOES NOT MEET\"),\"DOES NOT MEET\"),\"DOES NOT MEET\"),\"DOES NOT MEET\"))","v":"N/A"},{"$f":"IF(OR(ISBLANK(I386), NOT(ISNUMBER(MATCH($E386, Coastal, 0)))), \"N/A\", IF(AND(5 <= $I386, $I386 <= 10),IF($H386>=5000,IF($Q386<=100,IF($P386<=200,\"MEETS\",\"DOES NOT MEET\"),\"DOES NOT MEET\"),\"DOES NOT MEET\"),\"DOES NOT MEET\"))","v":"N/A"},{"$f":"IF(LEFT(K386, 1)=\"<\", VALUE(RIGHT(K386,LEN(K386)-1)), K386)","v":48.7},{"$f":"IF(LEFT(J386, 1)=\"<\", VALUE(RIGHT(J386,LEN(J386)-1)), J386)","v":0}]
["Ararat Rock Products","Mt. Airy Quarry - Mt. Airy","2017-01-31","#78-M Stone for Electrochemical","CA3",843861,"Whitley, Christopher D",11582,8.3000000000000007,0,50.8,"MEETS","MEETS","N/A","N/A",50.8,0]
["Hedrick Industries","South McDowell Quarry - Marion","2017-01-13","#57 Stone for Electrochemical","CA283",841894,"Rhymer, Robert C",22026,7.9,0,29.3,"MEETS","MEETS","N/A","N/A",29.3,0]
["Hedrick Industries","South McDowell Quarry - Marion","2017-01-13","#78-M Stone for Electrochemical","CA283",841896,"Rhymer, Robert C",21088,7.8,0,30.3,"MEETS","MEETS","N/A","N/A",30.3,0]
["Martin Marietta","Denver Quarry - Denver","2016-12-20","#57 Stone for Electrochemical","CA169",839457,"Brinson, Joseph",13631,7.8,0,5,"MEETS","MEETS","N/A","N/A",5,0]
["Martin Marietta","Denver Quarry - Denver","2016-12-20","#67 Stone for Electrochemical","CA169",839459,"Brinson, Joseph",18560,7.7,0,1.5,"MEETS","MEETS","N/A","N/A",1.5,0]
["Martin Marietta","Denver Quarry - Denver","2016-12-20","#78-M Stone for Electrochemical","CA169",839461,"Brinson, Joseph",10254,7.5,0,16.399999999999999,"MEETS","MEETS","N/A","N/A",16.399999999999999,0]
["Hanson Aggregates Southeast, Inc.","Jefferson Quarry - Jefferson, SC","2016-12-14","#57 Stone for Electrochemical","CA120",838781,"Jordan, Daniel H",31827,8.1,0,0,"MEETS","MEETS","N/A","N/A",0,0]
["Hanson Aggregates Southeast, Inc.","Jefferson Quarry - Jefferson, SC","2016-12-14","#78-M Stone for Electrochemical","CA120",838780,"Jordan, Daniel H",26709,8.3000000000000007,0,0,"MEETS","MEETS","N/A","N/A",0,0]
["Hanson Aggregates Southeast, Inc.","Sandy Flats Quarry - Taylors, SC","2016-12-14","#57 Stone for Electrochemical","CA298",839140,"Wood, Dean Michael M",18152,7.7,0,2,"MEETS","MEETS","N/A","N/A",2,0]
["Hanson Aggregates Southeast, Inc.","Sandy Flats Quarry - Taylors, SC","2016-12-14","#67 Stone for Electrochemical","CA298",839142,"Wood, Dean Michael M",21013,7.6,0,1.6,"MEETS","MEETS","N/A","N/A",1.6,0]
["Hanson Aggregates Southeast, Inc.","Sandy Flats Quarry - Taylors, SC","2016-12-14","#78-M Stone for Electrochemical","CA298",839144,"Wood, Dean Michael M",21786,7.8,0,0.9,"MEETS","MEETS","N/A","N/A",0.9,0]
["Hedrick Industries","Lake Norman Quarry - Stanley","2016-12-13","#57 Stone for Electrochemical","CA168",838934,"Kindley, Wallace Quint",13631,7.9,0,7.2,"MEETS","MEETS","N/A","N/A",7.2,0]
["Hedrick Industries","Lake Norman Quarry - Stanley","2016-12-13","#78-M Stone for Electrochemical","CA168",838935,"Kindley, Wallace Quint",10028,7.7,0,21.7,"MEETS","MEETS","N/A","N/A",21.7,0]
["Sloan Construction Co.","Blacksburg Quarry - Blacksburg, SC","2016-11-22","#57 Stone for Electrochemical","CA382",836475,"Brinson, Joseph",79114,7.7,0,1.8,"MEETS","MEETS","N/A","N/A",1.8,0]
["Sloan Construction Co.","Blacksburg Quarry - Blacksburg, SC","2016-11-22","#67 Stone for Electrochemical","CA382",836476,"Brinson, Joseph",68027,7.4,0,0,"MEETS","MEETS","N/A","N/A",0,0]
["Vulcan Materials Co.","Boone Quarry - Boone","2016-11-03","#57 Stone for Electrochemical","CA21",833824,"Church, Tracy G",50251,8.3000000000000007,0,0,"MEETS","MEETS","N/A","N/A",0,0]
["Vulcan Materials Co.","Boone Quarry - Boone","2016-11-03","#78-M Stone for Electrochemical","CA21",833828,"Church, Tracy G",35881,7.7,0,1.8,"MEETS","MEETS","N/A","N/A",1.8,0]
["Maymead Materials, Inc.","Turnip Patch Quarry - Mountain City, TN","2016-11-03","#57 Stone for Electrochemical","CA153",833841,"Church, Tracy G",15676,8.6,0,0.2,"MEETS","MEETS","N/A","N/A",0.2,0]
["Martin Marietta","Mallard Creek Quarry - Charlotte","2016-11-01","#57 Stone for Electrochemical","CA188",832994,"Pegues, Jr., Henderson",23095,9,0,0.6,"MEETS","MEETS","N/A","N/A",0.6,0]
["Martin Marietta","Mallard Creek Quarry - Charlotte","2016-11-01","#67 Stone for Electrochemical","CA188",832992,"Pegues, Jr., Henderson",19051,8.6999999999999993,0,0,"MEETS","MEETS","N/A","N/A",0,0]
["Martin Marietta","Mallard Creek Quarry - Charlotte","2016-11-01","#78-M Stone for Electrochemical","CA188",832990,"Pegues, Jr., Henderson",23381,8.6999999999999993,0,0.8,"MEETS","MEETS","N/A","N/A",0.8,0]
["Boone's Concrete Supply, LLC","Woodlawn Quarry - Marion","2016-10-28","#57 Stone for Electrochemical","CA190",832770,"Ausley, Jeff A",13182,9.3000000000000007,0,0.8,"DOES NOT MEET","MEETS","N/A","N/A",0.8,0]
["Boone's Concrete Supply, LLC","Woodlawn Quarry - Marion","2016-10-28","#78-M Stone for Electrochemical","CA190",832771,"Ausley, Jeff A",11364,9.1999999999999993,0,5.3,"DOES NOT MEET","MEETS","N/A","N/A",5.3,0]
["McCrary Stone","Low Gap Quarry - Burnsville","2016-10-27","#57 Stone for Electrochemical","CA244",832505,"Kindley, Wallace Quint",7651,8,0,8.1999999999999993,"MEETS","MEETS","N/A","N/A",8.1999999999999993,0]
["McCrary Stone","Low Gap Quarry - Burnsville","2016-10-27","#78-M Stone for Electrochemical","CA244",832511,"Kindley, Wallace Quint",5543,7.8,0,39.799999999999997,"MEETS","MEETS","N/A","N/A",39.799999999999997,0]
["Vulcan Materials Co.","Havre De Grace Quarry - Havre De Grace, MD","2016-10-26","#67 Stone for Electrochemical","CA345",832514,"Bonds, Maria M",15838,8.3000000000000007,0,3.7,"MEETS","MEETS","MEETS","MEETS",3.7,0]
["Vulcan Materials Co.","Havre De Grace Quarry - Havre De Grace, MD","2016-10-26","#78-M Stone for Electrochemical","CA345",832499,"Bonds, Maria M",6605,7.9,17.7,7.6,"MEETS","MEETS","MEETS","MEETS",7.6,17.7]
["Vulcan Materials Co.","Jack Quarry - Petersburg, VA","2016-10-26","#67 Stone for Electrochemical","CA137",832488,"Bonds, Maria M",15921,9.5,0,2.1,"DOES NOT MEET","MEETS","DOES NOT MEET","MEETS",2.1,0]
["Vulcan Materials Co.","Jack Quarry - Petersburg, VA","2016-10-26","#78-M Stone for Electrochemical","CA137",832483,"Bonds, Maria M",19763,9,0,1.2,"MEETS","MEETS","MEETS","MEETS",1.2,0]
["Vulcan Materials Co.","Puddledock Quarry - Prince George, VA","2016-10-26","#57 Stone for Electrochemical","CA224",832533,"Bonds, Maria M",36088,5,0,3.3,"MEETS","MEETS","MEETS","MEETS",3.3,0]
["Vulcan Materials Co.","Puddledock Quarry - Prince George, VA","2016-10-26","#78-M Stone for Electrochemical","CA224",832529,"Bonds, Maria M",43668,7.3,0,3.4,"MEETS","MEETS","MEETS","MEETS",3.4,0]
["Rogers Group, Inc.","Mitchell County Stone","2016-10-25","#57 Stone for Electrochemical","CA315",832455,"Rhymer, Robert C",82508,8.1,0,0.4,"MEETS","MEETS","N/A","N/A",0.4,0]
["Rogers Group, Inc.","Mitchell County Stone","2016-10-25","#78-M Stone for Electrochemical","CA315",832457,"Rhymer, Robert C",42373,8.1,0,0.1,"MEETS","MEETS","N/A","N/A",0.1,0]
["McCrary Stone","Marshall Quarry - Marshall","2016-10-17","#57 Stone for Electrochemical","CA113",830770,"Kindley, Wallace Quint",10481,8.9,0,13.7,"MEETS","MEETS","N/A","N/A",13.7,0]
["McCrary Stone","Marshall Quarry - Marshall","2016-10-17","#78-M Stone for Electrochemical","CA113",830773,"Kindley, Wallace Quint",8170,7.9,0,12.7,"MEETS","MEETS","N/A","N/A",12.7,0]
["Thompson Contractors","Miller Creek Quarry - Rutherfordton","2016-10-14","#78-M Stone for Electrochemical","CA59",830322,"Rhymer, Robert C",22109,8.4,0,0.9,"MEETS","MEETS","N/A","N/A",0.9,0]
["Vulcan Materials Co.","Spruce Pine Quarry - Bakersville","2016-10-14","#57 Stone for Electrochemical","CA111",830560,"Ausley, Jeff A",19387,6.7,0,4.8,"MEETS","MEETS","N/A","N/A",4.8,0]
["Vulcan Materials Co.","Spruce Pine Quarry - Bakersville","2016-10-14","#78-M Stone for Electrochemical","CA111",830562,"Ausley, Jeff A",16706,8.8000000000000007,0,4.8,"MEETS","MEETS","N/A","N/A",4.8,0]
["Vulcan Materials Co.","Enka Quarry - Enka","2016-10-10","#57 Stone for Electrochemical","CA69",829644,"Rhymer, Robert C",13104,6.7,0,24.7,"MEETS","MEETS","N/A","N/A",24.7,0]
["Vulcan Materials Co.","Enka Quarry - Enka","2016-10-10","#78-M Stone for Electrochemical","CA69",829646,"Rhymer, Robert C",9479,5.2,0,8.6,"MEETS","MEETS","N/A","N/A",8.6,0]
["Hedrick Industries","North Buncombe Quarry - Asheville","2016-10-10","#57 Stone for Electrochemical","CA131",829874,"Kindley, Wallace Quint",3131,3.8,8.9,85.4,"DOES NOT MEET","DOES NOT MEET","N/A","N/A",85.4,8.9]
["Hedrick Industries","North Buncombe Quarry - Asheville","2016-10-10","#78-M Stone for Electrochemical","CA131",829878,"Kindley, Wallace Quint",1901,3.7,13.3,95.3,"DOES NOT MEET","DOES NOT MEET","N/A","N/A",95.3,13.3]
["Vulcan Materials Co.","Pineville Quarry - Charlotte","2016-10-06","#57 Stone for Electrochemical","CA101",829482,"Adair, Mildred (Millie) L",10259,7.4,4.4000000000000004,14.2,"MEETS","MEETS","N/A","N/A",14.2,4.4000000000000004]
["Vulcan Materials Co.","Pineville Quarry - Charlotte","2016-10-06","#67 Stone for Electrochemical","CA101",829481,"Adair, Mildred (Millie) L",9940,7.6,0,19.7,"MEETS","MEETS","N/A","N/A",19.7,0]
["Vulcan Materials Co.","Pineville Quarry - Charlotte","2016-10-06","#78-M Stone for Electrochemical","CA101",829483,"Adair, Mildred (Millie) L",9099,7.6,4.4000000000000004,20,"MEETS","MEETS","N/A","N/A",20,4.4000000000000004]
["Harrison Construction Co., Inc.","Dillsboro Quarry - Dillsboro","2016-10-04","#57 Stone for Electrochemical","CA15",828920,"Kindley, Wallace Quint",10607,7.5,0,8,"MEETS","MEETS","N/A","N/A",8,0]
["Harrison Construction Co., Inc.","Dillsboro Quarry - Dillsboro","2016-10-04","#78-M Stone for Electrochemical","CA15",828923,"Kindley, Wallace Quint",8787,7.5,0,8.1999999999999993,"MEETS","MEETS","N/A","N/A",8.1999999999999993,0]
["Blue Water Industries","Abingdon Quarry","2016-09-28","#57 Stone for Electrochemical","CA251",828584,"Church, Tracy G",8741,7.7,0,14.2,"MEETS","MEETS","N/A","N/A",14.2,0]
["Blue Water Industries","Elizabethton Quarry","2016-09-28","#57 Stone for Electrochemical","CA401",828607,"Church, Tracy G",15265,7.3,0,9.6999999999999993,"MEETS","MEETS","N/A","N/A",9.6999999999999993,0]
["Blue Water Industries","Watauga Quarry","2016-09-28","#57 Stone for Electrochemical","CA133",828603,"Church, Tracy G",16139,6.7,0,6.1,"MEETS","MEETS","N/A","N/A",6.1,0]
["Harrison Construction Co., Inc.","Waynesville Quarry - Waynesville","2016-09-26","#57 Stone for Electrochemical","CA1",827845,"Kindley, Wallace Quint",10436,7.7,0,12.9,"MEETS","MEETS","N/A","N/A",12.9,0]
["Harrison Construction Co., Inc.","Waynesville Quarry - Waynesville","2016-09-26","#78-M Stone for Electrochemical","CA1",827849,"Kindley, Wallace Quint",7825,7.6,0,15.3,"MEETS","MEETS","N/A","N/A",15.3,0]
["Martin Marietta","Bonds Quarry - Concord","2016-09-19","#57 Stone for Electrochemical","CA276",826542,"Pegues, Jr., Henderson",18889,7.7,0,3.9,"MEETS","MEETS","N/A","N/A",3.9,0]
["Martin Marietta","Bonds Quarry - Concord","2016-09-19","#67 Stone for Electrochemical","CA276",826544,"Pegues, Jr., Henderson",20833,7.7,0,2.2999999999999998,"MEETS","MEETS","N/A","N/A",2.2999999999999998,0]
["Martin Marietta","Bonds Quarry - Concord","2016-09-19","#78-M Stone for Electrochemical","CA276",826543,"Pegues, Jr., Henderson",18709,7.7,0,4.4000000000000004,"MEETS","MEETS","N/A","N/A",4.4000000000000004,0]
["Martin Marietta","Statesville Quarry - Statesville","2016-09-09","#57 Stone for Electrochemical","CA54",825451,"Whitley, Christopher D",13848,7.6,0,13,"MEETS","MEETS","N/A","N/A",13,0]
["Martin Marietta","Statesville Quarry - Statesville","2016-09-09","#67 Stone for Electrochemical","CA54",825455,"Whitley, Christopher D",11279,7.7,0,23.9,"MEETS","MEETS","N/A","N/A",23.9,0]
["Martin Marietta","Statesville Quarry - Statesville","2016-09-09","#78-M Stone for Electrochemical","CA54",825458,"Whitley, Christopher D",10212,7.4,0,26.4,"MEETS","MEETS","N/A","N/A",26.4,0]
["Martin Marietta","Charlotte Quarry - Charlotte","2016-09-08","#57 Stone for Electrochemical","CA41",825038,"Adair, Mildred (Millie) L",17937,7.9,0,3.9,"MEETS","MEETS","N/A","N/A",3.9,0]
["Martin Marietta","Charlotte Quarry - Charlotte","2016-09-08","#67 Stone for Electrochemical","CA41",825039,"Adair, Mildred (Millie) L",21882,7.7,0,2.2999999999999998,"MEETS","MEETS","N/A","N/A",2.2999999999999998,0]
["Martin Marietta","Charlotte Quarry - Charlotte","2016-09-08","#78-M Stone for Electrochemical","CA41",825040,"Adair, Mildred (Millie) L",15936,7.6,0,4.0999999999999996,"MEETS","MEETS","N/A","N/A",4.0999999999999996,0]
["Thompson Contractors","Miller Creek Quarry - Rutherfordton","2016-08-18","#57 Stone for Electrochemical","CA59",821705,"Rhymer, Robert C",20678,9.1,0,2.8,"DOES NOT MEET","MEETS","N/A","N/A",2.8,0]
["Martin Marietta","Castle Hayne Quarry - Castle Hayne","2016-08-16","#57 Stone for Electrochemical","CA40",821247,"Cahill, Luke R",4174,8.1999999999999993,4.3,69.2,"MEETS","MEETS","N/A","N/A",69.2,4.3]
["Martin Marietta","Castle Hayne Yard - Castle Hayne","2016-08-16","#57 Stone for Electrochemical","CA319",821246,"Cahill, Luke R",20125,9.3000000000000007,0,3.8,{"$f":"IF(AND(4.5 <= $I450, $I450 <= 9), \"MEETS\", \"DOES NOT MEET\")","v":"DOES NOT MEET"},{"$f":"IF(AND(5 <= $I450, $I450 <= 10), \"MEETS\", \"DOES NOT MEET\")","v":"MEETS"},{"$f":"IF(OR(ISBLANK(H450), NOT(ISNUMBER(MATCH($E450, Coastal,0)))), \"N/A\", IF(AND(4.5 <= $I450, $I450 <= 9),IF($H450>=5000,IF($Q450<=100,IF($P450<=200,\"MEETS\",\"DOES NOT MEET\"),\"DOES NOT MEET\"),\"DOES NOT MEET\"),\"DOES NOT MEET\"))","v":"DOES NOT MEET"},{"$f":"IF(OR(ISBLANK(I450), NOT(ISNUMBER(MATCH($E450, Coastal, 0)))), \"N/A\", IF(AND(5 <= $I450, $I450 <= 10),IF($H450>=5000,IF($Q450<=100,IF($P450<=200,\"MEETS\",\"DOES NOT MEET\"),\"DOES NOT MEET\"),\"DOES NOT MEET\"),\"DOES NOT MEET\"))","v":"MEETS"},{"$f":"IF(LEFT(K450, 1)=\"<\", VALUE(RIGHT(K450,LEN(K450)-1)), K450)","v":3.8},{"$f":"IF(LEFT(J450, 1)=\"<\", VALUE(RIGHT(J450,LEN(J450)-1)), J450)","v":0}]
["Rogers Group, Inc.","Henrietta Quarry - Mooresboro","2016-08-15","#57 Stone for Electrochemical","CA369",821774,"Towery, Robby D",24832,7.8,0,3.7,"MEETS","MEETS","N/A","N/A",3.7,0]
["Martin Marietta","Clarks Quarry - New Bern","2016-08-03","#67 Stone for Electrochemical","CA189",819246,"Maynard, William BJ T",4431,8,0,60.6,"MEETS","MEETS","DOES NOT MEET","DOES NOT MEET",60.6,0]
["Salem Stone Corp.","Cardinal Quarries - Smethport Quarry - W. Jefferson","2016-08-02","#57 Stone for Electrochemical","CA123",819961,"Church, Tracy G",14002,9.1999999999999993,0,17.3,"DOES NOT MEET","MEETS","N/A","N/A",17.3,0]
["Salem Stone Corp.","Cardinal Quarries - Smethport Quarry - W. Jefferson","2016-08-02","#78-M Stone for Electrochemical","CA123",819962,"Church, Tracy G",7502,8.6999999999999993,0,40.200000000000003,"MEETS","MEETS","N/A","N/A",40.200000000000003,0]
["Vulcan Materials Co.","115 Quarry - N. Wilkesboro","2016-07-29","#57 Stone for Electrochemical","CA79",819485,"Whitley, Christopher D",14470,9.1999999999999993,0,15.9,"DOES NOT MEET","MEETS","N/A","N/A",15.9,0]
["Vulcan Materials Co.","115 Quarry - N. Wilkesboro","2016-07-29","#67 Stone for Electrochemical","CA79",819513,"Whitley, Christopher D",7746,8.6999999999999993,0,40.9,"MEETS","MEETS","N/A","N/A",40.9,0]
["Vulcan Materials Co.","115 Quarry - N. Wilkesboro","2016-07-29","#78-M Stone for Electrochemical","CA79",819580,"Whitley, Christopher D",10981,9.1999999999999993,0,24.7,"DOES NOT MEET","MEETS","N/A","N/A",24.7,0]
["Harrison Construction Co., Inc.","Hayesville Quarry - Hayesville","2016-07-15","#57 Stone for Electrochemical","CA195",816317,"Ledford, Brandon S",17449,8.8000000000000007,2.1,28.9,"MEETS","MEETS","N/A","N/A",28.9,2.1]
["Harrison Construction Co., Inc.","Hayesville Quarry - Hayesville","2016-07-15","#78-M Stone for Electrochemical","CA195",816298,"Ledford, Brandon S",8467,8.6999999999999993,2.1,28.4,"MEETS","MEETS","N/A","N/A",28.4,2.1]
["Vulcan Materials Co.","Lenior Quarry - Lenoir","2016-06-24","#57 Stone for Electrochemical","CA91",815305,"Church, Tracy G",18751,9.1999999999999993,2.1,15,"DOES NOT MEET","MEETS","N/A","N/A",15,2.1]
["Vulcan Materials Co.","Lenior Quarry - Lenoir","2016-06-24","#78-M Stone for Electrochemical","CA91",815307,"Church, Tracy G",17443,9.1999999999999993,2.1,15.3,"DOES NOT MEET","MEETS","N/A","N/A",15.3,2.1]
["Martin Marietta","Asheboro Quarry - Asheboro","2016-06-17","#57 Stone for Electrochemical","CA30",811640,"Tucker, Rusty J",19387,9,2.1,12,"MEETS","MEETS","N/A","N/A",12,2.1]
["Martin Marietta","Asheboro Quarry - Asheboro","2016-06-17","#67 Stone for Electrochemical","CA30",811641,"Tucker, Rusty J",22594,9,2.1,6.6,"MEETS","MEETS","N/A","N/A",6.6,2.1]
["Martin Marietta","Asheboro Quarry - Asheboro","2016-06-17","#78-M Stone for Electrochemical","CA30",811642,"Tucker, Rusty J",18650,8.6999999999999993,2.1,21.5,"MEETS","MEETS","N/A","N/A",21.5,2.1]
["Vulcan Materials Co.","Penrose Quarry - Pisgah Forest","2016-06-14","#57 Stone for Electrochemical","CA12",811081,"Wood, Dean Michael M",24213,9.1999999999999993,2.1,0.8,"DOES NOT MEET","MEETS","N/A","N/A",0.8,2.1]
["Vulcan Materials Co.","Penrose Quarry - Pisgah Forest","2016-06-14","#78-M Stone for Electrochemical","CA12",811085,"Wood, Dean Michael M",23354,9,2.1,0.5,"MEETS","MEETS","N/A","N/A",0.5,2.1]
["Vulcan Materials Co.","Rockingham Quarry - Rockingham","2016-06-09","#57 Stone for Electrochemical","CA94",810587,"Tucker, Rusty J",18142,9.3000000000000007,2.1,11.2,"DOES NOT MEET","MEETS","N/A","N/A",11.2,2.1]
["Vulcan Materials Co.","Rockingham Quarry - Rockingham","2016-06-09","#67 Stone for Electrochemical","CA94",810585,"Tucker, Rusty J",16748,9.3000000000000007,2.1,10.199999999999999,"DOES NOT MEET","MEETS","N/A","N/A",10.199999999999999,2.1]
["Vulcan Materials Co.","Rockingham Quarry - Rockingham","2016-06-09","#78-M Stone for Electrochemical","CA94",810584,"Tucker, Rusty J",12031,9.4,2.1,12.7,"DOES NOT MEET","MEETS","N/A","N/A",12.7,2.1]
["Mathis Quarries, Inc.","Mathis Quarry","2016-05-24","#57 Stone for Electrochemical","CA359",808610,"Whitley, Christopher D",17176,9.1,4.3,17.3,"DOES NOT MEET","MEETS","N/A","N/A",17.3,4.3]
["LBM Industries","Whitewater Falls Quarry - Sapphire","2016-05-24","#57 Stone for Electrochemical","CA119",808244,"Wood, Dean Michael M",23987,7.8,2.1,13.6,"MEETS","MEETS","N/A","N/A",13.6,2.1]
["LBM Industries","Whitewater Falls Quarry - Sapphire","2016-05-24","#78-M Stone for Electrochemical","CA119",808249,"Wood, Dean Michael M",16584,7.7,2.1,12.6,"MEETS","MEETS","N/A","N/A",12.6,2.1]
["J.T. Russell & Sons, Inc.","Troy Sales Yard","2016-05-19","#57 Stone for Electrochemical","CA403",807584,"Tucker, Rusty J",72098,7.4,0,5.3,"MEETS","MEETS","N/A","N/A",5.3,0]
["Martin Marietta","Thomasville Quarry - Thomasville","2016-05-02","#78-M Stone for Electrochemical","CA102",800404,"Wallace, Weston G",18477,9.4,4.3,10.199999999999999,"DOES NOT MEET","MEETS","N/A","N/A",10.199999999999999,4.3]
["Vulcan Materials Co.","Smith Grove Q. - Mocksville","2016-04-26","#57 Stone for Electrochemical","CA80",803857,"Wallace, Weston G",22007,8.1,0,7.1,"MEETS","MEETS","N/A","N/A",7.1,0]
["Vulcan Materials Co.","Smith Grove Q. - Mocksville","2016-04-26","#78-M Stone for Electrochemical","CA80",803858,"Wallace, Weston G",20838,8.5,0,11.7,"MEETS","MEETS","N/A","N/A",11.7,0]
["Vulcan Materials Co.","Morganton Quarry - Morganton","2016-04-21","#67 Stone for Electrochemical","CA7",803453,"Ausley, Jeff A",22386,7.6,0,6.6,"MEETS","MEETS","N/A","N/A",6.6,0]
["Vulcan Materials Co.","Morganton Quarry - Morganton","2016-04-21","#78-M Stone for Electrochemical","CA7",803457,"Ausley, Jeff A",13410,8.6,0,16.7,"MEETS","MEETS","N/A","N/A",16.7,0]
["Martin Marietta","Charlotte Quarry - Charlotte","2016-04-14","#57 Stone for Electrochemical","CA41",802303,"Adair, Mildred (Millie) L",21124,8.8000000000000007,0,6.2,"MEETS","MEETS","N/A","N/A",6.2,0]
["Martin Marietta","Charlotte Quarry - Charlotte","2016-04-14","#78-M Stone for Electrochemical","CA41",802306,"Adair, Mildred (Millie) L",17123,8.4,0,10.7,"MEETS","MEETS","N/A","N/A",10.7,0]
["Hanson Aggregates Southeast, Inc.","Rocky Mount Quarry (#2)","2016-04-14","#57 Stone for Electrochemical","CA371",802197,"Raines, James R",43346,7.9,0,0,"MEETS","MEETS","MEETS","MEETS",0,0]
["Hanson Aggregates Southeast, Inc.","Rocky Mount Quarry (#2)","2016-04-14","#78-M Stone for Electrochemical","CA371",802198,"Raines, James R",10244,9.3000000000000007,0,62.7,"DOES NOT MEET","MEETS","DOES NOT MEET","MEETS",62.7,0]
["Hedrick Industries","Grove Stone Quarry - Black Mountain","2016-04-08","#67 Stone for Electrochemical","CA146",801531,"Rhymer, Robert C",11593,7,0,21,"MEETS","MEETS","N/A","N/A",21,0]
["Hedrick Industries","Grove Stone Quarry - Black Mountain","2016-04-08","#78-M Stone for Electrochemical","CA146",801532,"Rhymer, Robert C",6964,7.3,0,49.1,"MEETS","MEETS","N/A","N/A",49.1,0]
["Appalachian Aggregates, LLC","Bluefield Plant","2016-04-05","#57 Stone for Electrochemical","CA307",800733,"Whitley, Christopher D",21432,8.4,0,4.5,"MEETS","MEETS","N/A","N/A",4.5,0]
["Luck Stone Corporation","Pittsboro Quarry - Moncure","2016-03-29","#57 Stone for Electrochemical","CA292",799654,"Jackson, Brandon M",16218,7.6,0,7.7,"MEETS","MEETS","N/A","N/A",7.7,0]
["Luck Stone Corporation","Pittsboro Quarry - Moncure","2016-03-29","#67 Stone for Electrochemical","CA292",799656,"Jackson, Brandon M",20833,8.6,0,6.1,"MEETS","MEETS","N/A","N/A",6.1,0]
["Luck Stone Corporation","Pittsboro Quarry - Moncure","2016-03-29","#78-M Stone for Electrochemical","CA292",799662,"Jackson, Brandon M",13873,7.9,0,11.3,"MEETS","MEETS","N/A","N/A",11.3,0]
["Hanson Aggregates Southeast, Inc.","Princeton Quarry","2016-03-24","#57 Stone for Electrochemical","CA64",799116,"Raines, James R",13717,7.6,0,4.0999999999999996,"MEETS","MEETS","MEETS","MEETS",4.0999999999999996,0]
["Hanson Aggregates Southeast, Inc.","Princeton Quarry","2016-03-24","#78-M Stone for Electrochemical","CA64",799117,"Raines, James R",13463,7.7,0,5.7,"MEETS","MEETS","MEETS","MEETS",5.7,0]
["Vulcan Materials Co.","North Quarry - Winston Salem","2016-03-23","#57 Stone for Electrochemical","CA72",798936,"Wallace, Weston G",29586,7.8,0,113.8,"MEETS","MEETS","N/A","N/A",113.8,0]
["Vulcan Materials Co.","North Quarry - Winston Salem","2016-03-23","#78-M Stone for Electrochemical","CA72",798939,"Wallace, Weston G",20812,7.5,0,7.7,"MEETS","MEETS","N/A","N/A",7.7,0]
["Martin Marietta","Thomasville Quarry - Thomasville","2016-03-22","#57 Stone for Electrochemical","CA102",798932,"Wallace, Weston G",11218,7.9,0,20.2,"MEETS","MEETS","N/A","N/A",20.2,0]
["Martin Marietta","Benson Quarry - Benson","2016-03-16","#57 Stone for Electrochemical","CA176",798243,"Raines, James R",27917,7.7,0,0,"MEETS","MEETS","N/A","N/A",0,0]
["Martin Marietta","Benson Quarry - Benson","2016-03-16","#78-M Stone for Electrochemical","CA176",798244,"Raines, James R",20585,8.3000000000000007,0,4.3,"MEETS","MEETS","N/A","N/A",4.3,0]
["Hanson Aggregates Southeast, Inc.","Neverson Quarry - Sims","2016-03-15","#57 Stone for Electrochemical","CA66",798232,"Raines, James R",22080,7.7,0,5.8,"MEETS","MEETS","N/A","N/A",5.8,0]
["Hanson Aggregates Southeast, Inc.","Neverson Quarry - Sims","2016-03-15","#78-M Stone for Electrochemical","CA66",798233,"Raines, James R",23288,7.4,0,4.5999999999999996,"MEETS","MEETS","N/A","N/A",4.5999999999999996,0]
["Boxley Materials Company","Lawyers Road Quarry - Lynchburg, VA","2016-03-14","#78-M Stone for Electrochemical","CA400",798420,"Fosque, Robert W",17065,7.6,0,9.5,"MEETS","MEETS","N/A","N/A",9.5,0]
["Wake Stone Corp.","Nash County Quarry - Battleboro","2016-03-11","#57 Stone for Electrochemical","CA223",797386,"Raines, James R",24746,8,0,4.5,"MEETS","MEETS","N/A","N/A",4.5,0]
["Wake Stone Corp.","Nash County Quarry - Battleboro","2016-03-11","#78-M Stone for Electrochemical","CA223",797387,"Raines, James R",18450,7.6,0,8.5,"MEETS","MEETS","N/A","N/A",8.5,0]
["NC Granite Corp.","Mount Airy Quarry","2016-03-08","#57 Stone for Electrochemical","CA24",797321,"Whitley, Christopher D",24913,7.8,0,6,"MEETS","MEETS","N/A","N/A",6,0]
["NC Granite Corp.","Mount Airy Quarry","2016-03-08","#78-M Stone for Electrochemical","CA24",797325,"Whitley, Christopher D",23436,7.9,0,5.2,"MEETS","MEETS","N/A","N/A",5.2,0]
["Salem Stone Corp.","Cardinal Realty - Galax Quarry - Galax, VA","2016-03-07","#57 Stone for Electrochemical","CA11",797284,"Whitley, Christopher D",14977,7.8,0,5.6,"MEETS","MEETS","N/A","N/A",5.6,0]
["Salem Stone Corp.","Cardinal Realty - Galax Quarry - Galax, VA","2016-03-07","#78-M Stone for Electrochemical","CA11",797287,"Whitley, Christopher D",12880,9.1999999999999993,0,5.5,"DOES NOT MEET","MEETS","N/A","N/A",5.5,0]
["Vulcan Materials Co.","Stokesdale Quarry - Stokesdale","2016-03-03","#57 Stone for Electrochemical","CA76",796400,"Fosque, Robert W",28769,8.8000000000000007,0,4.5,"MEETS","MEETS","N/A","N/A",4.5,0]
["Vulcan Materials Co.","Stokesdale Quarry - Stokesdale","2016-03-03","#67 Stone for Electrochemical","CA76",796398,"Fosque, Robert W",24600,9,0,5.0999999999999996,"MEETS","MEETS","N/A","N/A",5.0999999999999996,0]
["Vulcan Materials Co.","Stokesdale Quarry - Stokesdale","2016-03-03","#78-M Stone for Electrochemical","CA76",796401,"Fosque, Robert W",23635,8.4,0,6,"MEETS","MEETS","N/A","N/A",6,0]
["Martin Marietta","American Stone - Carrboro","2016-03-02","#57 Stone for Electrochemical","CA2",795851,"Fosque, Robert W",22989,8.9,0,4,"MEETS","MEETS","N/A","N/A",4,0]
["Martin Marietta","American Stone - Carrboro","2016-03-02","#67 Stone for Electrochemical","CA2",795848,"Fosque, Robert W",25170,8.9,0,4.0999999999999996,"MEETS","MEETS","N/A","N/A",4.0999999999999996,0]
["Martin Marietta","American Stone - Carrboro","2016-03-02","#78-M Stone for Electrochemical","CA2",795847,"Fosque, Robert W",23496,7.7,0,4.8,"MEETS","MEETS","N/A","N/A",4.8,0]
["Ararat Rock Products","Mt. Airy Quarry - Mt. Airy","2016-03-01","#78-M Stone for Electrochemical","CA3",795846,"Whitley, Christopher D",15858,7.9,0,10.1,"MEETS","MEETS","N/A","N/A",10.1,0]
["Martin Marietta","Burlington Quarry - Burlington","2016-02-29","#57 Stone for Electrochemical","CA39",795917,"Loshinskiy, Roman",18420,8.9,0,4,"MEETS","MEETS","N/A","N/A",4,0]
["Martin Marietta","Burlington Quarry - Burlington","2016-02-29","#78-M Stone for Electrochemical","CA39",795919,"Loshinskiy, Roman",15755,8.6,0,8.5,"MEETS","MEETS","N/A","N/A",8.5,0]
["Hanson Aggregates Southeast, Inc.","Holly Springs Quarry","2016-02-26","#57 Stone for Electrochemical","CA282",795303,"Skinner, III, John L",24313,8.1999999999999993,0,4.0999999999999996,{"$f":"IF(AND(4.5 <= $I514, $I514 <= 9), \"MEETS\", \"DOES NOT MEET\")","v":"MEETS"},{"$f":"IF(AND(5 <= $I514, $I514 <= 10), \"MEETS\", \"DOES NOT MEET\")","v":"MEETS"},{"$f":"IF(OR(ISBLANK(H514), NOT(ISNUMBER(MATCH($E514, Coastal,0)))), \"N/A\", IF(AND(4.5 <= $I514, $I514 <= 9),IF($H514>=5000,IF($Q514<=100,IF($P514<=200,\"MEETS\",\"DOES NOT MEET\"),\"DOES NOT MEET\"),\"DOES NOT MEET\"),\"DOES NOT MEET\"))","v":"N/A"},{"$f":"IF(OR(ISBLANK(I514), NOT(ISNUMBER(MATCH($E514, Coastal, 0)))), \"N/A\", IF(AND(5 <= $I514, $I514 <= 10),IF($H514>=5000,IF($Q514<=100,IF($P514<=200,\"MEETS\",\"DOES NOT MEET\"),\"DOES NOT MEET\"),\"DOES NOT MEET\"),\"DOES NOT MEET\"))","v":"N/A"},{"$f":"IF(LEFT(K514, 1)=\"<\", VALUE(RIGHT(K514,LEN(K514)-1)), K514)","v":4.0999999999999996},{"$f":"IF(LEFT(J514, 1)=\"<\", VALUE(RIGHT(J514,LEN(J514)-1)), J514)","v":0}]
["Hanson Aggregates Southeast, Inc.","Holly Springs Quarry","2016-02-26","#78-M Stone for Electrochemical","CA282",795305,"Skinner, III, John L",19585,8.6,0,5.3,"MEETS","MEETS","N/A","N/A",5.3,0]
["Martin Marietta","Arrowood Quarry - Charlotte","2016-02-24","#57 Stone for Electrochemical","CA31",796031,"Adair, Mildred (Millie) L",22826,7.7,0,9.6999999999999993,"MEETS","MEETS","N/A","N/A",9.6999999999999993,0]
["Martin Marietta","Arrowood Quarry - Charlotte","2016-02-24","#67 Stone for Electrochemical","CA31",796029,"Adair, Mildred (Millie) L",16639,7.6,0,11.2,"MEETS","MEETS","N/A","N/A",11.2,0]
["Martin Marietta","Arrowood Quarry - Charlotte","2016-02-24","#78-M Stone for Electrochemical","CA31",796030,"Adair, Mildred (Millie) L",19139,7.7,0,10.199999999999999,"MEETS","MEETS","N/A","N/A",10.199999999999999,0]
["Vulcan Materials Co.","Pineville Quarry - Charlotte","2016-02-24","#67 Stone for Electrochemical","CA101",796025,"Adair, Mildred (Millie) L",19395,7.7,0,8.3000000000000007,"MEETS","MEETS","N/A","N/A",8.3000000000000007,0]
["Vulcan Materials Co.","Pineville Quarry - Charlotte","2016-02-24","#78-M Stone for Electrochemical","CA101",796026,"Adair, Mildred (Millie) L",12945,7.5,5.4,15.5,"MEETS","MEETS","N/A","N/A",15.5,5.4]
["Vulcan Materials Co.","Clear Creek Q. - Charlotte","2016-02-22","#67 Stone for Electrochemical","CA249",794809,"Pegues, Jr., Henderson",27533,8.8000000000000007,0,4.5999999999999996,"MEETS","MEETS","N/A","N/A",4.5999999999999996,0]
["Vulcan Materials Co.","Clear Creek Q. - Charlotte","2016-02-22","#78-M Stone for Electrochemical","CA249",794810,"Pegues, Jr., Henderson",21487,9.1,0,6.2,"DOES NOT MEET","MEETS","N/A","N/A",6.2,0]
["Martin Marietta","Mallard Creek Quarry - Charlotte","2016-02-22","#57 Stone for Electrochemical","CA188",794798,"Pegues, Jr., Henderson",23987,9.1,0,4.5,"DOES NOT MEET","MEETS","N/A","N/A",4.5,0]
["Martin Marietta","Mallard Creek Quarry - Charlotte","2016-02-22","#67 Stone for Electrochemical","CA188",794806,"Pegues, Jr., Henderson",26399,9.1,0,4.0999999999999996,"DOES NOT MEET","MEETS","N/A","N/A",4.0999999999999996,0]
["Martin Marietta","Mallard Creek Quarry - Charlotte","2016-02-22","#78-M Stone for Electrochemical","CA188",794807,"Pegues, Jr., Henderson",26274,8.9,5.4,4.0999999999999996,"MEETS","MEETS","N/A","N/A",4.0999999999999996,5.4]
["Hanson Aggregates Southeast, Inc.","Crabtree Quarry - Raleigh","2016-02-19","#57 Stone for Electrochemical","CA61",794467,"Skinner, III, John L",24396,7.9,0,3.8,"MEETS","MEETS","N/A","N/A",3.8,0]
["Hanson Aggregates Southeast, Inc.","Crabtree Quarry - Raleigh","2016-02-19","#78-M Stone for Electrochemical","CA61",794468,"Skinner, III, John L",17966,8.1,0,4.0999999999999996,"MEETS","MEETS","N/A","N/A",4.0999999999999996,0]
["Martin Marietta","Fountain Quarry - Fountain","2016-02-19","#57 Stone for Electrochemical","CA42",794449,"Cobb, James R",25304,8.5,0,0,"MEETS","MEETS","MEETS","MEETS",0,0]
["Martin Marietta","Fountain Quarry - Fountain","2016-02-19","#78-M Stone for Electrochemical","CA42",794440,"Cobb, James R",10144,8.1999999999999993,0,0,"MEETS","MEETS","MEETS","MEETS",0,0]
["Rogers Group, Inc.","Henrietta Quarry - Mooresboro","2016-02-19","#57 Stone for Electrochemical","CA369",794432,"Rhymer, Robert C",24845,7.8,0,4.2,"MEETS","MEETS","N/A","N/A",4.2,0]
["Rogers Group, Inc.","Henrietta Quarry - Mooresboro","2016-02-19","#78-M Stone for Electrochemical","CA369",794434,"Rhymer, Robert C",23618,8.1999999999999993,0,4.0999999999999996,"MEETS","MEETS","N/A","N/A",4.0999999999999996,0]
["Martin Marietta","Lemon Springs - Sanford","2016-02-19","#57 Stone for Electrochemical","CA97",794469,"Jackson, Brandon M",27716,8.6999999999999993,0,4,"MEETS","MEETS","N/A","N/A",4,0]
["Martin Marietta","Lemon Springs - Sanford","2016-02-19","#67 Stone for Electrochemical","CA97",794474,"Jackson, Brandon M",25608,8.6,0,0,"MEETS","MEETS","N/A","N/A",0,0]
["Martin Marietta","Lemon Springs - Sanford","2016-02-19","#78-M Stone for Electrochemical","CA97",794477,"Jackson, Brandon M",22188,8.6999999999999993,0,0,"MEETS","MEETS","N/A","N/A",0,0]
["Hanson Aggregates Southeast, Inc.","Marlboro Plant - Bennettsville","2016-02-19","#67 Stone for Electrochemical","CA34",794733,"Jordan, Daniel H",186567,5.0999999999999996,0,4.5,"MEETS","MEETS","N/A","N/A",4.5,0]
["Hanson Aggregates Southeast, Inc.","Marlboro Plant - Bennettsville","2016-02-19","#78-M Stone for Electrochemical","CA34",794732,"Jordan, Daniel H",226552,6,0,4,"MEETS","MEETS","N/A","N/A",4,0]
["Boxley Materials Company","Fieldale Quarry - Martinsville, VA","2016-02-17","#57 Stone for Electrochemical","CA142",794069,"Westmoreland, Braxton J",15154,8.3000000000000007,5.4,12.7,"MEETS","MEETS","N/A","N/A",12.7,5.4]
["Boxley Materials Company","Fieldale Quarry - Martinsville, VA","2016-02-17","#78-M Stone for Electrochemical","CA142",794068,"Westmoreland, Braxton J",23105,8.9,0,6.1,"MEETS","MEETS","N/A","N/A",6.1,0]
["Salem Stone Corp.","Southside Materials - Shelton Quarry - Pelham","2016-02-17","#57 Stone for Electrochemical","CA75",794123,"Loshinskiy, Roman",31201,8.6,0,4.8,"MEETS","MEETS","N/A","N/A",4.8,0]
["Salem Stone Corp.","Southside Materials - Shelton Quarry - Pelham","2016-02-17","#78-M Stone for Electrochemical","CA75",794124,"Loshinskiy, Roman",48780,7.3,0,5,"MEETS","MEETS","N/A","N/A",5,0]
["Martin Marietta","Central Rock Quarry - Greensboro","2016-02-16","#57 Stone for Electrochemical","CA28",793947,"Westmoreland, Braxton J",27322,8.8000000000000007,5.4,6.3,"MEETS","MEETS","N/A","N/A",6.3,5.4]
["Martin Marietta","Central Rock Quarry - Greensboro","2016-02-16","#78-M Stone for Electrochemical","CA28",793945,"Westmoreland, Braxton J",13635,8.4,0,10.1,"MEETS","MEETS","N/A","N/A",10.1,0]
["Hanson Aggregates Southeast, Inc.","Rougemont Quarry","2016-02-16","#57 Stone for Electrochemical","CA217",793930,"Skinner, III, John L",29940,9.4,5,8.3000000000000007,"DOES NOT MEET","MEETS","N/A","N/A",8.3000000000000007,5]
["Hanson Aggregates Southeast, Inc.","Rougemont Quarry","2016-02-16","#78-M Stone for Electrochemical","CA217",793932,"Skinner, III, John L",26378,7.8,0,3.7,"MEETS","MEETS","N/A","N/A",3.7,0]
["Martin Marietta","Franklin Quarry - Franklinton","2016-02-12","#57 Stone for Electrochemical","CA270",793723,"Skinner, III, John L",26652,9.1999999999999993,0,4.4000000000000004,"DOES NOT MEET","MEETS","N/A","N/A",4.4000000000000004,0]
["Martin Marietta","Franklin Quarry - Franklinton","2016-02-12","#78-M Stone for Electrochemical","CA270",793725,"Skinner, III, John L",38926,7.7,0,4.5,"MEETS","MEETS","N/A","N/A",4.5,0]
["Hanson Aggregates Southeast, Inc.","Raleigh Quarry - Wake Forest","2016-02-12","#57 Stone for Electrochemical","CA67",793719,"Skinner, III, John L",27071,9.1999999999999993,0,4.8,"DOES NOT MEET","MEETS","N/A","N/A",4.8,0]
["Hanson Aggregates Southeast, Inc.","Raleigh Quarry - Wake Forest","2016-02-12","#78-M Stone for Electrochemical","CA67",793720,"Skinner, III, John L",25927,7.7,0,4.0999999999999996,"MEETS","MEETS","N/A","N/A",4.0999999999999996,0]
["Wake Stone Corp.","Triangle Quarry - Cary","2016-02-12","#57 Stone for Electrochemical","CA157",793925,"Skinner, III, John L",24631,7.7,5,4,"MEETS","MEETS","N/A","N/A",4,5]
["Wake Stone Corp.","Triangle Quarry - Cary","2016-02-12","#78-M Stone for Electrochemical","CA157",793927,"Skinner, III, John L",21538,9.1,0,4.4000000000000004,"DOES NOT MEET","MEETS","N/A","N/A",4.4000000000000004,0]
["Martin Marietta","Fuquay Quarry - Fuquay-Varina","2016-02-11","#57 Stone for Electrochemical","CA220",793622,"Skinner, III, John L",53591,7.4,0,4.0999999999999996,"MEETS","MEETS","N/A","N/A",4.0999999999999996,0]
["Martin Marietta","Fuquay Quarry - Fuquay-Varina","2016-02-11","#78-M Stone for Electrochemical","CA220",793623,"Skinner, III, John L",33179,7.7,0,4.0999999999999996,"MEETS","MEETS","N/A","N/A",4.0999999999999996,0]
["Georgia Stone Products","Lynches River Quarry - Jefferson, SC","2016-02-11","#57 Stone for Electrochemical","CA325",793640,"Jordan, Daniel H",26674,7.1,0,4.7,"MEETS","MEETS","N/A","N/A",4.7,0]
["Georgia Stone Products","Lynches River Quarry - Jefferson, SC","2016-02-11","#67 Stone for Electrochemical","CA325",793641,"Jordan, Daniel H",30057,7.6,5.4,4.8,"MEETS","MEETS","N/A","N/A",4.8,5.4]
["Georgia Stone Products","Lynches River Quarry - Jefferson, SC","2016-02-11","#78-M Stone for Electrochemical","CA325",793642,"Jordan, Daniel H",21959,7.5,0,4.2,"MEETS","MEETS","N/A","N/A",4.2,0]
["Vulcan Materials Co.","Greystone Quarry - Henderson","2016-02-10","#57 Stone for Electrochemical","CA70",793394,"Skinner, III, John L",24225,8.9,0,0,"MEETS","MEETS","N/A","N/A",0,0]
["Vulcan Materials Co.","Greystone Quarry - Henderson","2016-02-10","#78-M Stone for Electrochemical","CA70",793395,"Skinner, III, John L",23719,8.6999999999999993,0,0.8,"MEETS","MEETS","N/A","N/A",0.8,0]
["Vulcan Materials Co.","Skippers Quarry - Skippers, VA","2016-02-10","#67 Stone for Electrochemical","CA55",793423,"Thomas, Grady Q",24384,8.9,0,0,"MEETS","MEETS","MEETS","MEETS",0,0]
["Vulcan Materials Co.","Skippers Quarry - Skippers, VA","2016-02-10","#78-M Stone for Electrochemical","CA55",793424,"Thomas, Grady Q",9311,9.6999999999999993,10,6.5,"DOES NOT MEET","MEETS","DOES NOT MEET","MEETS",6.5,10]
["Ararat Rock Products","Eden Quarry - Eden","2016-02-09","#57 Stone for Electrochemical","CA374",793259,"Westmoreland, Braxton J",14265,8.8000000000000007,0,10.199999999999999,"MEETS","MEETS","N/A","N/A",10.199999999999999,0]
["Ararat Rock Products","Eden Quarry - Eden","2016-02-09","#78-M Stone for Electrochemical","CA374",793258,"Westmoreland, Braxton J",11488,8.6,0,9.6,"MEETS","MEETS","N/A","N/A",9.6,0]
["Martin Marietta","Garner Quarry - Garner","2016-02-09","#67 Stone for Electrochemical","CA57",793217,"Skinner, III, John L",33367,8.1,0,3,"MEETS","MEETS","N/A","N/A",3,0]
["Martin Marietta","Garner Quarry - Garner","2016-02-09","#78-M Stone for Electrochemical","CA57",793218,"Skinner, III, John L",25176,8.4,0,3.5,"MEETS","MEETS","N/A","N/A",3.5,0]
["Wake Stone Corp.","Knightdale Quarry - Knightdale","2016-02-09","#57 Stone for Electrochemical","CA98",793146,"Skinner, III, John L",23463,8.9,0,0.9,"MEETS","MEETS","N/A","N/A",0.9,0]
["Wake Stone Corp.","Knightdale Quarry - Knightdale","2016-02-09","#78-M Stone for Electrochemical","CA98",793147,"Skinner, III, John L",26738,8.6,0,3.4,"MEETS","MEETS","N/A","N/A",3.4,0]
["Martin Marietta","Reidsville Quarry - Reidsville","2016-02-09","#57 Stone for Electrochemical","CA52",793249,"Loshinskiy, Roman",21400,8.9,0,4.4000000000000004,"MEETS","MEETS","N/A","N/A",4.4000000000000004,0]
["Martin Marietta","Reidsville Quarry - Reidsville","2016-02-09","#78-M Stone for Electrochemical","CA52",793250,"Loshinskiy, Roman",21487,9.3000000000000007,0,4.4000000000000004,"DOES NOT MEET","MEETS","N/A","N/A",4.4000000000000004,0]
["Radford Quarries Of Boone, Inc.","Bamboo Quarry","2016-02-08","#57 Stone for Electrochemical","CA122",793016,"Church, Tracy G",19073,7.4,0,6.7,"MEETS","MEETS","N/A","N/A",6.7,0]
["Radford Quarries Of Boone, Inc.","Bamboo Quarry","2016-02-08","#78-M Stone for Electrochemical","CA122",793017,"Church, Tracy G",20687,7.5,5,5.2,"MEETS","MEETS","N/A","N/A",5.2,5]
["Carolina Sunrock LLC","Butner Quarry - Butner","2016-02-08","#57 Stone for Electrochemical","CA178",793015,"Skinner, III, John L",19697,9.1999999999999993,0,0,"DOES NOT MEET","MEETS","N/A","N/A",0,0]
["Carolina Sunrock LLC","Butner Quarry - Butner","2016-02-08","#78-M Stone for Electrochemical","CA178",793014,"Skinner, III, John L",13416,9.6,0,0,"DOES NOT MEET","MEETS","N/A","N/A",0,0]
["Martin Marietta","East Alamance Sales Yard","2016-02-08","#57 Stone for Electrochemical","CA377",793260,"Westmoreland, Braxton J",19350,7,5,11.1,"MEETS","MEETS","N/A","N/A",11.1,5]
["Martin Marietta","East Alamance Sales Yard","2016-02-08","#78-M Stone for Electrochemical","CA377",793261,"Westmoreland, Braxton J",15330,8.3000000000000007,5,9.4,"MEETS","MEETS","N/A","N/A",9.4,5]
["Martin Marietta","Raleigh-Durham Quarry - Raleigh","2016-02-05","#57 Stone for Electrochemical","CA156",792800,"Skinner, III, John L",22894,8.9,5,28.2,"MEETS","MEETS","N/A","N/A",28.2,5]
["Martin Marietta","Raleigh-Durham Quarry - Raleigh","2016-02-05","#78-M Stone for Electrochemical","CA156",792801,"Skinner, III, John L",19080,8.6999999999999993,5,34.200000000000003,"MEETS","MEETS","N/A","N/A",34.200000000000003,5]
["Carolina Sunrock LLC","Kittrell Quarry - Kittrell","2016-02-04","#57 Stone for Electrochemical","CA304",792553,"Skinner, III, John L",20044,8.6,5,33.1,"MEETS","MEETS","N/A","N/A",33.1,5]
["Carolina Sunrock LLC","Kittrell Quarry - Kittrell","2016-02-04","#78-M Stone for Electrochemical","CA304",792558,"Skinner, III, John L",18392,8.6,5,36,"MEETS","MEETS","N/A","N/A",36,5]
["Martin Marietta","Pomona Quarry - Greensboro","2016-02-04","#57 Stone for Electrochemical","CA51",792599,"Westmoreland, Braxton J",14000,8.8000000000000007,0,48.5,{"$f":"IF(AND(4.5 <= $I578, $I578 <= 9), \"MEETS\", \"DOES NOT MEET\")","v":"MEETS"},{"$f":"IF(AND(5 <= $I578, $I578 <= 10), \"MEETS\", \"DOES NOT MEET\")","v":"MEETS"},{"$f":"IF(OR(ISBLANK(H578), NOT(ISNUMBER(MATCH($E578, Coastal,0)))), \"N/A\", IF(AND(4.5 <= $I578, $I578 <= 9),IF($H578>=5000,IF($Q578<=100,IF($P578<=200,\"MEETS\",\"DOES NOT MEET\"),\"DOES NOT MEET\"),\"DOES NOT MEET\"),\"DOES NOT MEET\"))","v":"N/A"},{"$f":"IF(OR(ISBLANK(I578), NOT(ISNUMBER(MATCH($E578, Coastal, 0)))), \"N/A\", IF(AND(5 <= $I578, $I578 <= 10),IF($H578>=5000,IF($Q578<=100,IF($P578<=200,\"MEETS\",\"DOES NOT MEET\"),\"DOES NOT MEET\"),\"DOES NOT MEET\"),\"DOES NOT MEET\"))","v":"N/A"},{"$f":"IF(LEFT(K578, 1)=\"<\", VALUE(RIGHT(K578,LEN(K578)-1)), K578)","v":48.5},{"$f":"IF(LEFT(J578, 1)=\"<\", VALUE(RIGHT(J578,LEN(J578)-1)), J578)","v":0}]
["Martin Marietta","Pomona Quarry - Greensboro","2016-02-04","#78-M Stone for Electrochemical","CA51",792600,"Westmoreland, Braxton J",23218,9.1,5,28.8,"DOES NOT MEET","MEETS","N/A","N/A",28.8,5]
["Hedrick Industries","South McDowell Quarry - Marion","2016-01-29","#57 Stone for Electrochemical","CA283",791780,"Rhymer, Robert C",26364,7.6,5,5.3,"MEETS","MEETS","N/A","N/A",5.3,5]
["Hedrick Industries","South McDowell Quarry - Marion","2016-01-29","#78-M Stone for Electrochemical","CA283",791781,"Rhymer, Robert C",22994,7.6,0,7.5,"MEETS","MEETS","N/A","N/A",7.5,0]
["Ararat Rock Products","Mt. Airy Quarry - Mt. Airy","2016-01-11","#57 Stone for Electrochemical","CA3",790443,"Whitley, Christopher D",14205,8.6,10,0,"MEETS","MEETS","N/A","N/A",0,10]
["Martin Marietta","Belgrade Quarry - Maysville","2015-09-30","#78-M Stone for Electrochemical","CA38",778061,"Cahill, Luke R",3370,7.3,0,0,"MEETS","MEETS","DOES NOT MEET","DOES NOT MEET",0,0]
["Martin Marietta","Onslow Quarry - Richlands","2015-09-30","#57 Stone for Electrochemical","CA259",778060,"Cahill, Luke R",4480,6.8,0,0,"MEETS","MEETS","DOES NOT MEET","DOES NOT MEET",0,0]
["Martin Marietta","Fountain Quarry - Fountain","2015-09-28","#57 Stone for Electrochemical","CA42",777688,"Cobb, James R",15179,9,0,0,"MEETS","MEETS","MEETS","MEETS",0,0]
["Martin Marietta","Clarks Quarry - New Bern","2015-09-10","#67 Stone for Electrochemical","CA189",775400,"Maynard, William BJ T",2465,7.2,null,300,"MEETS","MEETS","DOES NOT MEET","DOES NOT MEET",300,0]
["Martin Marietta","Woodleaf Quarry - Salisbury","2015-08-20","#78-M Stone for Electrochemical","CA56",771927,"McLain Jr, Raeford L",23186,8.9,0,0,"MEETS","MEETS","N/A","N/A",0,0]
["Rogers Group, Inc.","Mitchell County Stone","2015-07-22","Select Material, Class VI","CA315",767763,"Radcliff, Roger Keith",50865,7.2,0,0,"MEETS","MEETS","N/A","N/A",0,0]
["Vulcan Materials Co.","Spruce Pine Quarry - Bakersville","2015-07-22","Select Material, Class VI","CA111",767762,"Radcliff, Roger Keith",25374,8.1999999999999993,0,0,"MEETS","MEETS","N/A","N/A",0,0]
["Martin Marietta","Clarks Quarry - New Bern","2015-07-06","#67 Stone for Electrochemical","CA189",765445,"Maynard, William BJ T",1750,7.3,0,200,"MEETS","MEETS","DOES NOT MEET","DOES NOT MEET",200,0]
["Martin Marietta","Clarks Quarry - New Bern","2015-07-06","#67 Stone for Electrochemical","CA189",765168,"Maynard, William BJ T",2415,7.5,0,200,"MEETS","MEETS","DOES NOT MEET","DOES NOT MEET",200,0]
["Martin Marietta","Clarks Quarry - New Bern","2015-07-06","#67 Stone for Electrochemical","CA189",765444,"Maynard, William BJ T",2437,8.1,0,200,"MEETS","MEETS","DOES NOT MEET","DOES NOT MEET",200,0]
["Georgia Stone Products","Lynches River Quarry - Jefferson, SC","2015-06-29","#67 Stone for Electrochemical","CA325",764166,"Jordan, Daniel H",25773,9.3000000000000007,0,200,"DOES NOT MEET","MEETS","N/A","N/A",200,0]
["Martin Marietta","Clarks Quarry - New Bern","2015-06-18","#67 Stone for Electrochemical","CA189",762704,"Maynard, William BJ T",2670,8,0,0,"MEETS","MEETS","DOES NOT MEET","DOES NOT MEET",0,0]
["Rogers Group, Inc.","Henrietta Quarry - Mooresboro","2015-05-20","#57 Stone for Electrochemical","CA369",758512,"Towery, Robby D",26978,9.1999999999999993,0,0,"DOES NOT MEET","MEETS","N/A","N/A",0,0]
["Harrison Construction Co., Inc.","Waynesville Quarry - Waynesville","2015-05-19","#57 Stone for Electrochemical","CA1",758295,"Wood, Dean Michael M",12604,8.1999999999999993,0,0,"MEETS","MEETS","N/A","N/A",0,0]
["Rogers Group, Inc.","Mitchell County Stone","2015-03-30","#57 Stone for Electrochemical","CA315",750748,"Rhymer, Robert C",52966,7.8,100,200,"MEETS","MEETS","N/A","N/A",200,100]
["Blue Water Industries","Midway Quarry - Mascot, TN","2014-08-29","#67 Stone for Electrochemical","CA183",725254,"Medford, Robert H",12908,9.3000000000000007,0,0,"DOES NOT MEET","MEETS","N/A","N/A",0,0]
["Martin Marietta","Pomona Quarry - Greensboro","2014-08-29","#57 Stone for Electrochemical","CA51",725653,"Fritts, Michael J",16587,8.8000000000000007,0,100,"MEETS","MEETS","N/A","N/A",100,0]
["Martin Marietta","Bonds Quarry - Concord","2014-08-14","#57 Stone for Electrochemical","CA276",722481,"Conte, Darrell J",19406,9,0,200,"MEETS","MEETS","N/A","N/A",200,0]
["Martin Marietta","Bonds Quarry - Concord","2014-08-13","#57 Stone for Electrochemical","CA276",722211,"Conte, Darrell J",19716,8.6,0,200,"MEETS","MEETS","N/A","N/A",200,0]
["McCrary Stone","Low Gap Quarry - Burnsville","2014-05-20","#57 Stone for Electrochemical","CA244",710302,"Rhymer, Robert C",9425,7.4,0,0,"MEETS","MEETS","N/A","N/A",0,0]
["Maymead Materials, Inc.","Turnip Patch Quarry - Mountain City, TN","2014-05-20","#57 Stone for Electrochemical","CA153",710874,"Church, Tracy G",16801,7.1,0,0,"MEETS","MEETS","N/A","N/A",0,0]
["Maymead Materials, Inc.","Turnip Patch Quarry - Mountain City, TN","2014-05-20","#57 Stone for Electrochemical","CA153",710365,"Watson, Richard F",16912,8,0,0,"MEETS","MEETS","N/A","N/A",0,0]
["Vulcan Materials Co.","Enka Quarry - Enka","2014-04-24","#78-M Stone for Electrochemical","CA69",706599,"Rhymer, Robert C",7148,4.5,0,0,"MEETS","DOES NOT MEET","N/A","N/A",0,0]
["Martin Marietta","Bonds Quarry - Concord","2014-04-11","#57 Stone for Electrochemical","CA276",704680,"Conte, Darrell J",18695,7.1,0,0,"MEETS","MEETS","N/A","N/A",0,0]
["Young & McQueen","Dellinger Waste Area (Area 1)","2014-03-12","#57 Stone for Electrochemical","CA391",700493,"Rhymer, Robert C",15074,6.5,0,0,"MEETS","MEETS","N/A","N/A",0,0]
["Vulcan Materials Co.","Blacksburg Quarry - Blacksburg, SC","2014-02-10","#57 Stone for Electrochemical","CA82",697259,"Brooks, Joseph D",10797,6.2,0,0,"MEETS","MEETS","N/A","N/A",0,0]
["Vulcan Materials Co.","Cabarrus Quarry - Concord","2013-11-12","#67 Stone for Electrochemical","CA186",689282,"Carriker, Pamela D",18525,6.6,0,0,"MEETS","MEETS","N/A","N/A",0,0]
["Harrison Construction Co., Inc.","Dillsboro Quarry - Dillsboro","2013-11-05","#57 Stone for Electrochemical","CA15",688428,"Kindley, Wallace Quint",11571,5.6,0,0,"MEETS","MEETS","N/A","N/A",0,0]
["Martin Marietta","Benson Quarry - Benson","2013-10-17","#57 Stone for Electrochemical","CA176",685810,"Blackman, Troy Justice",17649,7.4,0,0,"MEETS","MEETS","N/A","N/A",0,0]
["Young & McQueen","Dellinger Waste Area (Area 2)","2013-09-18","#57 Stone for Electrochemical","CA378",681225,"Rhymer, Robert C",4484,6.9,null,null,"MEETS","MEETS","N/A","N/A",0,0]
["Martin Marietta","Matthews Quarry - Matthews","2013-09-17","#57 Stone for Electrochemical","CA37",681166,"Gerdus, Raymond R",20276,9.4,0,0,"DOES NOT MEET","MEETS","N/A","N/A",0,0]
["Hanson Aggregates Southeast, Inc.","Princeton Quarry","2013-06-12","#57 Stone for Electrochemical","CA64",669956,"Gardner, Joseph Tyler",18587,7.8,0,0,"MEETS","MEETS","MEETS","MEETS",0,0]
["Hanson Aggregates Southeast, Inc.","Princeton Quarry","2013-06-12","Miscellaneous Material for Electrochemical","CA64",669957,"Gardner, Joseph Tyler",23809,7.8,0,0,"MEETS","MEETS","MEETS","MEETS",0,0]
["Martin Marietta","Hickory Quarry - Hickory","2013-01-04","#57 Stone for Electrochemical","CA43",652733,"Winkler, Jeffrey D",21881,8.1999999999999993,0,0,"MEETS","MEETS","N/A","N/A",0,0]
["Martin Marietta","Hickory Quarry - Hickory","2012-12-10","#57 Stone for Electrochemical","CA43",651129,"Winkler, Jeffrey D",15600,7.1,0,0,"MEETS","MEETS","N/A","N/A",0,0]
["Martin Marietta","Hickory Quarry - Hickory","2012-11-07","#57 Stone for Electrochemical","CA43",647293,"Robinson, Lee E",7800,5.5,0,0,"MEETS","MEETS","N/A","N/A",0,0]
["Martin Marietta","Hickory Quarry - Hickory","2012-09-07","#57 Stone for Electrochemical","CA43",639682,"Winkler, Jeffrey D",13192,5.2,0,0,"MEETS","MEETS","N/A","N/A",0,0]
["Martin Marietta","Hickory Quarry - Hickory","2012-08-24","#57 Stone for Electrochemical","CA43",637848,"Robinson, Lee E",22222,5.6,0,0,"MEETS","MEETS","N/A","N/A",0,0]
["Martin Marietta","Hickory Quarry - Hickory","2012-08-20","#57 Stone for Electrochemical","CA43",637231,"Robinson, Lee E",20703,5.3,0,0,"MEETS","MEETS","N/A","N/A",0,0]
["Martin Marietta","Hickory Quarry - Hickory","2012-07-17","#57 Stone for Electrochemical","CA43",632520,"Robinson, Lee E",46948,5.3,0,0,"MEETS","MEETS","N/A","N/A",0,0]
["Wake Stone Corp.","Knightdale Quarry - Knightdale","2012-06-13","Select Material, Class II, Type 1","CA98",630833,"Carter, PE, Sean C",9800,8.8000000000000007,null,null,"MEETS","MEETS","N/A","N/A",0,0]
["Wake Stone Corp.","Knightdale Quarry - Knightdale","2012-05-22","Select Material, Class II, Type 1","CA98",630831,"Carter, PE, Sean C",10000,9.5,null,null,"DOES NOT MEET","MEETS","N/A","N/A",0,0]
["Wake Stone Corp.","Knightdale Quarry - Knightdale","2012-03-28","Select Material, Class II, Type 1","CA98",627967,"Knight, Justin M",10000,10.199999999999999,null,null,"DOES NOT MEET","DOES NOT MEET","N/A","N/A",0,0]
["Martin Marietta","Statesville Quarry - Statesville","2012-03-19","#57 Stone for Electrochemical","CA54",619730,"Poole, Fred H",11976,7.4,0,0,"MEETS","MEETS","N/A","N/A",0,0]
["Wake Stone Corp.","Knightdale Quarry - Knightdale","2012-03-12","Select Material, Class II, Type 1","CA98",627972,"Wood, Aaron M",8900,10,null,null,"DOES NOT MEET","MEETS","N/A","N/A",0,0]
["Wake Stone Corp.","Knightdale Quarry - Knightdale","2012-03-12","Select Material, Class II, Type 1","CA98",627977,"Wood, Aaron M",9400,10,null,null,"DOES NOT MEET","MEETS","N/A","N/A",0,0]
["Martin Marietta","Statesville Quarry - Statesville","2012-03-07","#57 Stone for Electrochemical","CA54",617647,"Chroust, Richard A",9372,8,0,0,"MEETS","MEETS","N/A","N/A",0,0]
["Martin Marietta","Statesville Quarry - Statesville","2012-02-23","#57 Stone for Electrochemical","CA54",616547,"Robertson, David D",11820,7,0,0,"MEETS","MEETS","N/A","N/A",0,0]
["Martin Marietta","Statesville Quarry - Statesville","2012-02-07","#57 Stone for Electrochemical","CA54",615198,"Robertson, David D",12515,7.7,0,0,"MEETS","MEETS","N/A","N/A",0,0]
["Wake Stone Corp.","Knightdale Quarry - Knightdale","2012-02-06","Select Material, Class II, Type 1","CA98",627964,"Byrd, Drew L.",11200,10.1,null,null,"DOES NOT MEET","DOES NOT MEET","N/A","N/A",0,0]
["Wake Stone Corp.","Knightdale Quarry - Knightdale","2012-02-06","Select Material, Class II, Type 1","CA98",627963,"Byrd, Drew L.",10600,10.3,null,null,"DOES NOT MEET","DOES NOT MEET","N/A","N/A",0,0]
["Wake Stone Corp.","Knightdale Quarry - Knightdale","2012-02-02","Select Material, Class II, Type 1","CA98",630163,"Hall, Brian D",9700,9.6,null,null,"DOES NOT MEET","MEETS","N/A","N/A",0,0]
["Martin Marietta","Statesville Quarry - Statesville","2012-01-19","#57 Stone for Electrochemical","CA54",612903,"Chroust, Richard A",15082,7.9,0,0,"MEETS","MEETS","N/A","N/A",0,0]
["Wake Stone Corp.","Knightdale Quarry - Knightdale","2012-01-18","Select Material, Class II, Type 1","CA98",630162,"Hall, Brian D",9900,9.6999999999999993,null,null,"DOES NOT MEET","MEETS","N/A","N/A",0,0]
["Wake Stone Corp.","Knightdale Quarry - Knightdale","2012-01-18","Select Material, Class II, Type 1","CA98",630159,"Hall, Brian D",10900,9.8000000000000007,null,null,"DOES NOT MEET","MEETS","N/A","N/A",0,0]
["Martin Marietta","Statesville Quarry - Statesville","2012-01-03","#57 Stone for Electrochemical","CA54",611427,"Chroust, Richard A",13297,7.7,0,0,"MEETS","MEETS","N/A","N/A",0,0]
["Wake Stone Corp.","Knightdale Quarry - Knightdale","2011-12-30","Select Material, Class II, Type 1","CA98",627966,"Byrd, Drew L.",9300,9.9,null,null,"DOES NOT MEET","MEETS","N/A","N/A",0,0]
["Martin Marietta","Statesville Quarry - Statesville","2011-12-12","#57 Stone for Electrochemical","CA54",609998,"Chroust, Richard A",9699,7.7,0,0,"MEETS","MEETS","N/A","N/A",0,0]
["Martin Marietta","Statesville Quarry - Statesville","2011-12-07","#57 Stone for Electrochemical","CA54",609997,"Chroust, Richard A",10438,7.8,0,0,"MEETS","MEETS","N/A","N/A",0,0]
["Martin Marietta","Statesville Quarry - Statesville","2011-11-28","#57 Stone for Electrochemical","CA54",609996,"Chroust, Richard A",12135,7.7,0,0,{"$f":"IF(AND(4.5 <= $I642, $I642 <= 9), \"MEETS\", \"DOES NOT MEET\")","v":"MEETS"},{"$f":"IF(AND(5 <= $I642, $I642 <= 10), \"MEETS\", \"DOES NOT MEET\")","v":"MEETS"},{"$f":"IF(OR(ISBLANK(H642), NOT(ISNUMBER(MATCH($E642, Coastal,0)))), \"N/A\", IF(AND(4.5 <= $I642, $I642 <= 9),IF($H642>=5000,IF($Q642<=100,IF($P642<=200,\"MEETS\",\"DOES NOT MEET\"),\"DOES NOT MEET\"),\"DOES NOT MEET\"),\"DOES NOT MEET\"))","v":"N/A"},{"$f":"IF(OR(ISBLANK(I642), NOT(ISNUMBER(MATCH($E642, Coastal, 0)))), \"N/A\", IF(AND(5 <= $I642, $I642 <= 10),IF($H642>=5000,IF($Q642<=100,IF($P642<=200,\"MEETS\",\"DOES NOT MEET\"),\"DOES NOT MEET\"),\"DOES NOT MEET\"),\"DOES NOT MEET\"))","v":"N/A"},{"$f":"IF(LEFT(K642, 1)=\"<\", VALUE(RIGHT(K642,LEN(K642)-1)), K642)","v":0},{"$f":"IF(LEFT(J642, 1)=\"<\", VALUE(RIGHT(J642,LEN(J642)-1)), J642)","v":0}]
["Wake Stone Corp.","Knightdale Quarry - Knightdale","2011-11-16","Select Material, Class II, Type 1","CA98",609758,"Carter, PE, Sean C",6700,9.1,null,null,"DOES NOT MEET","MEETS","N/A","N/A",0,0]
["Wake Stone Corp.","Knightdale Quarry - Knightdale","2011-11-16","Select Material, Class II, Type 1","CA98",609757,"Carter, PE, Sean C",10900,9.3000000000000007,null,null,"DOES NOT MEET","MEETS","N/A","N/A",0,0]
["Wake Stone Corp.","Knightdale Quarry - Knightdale","2011-11-14","Select Material, Class II, Type 1","CA98",627961,"Kingsmore, Donnie Edward",9300,10.1,null,null,"DOES NOT MEET","DOES NOT MEET","N/A","N/A",0,0]
["Wake Stone Corp.","Knightdale Quarry - Knightdale","2011-11-14","Select Material, Class II, Type 1","CA98",627960,"Kingsmore, Donnie Edward",11100,10.199999999999999,null,null,"DOES NOT MEET","DOES NOT MEET","N/A","N/A",0,0]
["Wake Stone Corp.","Knightdale Quarry - Knightdale","2011-11-10","Select Material, Class II, Type 1","CA98",609761,"Carter, PE, Sean C",10500,9.1,null,null,"DOES NOT MEET","MEETS","N/A","N/A",0,0]
["Wake Stone Corp.","Knightdale Quarry - Knightdale","2011-11-10","Select Material, Class II, Type 1","CA98",609762,"Carter, PE, Sean C",12100,9.1999999999999993,null,null,"DOES NOT MEET","MEETS","N/A","N/A",0,0]
["Vulcan Materials Co.","Cabarrus Quarry - Concord","2011-11-01","#57 Stone for Electrochemical","CA186",606228,"Bryan, Aric J",14513,7.6,0,0,"MEETS","MEETS","N/A","N/A",0,0]
["Martin Marietta","Cumberland Quarry","2011-10-28","#57 Stone for Electrochemical","CA339",606382,"Stewart, Ernest C",11507,7.4,0,0,"MEETS","MEETS","N/A","N/A",0,0]
["Martin Marietta","Cumberland Quarry","2011-10-25","#57 Stone for Electrochemical","CA339",605644,"Stewart, Ernest C",11695,7.5,0,0,"MEETS","MEETS","N/A","N/A",0,0]
["Wake Stone Corp.","Knightdale Quarry - Knightdale","2011-10-24","Select Material, Class II, Type 1","CA98",609755,"Carter, PE, Sean C",11300,8.9,null,null,"MEETS","MEETS","N/A","N/A",0,0]
["Martin Marietta","Cumberland Quarry","2011-10-20","#57 Stone for Electrochemical","CA339",605176,"Stewart, Ernest C",13888,7.5,0,0,"MEETS","MEETS","N/A","N/A",0,0]
["Martin Marietta","Cumberland Quarry","2011-10-17","#57 Stone for Electrochemical","CA339",604733,"Stewart, Ernest C",14025,7.6,0,0,"MEETS","MEETS","N/A","N/A",0,0]
["Martin Marietta","Cumberland Quarry","2011-10-13","#57 Stone for Electrochemical","CA339",604133,"Stewart, Ernest C",10870,7.5,0,0,"MEETS","MEETS","N/A","N/A",0,0]
["Maymead Materials, Inc.","Turnip Patch Quarry - Mountain City, TN","2011-09-28","#57 Stone for Electrochemical","CA153",602434,"Watson, Richard F",17301,7.7,0,0,"MEETS","MEETS","N/A","N/A",0,0]
["Martin Marietta","Cumberland Quarry","2011-09-20","#57 Stone for Electrochemical","CA339",601600,"Robinson, David S",14814,7.9,0,0,"MEETS","MEETS","N/A","N/A",0,0]
["Martin Marietta","Statesville Quarry - Statesville","2011-09-20","#57 Stone for Electrochemical","CA54",601653,"Chroust, Richard A",11074,8.1,0,0,"MEETS","MEETS","N/A","N/A",0,0]
["Wake Stone Corp.","Knightdale Quarry - Knightdale","2011-09-02","Select Material, Class II, Type 1","CA98",609768,"Carter, PE, Sean C",9700,8.9,null,null,"MEETS","MEETS","N/A","N/A",0,0]
["Wake Stone Corp.","Knightdale Quarry - Knightdale","2011-09-02","Select Material, Class II, Type 1","CA98",609767,"Carter, PE, Sean C",8100,9.1,null,null,"DOES NOT MEET","MEETS","N/A","N/A",0,0]
["L.B.M. Industries","Hewitt Quarry - Topton","2011-07-26","#57 Stone for Electrochemical","CA23",595688,"Cross, Adam D",17301,8.9,0,0,"MEETS","MEETS","N/A","N/A",0,0]
["L.B.M. Industries","Hewitt Quarry - Topton","2011-07-26","#78-M Stone for Electrochemical","CA23",595694,"Cross, Adam D",15432,8.8000000000000007,0,0,"MEETS","MEETS","N/A","N/A",0,0]
["Wake Stone Corp.","Knightdale Quarry - Knightdale","2011-06-23","Select Material, Class II, Type 1","CA98",609764,"Carter, PE, Sean C",6500,9,null,null,"MEETS","MEETS","N/A","N/A",0,0]
["Martin Marietta","Cumberland Quarry","2011-06-08","#57 Stone for Electrochemical","CA339",543023,"Robinson, Beatrice H",5247,7.6,0,0,"MEETS","MEETS","N/A","N/A",0,0]
["Martin Marietta","Cumberland Quarry","2011-06-08","#57 Stone for Electrochemical","CA339",543022,"Robinson, Beatrice H",6169,7.7,0,0,"MEETS","MEETS","N/A","N/A",0,0]
["Martin Marietta","Cumberland Quarry","2011-06-08","ABC Stone for Electrochemical","CA339",541382,"Robinson, Beatrice H",5247,7.6,0,0,"MEETS","MEETS","N/A","N/A",0,0]
["Martin Marietta","Cumberland Quarry","2011-06-08","ABC Stone for Electrochemical","CA339",541380,"Robinson, Beatrice H",6169,7.7,0,0,"MEETS","MEETS","N/A","N/A",0,0]
["Martin Marietta","Fountain Quarry - Fountain","2011-05-20","#57 Stone for Electrochemical","CA42",539899,"Harrison, Willie A",10753,7.9,0,0,"MEETS","MEETS","MEETS","MEETS",0,0]
["Martin Marietta","Fountain Quarry - Fountain","2011-05-18","#57 Stone for Electrochemical","CA42",539592,"Harrison, Willie A",10384,8.3000000000000007,0,0,"MEETS","MEETS","MEETS","MEETS",0,0]
["Martin Marietta","Statesville Quarry - Statesville","2011-04-14","#57 Stone for Electrochemical","CA54",536762,"Leatherman, Barbara L",12690,6.2,34,0,"MEETS","MEETS","N/A","N/A",0,34]
["Martin Marietta","Fountain Quarry - Fountain","2011-03-25","#57 Stone for Electrochemical","CA42",535416,"Harrison, Willie A",12804,8,0,0,"MEETS","MEETS","MEETS","MEETS",0,0]
["Martin Marietta","Central Rock Quarry - Greensboro","2011-03-23","#78-M Stone for Electrochemical","CA28",534979,"Owens, F. David",16103,8.1,204,0,"MEETS","MEETS","N/A","N/A",0,204]
["Martin Marietta","Fountain Quarry - Fountain","2011-03-23","#57 Stone for Electrochemical","CA42",535055,"Harrison, Willie A",18867,7.9,0,0,"MEETS","MEETS","MEETS","MEETS",0,0]
["Taylor & Murphy Const. Co., Inc.","TM-Madison County Area #3 (US19 Widening)","2011-03-23","#57 Stone for Electrochemical","CA364",534939,"Lance, Kevin C",23529,8.1,146,0,"MEETS","MEETS","N/A","N/A",0,146]
["Taylor & Murphy Const. Co., Inc.","TM-Madison County Area #3 (US19 Widening)","2011-03-23","#57 Stone for Electrochemical","CA364",534940,"Lance, Kevin C",19305,8.1999999999999993,134,0,"MEETS","MEETS","N/A","N/A",0,134]
["Taylor & Murphy Const. Co., Inc.","TM-Madison County Area #3 (US19 Widening)","2011-03-23","#57 Stone for Electrochemical","CA364",534938,"Lance, Kevin C",21929,8.4,0,0,"MEETS","MEETS","N/A","N/A",0,0]
["Martin Marietta","Fountain Quarry - Fountain","2011-03-08","#57 Stone for Electrochemical","CA42",534075,"Harrison, Willie A",16103,8.6,0,0,"MEETS","MEETS","MEETS","MEETS",0,0]
["Martin Marietta","Statesville Quarry - Statesville","2011-03-07","#57 Stone for Electrochemical","CA54",533566,"McAlpin, Bryson E",17094,8.1,0,0,"MEETS","MEETS","N/A","N/A",0,0]
["Martin Marietta","Fountain Quarry - Fountain","2011-03-04","#57 Stone for Electrochemical","CA42",533549,"Harrison, Willie A",32894,7.9,0,0,"MEETS","MEETS","MEETS","MEETS",0,0]
["Martin Marietta","Fountain Quarry - Fountain","2011-03-04","#57 Stone for Electrochemical","CA42",533548,"Harrison, Willie A",18587,8.6999999999999993,0,0,"MEETS","MEETS","MEETS","MEETS",0,0]
["Wake Stone Corp.","Knightdale Quarry - Knightdale","2011-03-04","Select Material, Class II, Type 1","CA98",533409,"Carter, PE, Sean C",23000,9.5,null,null,"DOES NOT MEET","MEETS","N/A","N/A",0,0]
["Wake Stone Corp.","Knightdale Quarry - Knightdale","2011-03-04","Select Material, Class II, Type 1","CA98",533408,"Carter, PE, Sean C",19500,9.6,null,null,"DOES NOT MEET","MEETS","N/A","N/A",0,0]
["Wake Stone Corp.","Knightdale Quarry - Knightdale","2011-03-04","Select Material, Class II, Type 1","CA98",533410,"Carter, PE, Sean C",11000,9.6,null,null,"DOES NOT MEET","MEETS","N/A","N/A",0,0]
["Wake Stone Corp.","Knightdale Quarry - Knightdale","2011-03-04","Select Material, Class II, Type 1","CA98",533412,"Carter, PE, Sean C",15000,9.6,null,null,"DOES NOT MEET","MEETS","N/A","N/A",0,0]
["Wake Stone Corp.","Knightdale Quarry - Knightdale","2011-03-04","Select Material, Class II, Type 1","CA98",533411,"Carter, PE, Sean C",17000,9.6999999999999993,null,null,"DOES NOT MEET","MEETS","N/A","N/A",0,0]
["Wake Stone Corp.","Knightdale Quarry - Knightdale","2011-03-04","Select Material, Class II, Type 1","CA98",533407,"Carter, PE, Sean C",18000,9.8000000000000007,null,null,"DOES NOT MEET","MEETS","N/A","N/A",0,0]
["Martin Marietta","Fountain Quarry - Fountain","2011-03-01","#57 Stone for Electrochemical","CA42",533381,"Harrison, Willie A",22779,8.4,0,0,"MEETS","MEETS","MEETS","MEETS",0,0]
["Martin Marietta","Fountain Quarry - Fountain","2011-03-01","#57 Stone for Electrochemical","CA42",533382,"Harrison, Willie A",23474,8.5,0,0,"MEETS","MEETS","MEETS","MEETS",0,0]
["Martin Marietta","Fountain Quarry - Fountain","2011-03-01","#57 Stone for Electrochemical","CA42",533383,"Harrison, Willie A",18552,8.5,0,0,"MEETS","MEETS","MEETS","MEETS",0,0]
["Wake Stone Corp.","Knightdale Quarry - Knightdale","2011-02-23","Select Material, Class II, Type 1","CA98",609765,"Carter, PE, Sean C",9800,9.3000000000000007,null,null,"DOES NOT MEET","MEETS","N/A","N/A",0,0]
["Wake Stone Corp.","Knightdale Quarry - Knightdale","2011-02-04","Select Material, Class II, Type 1","CA98",531505,"Hall, Brian D",16000,9.5,null,null,"DOES NOT MEET","MEETS","N/A","N/A",0,0]
["Wake Stone Corp.","Knightdale Quarry - Knightdale","2011-02-04","Select Material, Class II, Type 1","CA98",531502,"Helms, Blane A",13000,9.6999999999999993,null,null,"DOES NOT MEET","MEETS","N/A","N/A",0,0]
["Wake Stone Corp.","Knightdale Quarry - Knightdale","2011-02-04","Select Material, Class II, Type 1","CA98",531503,"Helms, Blane A",17000,9.6999999999999993,null,null,"DOES NOT MEET","MEETS","N/A","N/A",0,0]
["Wake Stone Corp.","Knightdale Quarry - Knightdale","2011-02-04","Select Material, Class II, Type 1","CA98",531501,"Helms, Blane A",21000,9.8000000000000007,null,null,"DOES NOT MEET","MEETS","N/A","N/A",0,0]
["Wake Stone Corp.","Knightdale Quarry - Knightdale","2011-02-04","Select Material, Class II, Type 1","CA98",531504,"Hall, Brian D",29000,9.8000000000000007,null,null,"DOES NOT MEET","MEETS","N/A","N/A",0,0]
["Wake Stone Corp.","Knightdale Quarry - Knightdale","2011-02-04","Select Material, Class II, Type 1","CA98",531510,"Helms, Blane A",10,null,null,null,"DOES NOT MEET","DOES NOT MEET","N/A","N/A",0,0]
["Martin Marietta","Central Rock Quarry - Greensboro","2011-02-03","#78-M Stone for Electrochemical","CA28",531273,"Johnson, Don W",14556,7.7,0,0,"MEETS","MEETS","N/A","N/A",0,0]
["Martin Marietta","Statesville Quarry - Statesville","2011-02-01","#57 Stone for Electrochemical","CA54",531909,"Chroust, Richard A",16393,8.1999999999999993,0,0,"MEETS","MEETS","N/A","N/A",0,0]
["Martin Marietta","Statesville Quarry - Statesville","2011-02-01","#57 Stone for Electrochemical","CA54",531910,"Chroust, Richard A",12019,8.4,0,0,"MEETS","MEETS","N/A","N/A",0,0]
["Wake Stone Corp.","Knightdale Quarry - Knightdale","2011-01-28","Select Material, Class II, Type 1","CA98",530896,"Gowl, Adam L",null,null,null,null,"DOES NOT MEET","DOES NOT MEET","N/A","N/A",0,0]
["Wake Stone Corp.","Knightdale Quarry - Knightdale","2011-01-27","Select Material, Class II, Type 1","CA98",530815,"Carter, PE, Sean C",14500,9.6,null,null,"DOES NOT MEET","MEETS","N/A","N/A",0,0]
["Wake Stone Corp.","Knightdale Quarry - Knightdale","2011-01-27","Select Material, Class II, Type 1","CA98",530816,"Carter, PE, Sean C",14500,9.6,null,null,"DOES NOT MEET","MEETS","N/A","N/A",0,0]
["Wake Stone Corp.","Knightdale Quarry - Knightdale","2011-01-27","Select Material, Class II, Type 1","CA98",530813,"Carter, PE, Sean C",16000,9.6999999999999993,null,null,"DOES NOT MEET","MEETS","N/A","N/A",0,0]
["Wake Stone Corp.","Knightdale Quarry - Knightdale","2011-01-27","Select Material, Class II, Type 1","CA98",530811,"Carter, PE, Sean C",15500,9.8000000000000007,null,null,"DOES NOT MEET","MEETS","N/A","N/A",0,0]
["Wake Stone Corp.","Knightdale Quarry - Knightdale","2011-01-27","Select Material, Class II, Type 1","CA98",530812,"Carter, PE, Sean C",17500,9.8000000000000007,null,null,"DOES NOT MEET","MEETS","N/A","N/A",0,0]
["Wake Stone Corp.","Knightdale Quarry - Knightdale","2011-01-18","Select Material, Class II, Type 1","CA98",530183,"Locklear, Marcus N",15000,9.6999999999999993,null,null,{"$f":"IF(AND(4.5 <= $I706, $I706 <= 9), \"MEETS\", \"DOES NOT MEET\")","v":"DOES NOT MEET"},{"$f":"IF(AND(5 <= $I706, $I706 <= 10), \"MEETS\", \"DOES NOT MEET\")","v":"MEETS"},{"$f":"IF(OR(ISBLANK(H706), NOT(ISNUMBER(MATCH($E706, Coastal,0)))), \"N/A\", IF(AND(4.5 <= $I706, $I706 <= 9),IF($H706>=5000,IF($Q706<=100,IF($P706<=200,\"MEETS\",\"DOES NOT MEET\"),\"DOES NOT MEET\"),\"DOES NOT MEET\"),\"DOES NOT MEET\"))","v":"N/A"},{"$f":"IF(OR(ISBLANK(I706), NOT(ISNUMBER(MATCH($E706, Coastal, 0)))), \"N/A\", IF(AND(5 <= $I706, $I706 <= 10),IF($H706>=5000,IF($Q706<=100,IF($P706<=200,\"MEETS\",\"DOES NOT MEET\"),\"DOES NOT MEET\"),\"DOES NOT MEET\"),\"DOES NOT MEET\"))","v":"N/A"},{"$f":"IF(LEFT(K706, 1)=\"<\", VALUE(RIGHT(K706,LEN(K706)-1)), K706)","v":0},{"$f":"IF(LEFT(J706, 1)=\"<\", VALUE(RIGHT(J706,LEN(J706)-1)), J706)","v":0}]
["Wake Stone Corp.","Knightdale Quarry - Knightdale","2011-01-18","Select Material, Class II, Type 1","CA98",530184,"Locklear, Marcus N",15000,9.8000000000000007,null,null,"DOES NOT MEET","MEETS","N/A","N/A",0,0]
["Martin Marietta","Fountain Quarry - Fountain","2010-11-16","#57 Stone for Electrochemical","CA42",527184,"Harrell, William W",17513,8.1,0,0,"MEETS","MEETS","MEETS","MEETS",0,0]
["Wake Stone Corp.","Triangle Quarry - Cary","2010-11-09","#57 Stone for Electrochemical","CA157",526544,"Dacey, Aaron H",24509,8.1999999999999993,0,0,"MEETS","MEETS","N/A","N/A",0,0]
["Martin Marietta","Statesville Quarry - Statesville","2010-09-28","#57 Stone for Electrochemical","CA54",523346,"Leatherman, Barbara L",13831,8.3000000000000007,0,0,"MEETS","MEETS","N/A","N/A",0,0]
["Martin Marietta","Central Rock Quarry - Greensboro","2010-08-12","#78-M Stone for Electrochemical","CA28",519429,"Johnson, Don W",15503,8.1999999999999993,"<28",0,"MEETS","MEETS","N/A","N/A",0,28]
["Martin Marietta","Central Rock Quarry - Greensboro","2010-07-23","#78-M Stone for Electrochemical","CA28",517355,"Owens, Daniel B",12000,7.1,27,200,"MEETS","MEETS","N/A","N/A",200,27]
["Martin Marietta","Central Rock Quarry - Greensboro","2010-05-11","#78-M Stone for Electrochemical","CA28",510893,"Jackson, Brandon M",13315,7.4,27,200,"MEETS","MEETS","N/A","N/A",200,27]
["Martin Marietta","Statesville Quarry - Statesville","2010-05-05","#57 Stone for Electrochemical","CA54",511657,"McAlpin, Bryson E",5035,7.3,27,200,"MEETS","MEETS","N/A","N/A",200,27]
["Martin Marietta","Statesville Quarry - Statesville","2010-04-30","#57 Stone for Electrochemical","CA54",510028,"Leatherman, Barbara L",10030,7.5,27,"<200","MEETS","MEETS","N/A","N/A",200,27]
["Martin Marietta","Asheboro Quarry - Asheboro","2010-03-31","#78-M Stone for Electrochemical","CA30",507501,"Jackson, Brandon M",71022,7.2,27,"<200","MEETS","MEETS","N/A","N/A",200,27]
["Martin Marietta","Fountain Quarry - Fountain","2010-03-23","#57 Stone for Electrochemical","CA42",507094,"Galloway, Brandon W",17182,7.4,27,"<200","MEETS","MEETS","MEETS","MEETS",200,27]
["Martin Marietta","Asheboro Quarry - Asheboro","2010-03-19","#57 Stone for Electrochemical","CA30",507243,"Jackson, Brandon M",65963,7.5,27,"<200","MEETS","MEETS","N/A","N/A",200,27]
["Martin Marietta","Fountain Quarry - Fountain","2010-03-10","#57 Stone for Electrochemical","CA42",506007,"Galloway, Brandon W",15128,8.1999999999999993,27,"<200","MEETS","MEETS","MEETS","MEETS",200,27]
["Martin Marietta","Fountain Quarry - Fountain","2010-02-25","#57 Stone for Electrochemical","CA42",505150,"Galloway, Brandon W",23148,8.6999999999999993,"<27",200,"MEETS","MEETS","MEETS","MEETS",200,27]
["Martin Marietta","Fountain Quarry - Fountain","2010-02-15","#57 Stone for Electrochemical","CA42",504586,"Harrell, William W",23474,8.3000000000000007,27,"<200","MEETS","MEETS","MEETS","MEETS",200,27]
["Martin Marietta","Asheboro Quarry - Asheboro","2010-02-04","Coarse Aggregate, #57","CA30",503816,"Jackson, Brandon M",98328,7.6,27,"<200","MEETS","MEETS","N/A","N/A",200,27]
["Martin Marietta","Central Rock Quarry - Greensboro","2010-02-04","Coarse Aggregate, #67","CA28",503817,"Jackson, Brandon M",19120,8.8000000000000007,27,"<200","MEETS","MEETS","N/A","N/A",200,27]
["Martin Marietta","Central Rock Quarry - Greensboro","2010-02-04","Coarse Aggregate, #78M","CA28",503819,"Jackson, Brandon M",15674,8.4,27,"<200","MEETS","MEETS","N/A","N/A",200,27]
["Vulcan Materials Co.","Hendersonville Quarry - Hendersonville","2009-09-28","#57 Stone for Electrochemical","CA81",496223,"Eubanks, Patrick A",6978,7.6,27,"<200","MEETS","MEETS","N/A","N/A",200,27]
["Martin Marietta","Bakers Quarry - Monroe","2009-07-30","#78-M Stone for Electrochemical","CA32",491118,"Rasmussen, Roger",12121,7.5,"<27","<200","MEETS","MEETS","N/A","N/A",200,27]
["Martin Marietta","Castle Hayne Yard - Castle Hayne","2009-07-24","#57 Stone for Electrochemical","CA319",490758,"Walker, Steven E",17036,7.3,"<27","<200","MEETS","MEETS","MEETS","MEETS",200,27]
["Martin Marietta","Castle Hayne Yard - Castle Hayne","2009-07-24","#57 Stone for Electrochemical","CA319",490759,"Walker, Steven E",17986,7.5,"<27","<200","MEETS","MEETS","MEETS","MEETS",200,27]
["Martin Marietta","Central Rock Quarry - Greensboro","2009-06-25","#57 Stone for Electrochemical","CA28",488542,"Brady, Michael Dean",26525,7.4,"<27","<200","MEETS","MEETS","N/A","N/A",200,27]
["Vulcan Materials Co.","Enka Quarry - Enka","2009-06-24","#57 Stone for Electrochemical","CA69",488187,"Ammons, Larry W",31250,6.9,"<27","<200","MEETS","MEETS","N/A","N/A",200,27]
["Vulcan Materials Co.","Hendersonville Quarry - Hendersonville","2009-06-19","#57 Stone for Electrochemical","CA81",487918,"Eubanks, Patrick A",22222,8,"<27","<200","MEETS","MEETS","N/A","N/A",200,27]
["Martin Marietta","Castle Hayne Yard - Castle Hayne","2009-06-17","#57 Stone for Electrochemical","CA319",488138,"Jackson, Anthony M",8673,7,"<27","<200","MEETS","MEETS","MEETS","MEETS",200,27]
["Vulcan Materials Co.","Rockingham Quarry - Rockingham","2009-05-20","#57 Stone for Electrochemical","CA94",485949,"Jackson, Anthony M",14245,6.5,"<27","<200","MEETS","MEETS","N/A","N/A",200,27]
["Vulcan Materials Co.","Rockingham Quarry - Rockingham","2009-05-20","#57 Stone for Electrochemical","CA94",485948,"Jackson, Anthony M",13850,6.7,"<27","<200","MEETS","MEETS","N/A","N/A",200,27]
["Vulcan Materials Co.","Enka Quarry - Enka","2009-05-19","#57 Stone for Electrochemical","CA69",485268,"Ammons, Larry W",19685,6.2,"<27","<200","MEETS","MEETS","N/A","N/A",200,27]
["Vulcan Materials Co.","Rockingham Quarry - Rockingham","2009-05-11","#57 Stone for Electrochemical","CA94",484532,"Jackson, Anthony M",19157,8.6,"<27","<200","MEETS","MEETS","N/A","N/A",200,27]
["Martin Marietta","Central Rock Quarry - Greensboro","2009-01-22","#57 Stone for Electrochemical","CA28",477054,"Lockhart, Clifford M",21692,8.1,"<27","<200","MEETS","MEETS","N/A","N/A",200,27]
["Vulcan Materials Co.","Enka Quarry - Enka","2009-01-05","#57 Stone for Electrochemical","CA69",476121,"Young, Ernest R",17699,6.4,"<27","<400","MEETS","MEETS","N/A","N/A",400,27]
["Harrison Construction Co., Inc.","Waynesville Quarry - Waynesville","2008-12-09","#67 Stone for Electrochemical","CA1",475184,"Hughes, Joseph W",6309,7.6,"<27","<200","MEETS","MEETS","N/A","N/A",200,27]
["Martin Marietta","Benson Quarry - Benson","2008-10-03","#57 Stone for Electrochemical","CA176",470005,"Allen, Daniel W",24938,7,"<27","<200","MEETS","MEETS","N/A","N/A",200,27]
["Maymead Materials, Inc.","North 321 Stone","2008-10-03","#57 Stone for Electrochemical","CA273",470680,"Wagoner, Roy M",15630,7.3,"<27","<200","MEETS","MEETS","N/A","N/A",200,27]
["Martin Marietta","Benson Quarry - Benson","2008-09-19","#57 Stone for Electrochemical","CA176",469418,"Rogerson Jr., Bobby 'Chuck'",22989,7.7,"<27","<200","MEETS","MEETS","N/A","N/A",200,27]
["Vulcan Materials Co.","Enka Quarry - Enka","2008-09-10","#57 Stone for Electrochemical","CA69",468267,"Ammons, Larry W",8058,6.1,"<27","<200","MEETS","MEETS","N/A","N/A",200,27]
["Harrison Construction Co., Inc.","Waynesville Quarry - Waynesville","2008-08-18","#67 Stone for Electrochemical","CA1",466540,"Mosteller, Billy",10752,7,"<27","<200","MEETS","MEETS","N/A","N/A",200,27]
["Vulcan Materials Co.","Enka Quarry - Enka","2008-07-24","#57 Stone for Electrochemical","CA69",464697,"Harmon, Ronnie D",10787,5.9,"<27","<200","MEETS","MEETS","N/A","N/A",200,27]
["Martin Marietta","Asheboro Quarry - Asheboro","2008-07-10","Coarse Aggregate, #67","CA30",463619,"Dunn, Jr., Larry E",20242,7.7,"<27","<200","MEETS","MEETS","N/A","N/A",200,27]
["Vulcan Materials Co.","Enka Quarry - Enka","2008-05-21","#57 Stone for Electrochemical","CA69",460345,"Harmon, Ronnie D",11961,6.5,"<27","<200","MEETS","MEETS","N/A","N/A",200,27]
["Martin Marietta","Benson Quarry - Benson","2008-03-25","#57 Stone for Electrochemical","CA176",456244,"Rogerson Jr., Bobby 'Chuck'",19047,8.1999999999999993,"<32","<200","MEETS","MEETS","N/A","N/A",200,32]
["Hedrick Industries","South McDowell Quarry - Marion","2008-03-12","#57 Stone for Electrochemical","CA283",456086,"Houck, Michael Brandon",18248,7.7,"<32","<200","MEETS","MEETS","N/A","N/A",200,32]
["Martin Marietta","Benson Quarry - Benson","2008-01-30","#57 Stone for Electrochemical","CA176",453085,"Rogerson Jr., Bobby 'Chuck'",21052,7.3,"<32","<200","MEETS","MEETS","N/A","N/A",200,32]
["Martin Marietta","Kings Mountain Quarry - Kings Mountain","2007-12-13","#67 Stone for Electrochemical","CA48",450960,"Bullock, Charles D",11223,7.7,"<32","<200","MEETS","MEETS","N/A","N/A",200,32]
["Hanson Aggregates Southeast, Inc.","Neverson Quarry - Sims","2007-10-18","#57 Stone for Electrochemical","CA66",447669,"Rogerson Jr., Bobby 'Chuck'",20964,7.8,"<32","<200","MEETS","MEETS","N/A","N/A",200,32]
["Vulcan Materials Co.","Lenior Quarry - Lenoir","2007-09-19","#57 Stone for Electrochemical","CA91",445706,"Wagoner, Roy M",26667,7.7,"<32","<200","MEETS","MEETS","N/A","N/A",200,32]
["Vulcan Materials Co.","Lenior Quarry - Lenoir","2007-08-21","#57 Stone for Electrochemical","CA91",443687,"Wagoner, Roy M",17513,6.9,"<32","<200","MEETS","MEETS","N/A","N/A",200,32]
["Hanson Aggregates Southeast, Inc.","Neverson Quarry - Sims","2007-08-08","#57 Stone for Electrochemical","CA66",443094,"Rogerson Jr., Bobby 'Chuck'",17794,7.9,"<32","<200","MEETS","MEETS","N/A","N/A",200,32]
["Hanson Aggregates Southeast, Inc.","Neverson Quarry - Sims","2007-07-12","#57 Stone for Electrochemical","CA66",441333,"Rogerson Jr., Bobby 'Chuck'",18484,7.8,"<32","<200","MEETS","MEETS","N/A","N/A",200,32]
["Hanson Aggregates Southeast, Inc.","Neverson Quarry - Sims","2007-06-22","#57 Stone for Electrochemical","CA66",439420,"Rogerson Jr., Bobby 'Chuck'",23256,8.4,"<32","<200","MEETS","MEETS","N/A","N/A",200,32]
["Hanson Aggregates Southeast, Inc.","Neverson Quarry - Sims","2007-06-04","#57 Stone for Electrochemical","CA66",437956,"Rogerson Jr., Bobby 'Chuck'",22026,7.7,"<32","<200","MEETS","MEETS","N/A","N/A",200,32]
["Hanson Aggregates Southeast, Inc.","Neverson Quarry - Sims","2007-05-11","#57 Stone for Electrochemical","CA66",436493,"Rogerson Jr., Bobby 'Chuck'",25773,7.8,"<32","<200","MEETS","MEETS","N/A","N/A",200,32]
["Martin Marietta","Woodleaf Quarry - Salisbury","2007-05-01","#57 Stone for Electrochemical","CA56",435765,"Tucker, PE, Mezak",18692,7.1,"<32","<200","MEETS","MEETS","N/A","N/A",200,32]
["Hanson Aggregates Southeast, Inc.","Neverson Quarry - Sims","2007-04-24","#57 Stone for Electrochemical","CA66",435517,"Rogerson Jr., Bobby 'Chuck'",17000,7.5,"<30","<200","MEETS","MEETS","N/A","N/A",200,30]
["Hanson Aggregates Southeast, Inc.","Neverson Quarry - Sims","2007-04-24","#57 Stone for Electrochemical","CA66",435223,"Rogerson Jr., Bobby 'Chuck'",25000,8,"<29","<200","MEETS","MEETS","N/A","N/A",200,29]
["Martin Marietta","Pomona Quarry - Greensboro","2007-02-19","#57 Stone for Electrochemical","CA51",431346,"Loshinskiy, Roman",20284,7.5,"<29",200,"MEETS","MEETS","N/A","N/A",200,29]
["Harrison Construction Co., Inc.","Dillsboro Quarry - Dillsboro","2007-02-13","#57 Stone for Electrochemical","CA15",431000,"Hughes, Joseph W",15674,7.1,"<29","<200","MEETS","MEETS","N/A","N/A",200,29]
["Harrison Construction Co., Inc.","Dillsboro Quarry - Dillsboro","2007-02-02","#57 Stone for Electrochemical","CA15",430556,"Hughes, Joseph W",13966,7,"<29","<200","MEETS","MEETS","N/A","N/A",200,29]
["Harrison Construction Co., Inc.","Waynesville Quarry - Waynesville","2007-01-31","#67 Stone for Electrochemical","CA1",430400,"Rhymer, Robert C",16393,7,"<29","<200","MEETS","MEETS","N/A","N/A",200,29]
["Harrison Construction Co., Inc.","Waynesville Quarry - Waynesville","2007-01-24","#67 Stone for Electrochemical","CA1",429979,"Rhymer, Robert C",12642,7.4,"<29",400,"MEETS","MEETS","N/A","N/A",400,29]
["Harrison Construction Co., Inc.","Waynesville Quarry - Waynesville","2007-01-17","#67 Stone for Electrochemical","CA1",429606,"Rhymer, Robert C",18182,7.9,"<29","<200","MEETS","MEETS","N/A","N/A",200,29]
["Harrison Construction Co., Inc.","Waynesville Quarry - Waynesville","2007-01-12","#67 Stone for Electrochemical","CA1",429458,"Rhymer, Robert C",19120,7.8,"<29","<200","MEETS","MEETS","N/A","N/A",200,29]
["Harrison Construction Co., Inc.","Waynesville Quarry - Waynesville","2007-01-12","#67 Stone for Electrochemical","CA1",429464,"Rhymer, Robert C",17182,7.8,"<29","<200",{"$f":"IF(AND(4.5 <= $I770, $I770 <= 9), \"MEETS\", \"DOES NOT MEET\")","v":"MEETS"},{"$f":"IF(AND(5 <= $I770, $I770 <= 10), \"MEETS\", \"DOES NOT MEET\")","v":"MEETS"},{"$f":"IF(OR(ISBLANK(H770), NOT(ISNUMBER(MATCH($E770, Coastal,0)))), \"N/A\", IF(AND(4.5 <= $I770, $I770 <= 9),IF($H770>=5000,IF($Q770<=100,IF($P770<=200,\"MEETS\",\"DOES NOT MEET\"),\"DOES NOT MEET\"),\"DOES NOT MEET\"),\"DOES NOT MEET\"))","v":"N/A"},{"$f":"IF(OR(ISBLANK(I770), NOT(ISNUMBER(MATCH($E770, Coastal, 0)))), \"N/A\", IF(AND(5 <= $I770, $I770 <= 10),IF($H770>=5000,IF($Q770<=100,IF($P770<=200,\"MEETS\",\"DOES NOT MEET\"),\"DOES NOT MEET\"),\"DOES NOT MEET\"),\"DOES NOT MEET\"))","v":"N/A"},{"$f":"IF(LEFT(K770, 1)=\"<\", VALUE(RIGHT(K770,LEN(K770)-1)), K770)","v":200},{"$f":"IF(LEFT(J770, 1)=\"<\", VALUE(RIGHT(J770,LEN(J770)-1)), J770)","v":29}]
["Hanson Aggregates Southeast, Inc.","Rougemont Quarry","2007-01-08","#57 Stone for Electrochemical","CA217",429825,"Barnhill, Noah C",17182,8.8000000000000007,"<29","<200","MEETS","MEETS","N/A","N/A",200,29]
["Martin Marietta","Pomona Quarry - Greensboro","2006-12-27","#57 Stone for Electrochemical","CA51",428955,"Baldwin, Arnold L",22222,7.3,"<29","<200","MEETS","MEETS","N/A","N/A",200,29]
["Martin Marietta","Pomona Quarry - Greensboro","2006-10-02","#57 Stone for Electrochemical","CA51",423632,"Lorenz, PE, Kris",20000,9.1,"<30","<200","DOES NOT MEET","MEETS","N/A","N/A",200,30]
["Martin Marietta","Pomona Quarry - Greensboro","2006-10-02","#57 Stone for Electrochemical","CA51",423633,"Lorenz, PE, Kris",19000,9.1999999999999993,"<30","<200","DOES NOT MEET","MEETS","N/A","N/A",200,30]
["Martin Marietta","Pomona Quarry - Greensboro","2006-09-28","#57 Stone for Electrochemical","CA51",423631,"Lorenz, PE, Kris",24000,8.3000000000000007,"<30","<200","MEETS","MEETS","N/A","N/A",200,30]
["Martin Marietta","Pomona Quarry - Greensboro","2006-09-28","#57 Stone for Electrochemical","CA51",423630,"Lorenz, PE, Kris",20000,8.4,"<30","<200","MEETS","MEETS","N/A","N/A",200,30]
["Martin Marietta","Pomona Quarry - Greensboro","2006-08-29","#57 Stone for Electrochemical","CA51",420094,"Lorenz, PE, Kris",23419,7.9,"<30","<200","MEETS","MEETS","N/A","N/A",200,30]
["Martin Marietta","Pomona Quarry - Greensboro","2006-08-29","#57 Stone for Electrochemical","CA51",420093,"Lorenz, PE, Kris",22222,8.3000000000000007,"<30","<200","MEETS","MEETS","N/A","N/A",200,30]
["Martin Marietta","Pomona Quarry - Greensboro","2006-08-28","#57 Stone for Electrochemical","CA51",420092,"Lorenz, PE, Kris",25707,8,"<30","<200","MEETS","MEETS","N/A","N/A",200,30]
["Martin Marietta","Pomona Quarry - Greensboro","2006-08-28","#57 Stone for Electrochemical","CA51",420091,"Lorenz, PE, Kris",24213,8.3000000000000007,"<30","<200","MEETS","MEETS","N/A","N/A",200,30]
["Martin Marietta","Pomona Quarry - Greensboro","2006-08-28","#57 Stone for Electrochemical","CA51",420090,"Lorenz, PE, Kris",25381,8.4,"<30","<200","MEETS","MEETS","N/A","N/A",200,30]
["Vulcan Materials Co.","Lenior Quarry - Lenoir","2006-08-25","#67 Stone for Electrochemical","CA91",419986,"Church, Tracy G",22727,7.5,"<30","<200","MEETS","MEETS","N/A","N/A",200,30]
["Vulcan Materials Co.","Lenior Quarry - Lenoir","2006-08-25","#67 Stone for Electrochemical","CA91",419987,"Church, Tracy G",18904,8.1,"<30","<200","MEETS","MEETS","N/A","N/A",200,30]
["Martin Marietta","Pomona Quarry - Greensboro","2006-08-25","#57 Stone for Electrochemical","CA51",420087,"Lorenz, PE, Kris",22883,8.1999999999999993,"<30","<200","MEETS","MEETS","N/A","N/A",200,30]
["Martin Marietta","Pomona Quarry - Greensboro","2006-08-25","#57 Stone for Electrochemical","CA51",420089,"Lorenz, PE, Kris",24876,8.1999999999999993,"<30","<200","MEETS","MEETS","N/A","N/A",200,30]
["Martin Marietta","Pomona Quarry - Greensboro","2006-08-25","#57 Stone for Electrochemical","CA51",420088,"Lorenz, PE, Kris",23364,8.3000000000000007,"<30","<200","MEETS","MEETS","N/A","N/A",200,30]
["Martin Marietta","Pomona Quarry - Greensboro","2006-08-09","#57 Stone for Electrochemical","CA51",419355,"Lorenz, PE, Kris",26000,8.8000000000000007,"<30","<200","MEETS","MEETS","N/A","N/A",200,30]
["Martin Marietta","Pomona Quarry - Greensboro","2006-08-09","#57 Stone for Electrochemical","CA51",419358,"Lorenz, PE, Kris",27000,8.9,"<30","<200","MEETS","MEETS","N/A","N/A",200,30]
["Martin Marietta","Pomona Quarry - Greensboro","2006-08-08","#57 Stone for Electrochemical","CA51",419359,"Lorenz, PE, Kris",25000,8.8000000000000007,"<30","<200","MEETS","MEETS","N/A","N/A",200,30]
["Martin Marietta","Pomona Quarry - Greensboro","2006-08-08","#57 Stone for Electrochemical","CA51",419356,"Lorenz, PE, Kris",23000,8.9,"<30","<200","MEETS","MEETS","N/A","N/A",200,30]
["Martin Marietta","Pomona Quarry - Greensboro","2006-08-07","#57 Stone for Electrochemical","CA51",419357,"Lorenz, PE, Kris",25000,8.9,"<30","<200","MEETS","MEETS","N/A","N/A",200,30]
["Vulcan Materials Co.","Lenior Quarry - Lenoir","2006-08-04","#67 Stone for Electrochemical","CA91",417668,"Church, Tracy G",22370,8,"<30","<200","MEETS","MEETS","N/A","N/A",200,30]
["Harrison Construction Co., Inc.","Waynesville Quarry - Waynesville","2006-06-27","#67 Stone for Electrochemical","CA1",414550,"Rhymer, Robert C",15500,8.4,"<30","<200","MEETS","MEETS","N/A","N/A",200,30]
["Vulcan Materials Co.","Lenior Quarry - Lenoir","2006-06-20","#57 Stone for Electrochemical","CA91",414102,"Church, Tracy G",19720,8.5,"<30","<200","MEETS","MEETS","N/A","N/A",200,30]
["Martin Marietta","Pomona Quarry - Greensboro","2006-04-17","#57 Stone for Electrochemical","CA51",408374,"Lorenz, PE, Kris",23370,8.1,"<30","<200","MEETS","MEETS","N/A","N/A",200,30]
["Martin Marietta","Pomona Quarry - Greensboro","2006-04-17","#57 Stone for Electrochemical","CA51",408369,"Lorenz, PE, Kris",23390,8.1999999999999993,"<30","<200","MEETS","MEETS","N/A","N/A",200,30]
["Martin Marietta","Pomona Quarry - Greensboro","2006-04-07","#57 Stone for Electrochemical","CA51",408367,"Lorenz, PE, Kris",19310,8.6999999999999993,"<30","<200","MEETS","MEETS","N/A","N/A",200,30]
["Martin Marietta","Pomona Quarry - Greensboro","2006-04-07","#57 Stone for Electrochemical","CA51",408366,"Lorenz, PE, Kris",24640,8.6999999999999993,"<30","<200","MEETS","MEETS","N/A","N/A",200,30]
["Martin Marietta","Pomona Quarry - Greensboro","2006-04-05","#57 Stone for Electrochemical","CA51",408360,"Lorenz, PE, Kris",13470,8.4,"<30","<200","MEETS","MEETS","N/A","N/A",200,30]
["Martin Marietta","Pomona Quarry - Greensboro","2006-04-05","#57 Stone for Electrochemical","CA51",408359,"Lorenz, PE, Kris",20460,8.6999999999999993,"<30","<200","MEETS","MEETS","N/A","N/A",200,30]
["Martin Marietta","Pomona Quarry - Greensboro","2006-04-05","#57 Stone for Electrochemical","CA51",408358,"Lorenz, PE, Kris",22750,8.6999999999999993,"<30","<200","MEETS","MEETS","N/A","N/A",200,30]
["Martin Marietta","Pomona Quarry - Greensboro","2006-03-08","#57 Stone for Electrochemical","CA51",405000,"Lorenz, PE, Kris",16930,7.9,"<30","<200","MEETS","MEETS","N/A","N/A",200,30]
["Martin Marietta","Pomona Quarry - Greensboro","2006-03-07","#57 Stone for Electrochemical","CA51",404997,"Lorenz, PE, Kris",17110,7.7,"<30","<200","MEETS","MEETS","N/A","N/A",200,30]
["Martin Marietta","Pomona Quarry - Greensboro","2006-03-07","#57 Stone for Electrochemical","CA51",404999,"Lorenz, PE, Kris",16630,7.8,"<30","<200","MEETS","MEETS","N/A","N/A",200,30]
["Martin Marietta","Pomona Quarry - Greensboro","2006-02-15","#57 Stone for Electrochemical","CA51",403654,"Register, Kenneth D",25150,7.2,"<30","<200","MEETS","MEETS","N/A","N/A",200,30]
["Martin Marietta","Pomona Quarry - Greensboro","2006-01-30","#57 Stone for Electrochemical","CA51",402061,"Lorenz, PE, Kris",25530,8.6999999999999993,"<30","<200","MEETS","MEETS","N/A","N/A",200,30]
["Martin Marietta","Pomona Quarry - Greensboro","2006-01-27","#57 Stone for Electrochemical","CA51",402070,"Lorenz, PE, Kris",26620,9.1,"<30","<200","DOES NOT MEET","MEETS","N/A","N/A",200,30]
["Martin Marietta","Pomona Quarry - Greensboro","2006-01-23","#57 Stone for Electrochemical","CA51",402062,"Lorenz, PE, Kris",27600,8.9,"<30","<200","MEETS","MEETS","N/A","N/A",200,30]
["Martin Marietta","Pomona Quarry - Greensboro","2006-01-23","#57 Stone for Electrochemical","CA51",402063,"Lorenz, PE, Kris",28040,8.9,"<30","<200","MEETS","MEETS","N/A","N/A",200,30]
["Martin Marietta","Pomona Quarry - Greensboro","2006-01-23","#57 Stone for Electrochemical","CA51",402065,"Lorenz, PE, Kris",26030,8.9,"<30","<200","MEETS","MEETS","N/A","N/A",200,30]
["Martin Marietta","Pomona Quarry - Greensboro","2006-01-23","#57 Stone for Electrochemical","CA51",402064,"Lorenz, PE, Kris",26170,9,"<30","<200","MEETS","MEETS","N/A","N/A",200,30]
["Martin Marietta","Pomona Quarry - Greensboro","2006-01-23","#57 Stone for Electrochemical","CA51",402066,"Lorenz, PE, Kris",26820,9.1,"<30","<200","DOES NOT MEET","MEETS","N/A","N/A",200,30]
["Vulcan Materials Co.","Elkin Quarry - Elkin","2006-01-04","#57 Stone for Electrochemical","CA68",400141,"Wagoner, Roy M",34560,7.1,"< 30","< 200","MEETS","MEETS","N/A","N/A",200,30]
["Martin Marietta","Pomona Quarry - Greensboro","2005-12-13","#57 Stone for Electrochemical","CA51",399316,"Lorenz, PE, Kris",23250,7.5,"<30","<200","MEETS","MEETS","N/A","N/A",200,30]
["Martin Marietta","Pomona Quarry - Greensboro","2005-12-13","#57 Stone for Electrochemical","CA51",399317,"Lorenz, PE, Kris",26990,8.4,"<30","<200","MEETS","MEETS","N/A","N/A",200,30]
["Martin Marietta","Pomona Quarry - Greensboro","2005-12-13","#57 Stone for Electrochemical","CA51",399318,"Lorenz, PE, Kris",26050,8.5,"<30","<200","MEETS","MEETS","N/A","N/A",200,30]
["Martin Marietta","Pomona Quarry - Greensboro","2005-12-13","#57 Stone for Electrochemical","CA51",399319,"Lorenz, PE, Kris",22250,8.6,"<30","<200","MEETS","MEETS","N/A","N/A",200,30]
["Martin Marietta","Pomona Quarry - Greensboro","2005-12-13","#57 Stone for Electrochemical","CA51",399320,"Lorenz, PE, Kris",26810,8.8000000000000007,"<30","<200","MEETS","MEETS","N/A","N/A",200,30]
["Vulcan Materials Co.","Elkin Quarry - Elkin","2005-12-08","#57 Stone for Electrochemical","CA68",398494,"Wagoner, Roy M",22990,8.6,"<30","<200","MEETS","MEETS","N/A","N/A",200,30]
["Harrison Construction Co., Inc.","Waynesville Quarry - Waynesville","2005-11-15","#67 Stone for Electrochemical","CA1",396660,"Rhymer, Robert C",9649,7.5,"<30","<200","MEETS","MEETS","N/A","N/A",200,30]
["Martin Marietta","Pomona Quarry - Greensboro","2005-11-08","#57 Stone for Electrochemical","CA51",396848,"Lorenz, PE, Kris",22020,7.8,"<30","<200","MEETS","MEETS","N/A","N/A",200,30]
["Martin Marietta","Pomona Quarry - Greensboro","2005-10-21","#57 Stone for Electrochemical","CA51",394303,"Lorenz, PE, Kris",25180,8,"<30","<200","MEETS","MEETS","N/A","N/A",200,30]
["Martin Marietta","Pomona Quarry - Greensboro","2005-10-21","#57 Stone for Electrochemical","CA51",394311,"Lorenz, PE, Kris",21960,8.1999999999999993,"<30","<200","MEETS","MEETS","N/A","N/A",200,30]
["Martin Marietta","Pomona Quarry - Greensboro","2005-10-21","#57 Stone for Electrochemical","CA51",394305,"Lorenz, PE, Kris",24800,8.3000000000000007,"<30","<200","MEETS","MEETS","N/A","N/A",200,30]
["Martin Marietta","Pomona Quarry - Greensboro","2005-10-20","#57 Stone for Electrochemical","CA51",394191,"Lorenz, PE, Kris",24620,8,"<30","<200","MEETS","MEETS","N/A","N/A",200,30]
["Martin Marietta","Pomona Quarry - Greensboro","2005-10-20","#57 Stone for Electrochemical","CA51",394189,"Lorenz, PE, Kris",27490,8.1,"<30","<200","MEETS","MEETS","N/A","N/A",200,30]
["Martin Marietta","Pomona Quarry - Greensboro","2005-10-20","#57 Stone for Electrochemical","CA51",394190,"Lorenz, PE, Kris",26640,8.1999999999999993,"<30","<200","MEETS","MEETS","N/A","N/A",200,30]
["Martin Marietta","Pomona Quarry - Greensboro","2005-10-18","#57 Stone for Electrochemical","CA51",394307,"Lorenz, PE, Kris",21850,7.8,"<30","<200","MEETS","MEETS","N/A","N/A",200,30]
["Martin Marietta","Pomona Quarry - Greensboro","2005-10-18","#57 Stone for Electrochemical","CA51",394308,"Lorenz, PE, Kris",14490,8,"<30","<200","MEETS","MEETS","N/A","N/A",200,30]
["Martin Marietta","Pomona Quarry - Greensboro","2005-10-18","#57 Stone for Electrochemical","CA51",394309,"Lorenz, PE, Kris",23620,8.1999999999999993,"<30","<200","MEETS","MEETS","N/A","N/A",200,30]
["Martin Marietta","Pomona Quarry - Greensboro","2005-10-18","#57 Stone for Electrochemical","CA51",394310,"Lorenz, PE, Kris",21490,8.1999999999999993,"<30","<200","MEETS","MEETS","N/A","N/A",200,30]
["Vulcan Materials Co.","Elkin Quarry - Elkin","2005-09-29","#57 Stone for Electrochemical","CA68",392253,"Wagoner, Roy M",22500,8.1,"<30","<200","MEETS","MEETS","N/A","N/A",200,30]
["Martin Marietta","Pomona Quarry - Greensboro","2005-09-16","#57 Stone for Electrochemical","CA51",390287,"Lorenz, PE, Kris",21670,7.7,"<30","<200","MEETS","MEETS","N/A","N/A",200,30]
["Hanson Aggregates Southeast, Inc.","Holly Springs Quarry","2005-08-04","#57 Stone for Electrochemical","CA282",387375,"Townsend, Daniel A",25720,7.7,"<30","<200",{"$f":"IF(AND(4.5 <= $I834, $I834 <= 9), \"MEETS\", \"DOES NOT MEET\")","v":"MEETS"},{"$f":"IF(AND(5 <= $I834, $I834 <= 10), \"MEETS\", \"DOES NOT MEET\")","v":"MEETS"},{"$f":"IF(OR(ISBLANK(H834), NOT(ISNUMBER(MATCH($E834, Coastal,0)))), \"N/A\", IF(AND(4.5 <= $I834, $I834 <= 9),IF($H834>=5000,IF($Q834<=100,IF($P834<=200,\"MEETS\",\"DOES NOT MEET\"),\"DOES NOT MEET\"),\"DOES NOT MEET\"),\"DOES NOT MEET\"))","v":"N/A"},{"$f":"IF(OR(ISBLANK(I834), NOT(ISNUMBER(MATCH($E834, Coastal, 0)))), \"N/A\", IF(AND(5 <= $I834, $I834 <= 10),IF($H834>=5000,IF($Q834<=100,IF($P834<=200,\"MEETS\",\"DOES NOT MEET\"),\"DOES NOT MEET\"),\"DOES NOT MEET\"),\"DOES NOT MEET\"))","v":"N/A"},{"$f":"IF(LEFT(K834, 1)=\"<\", VALUE(RIGHT(K834,LEN(K834)-1)), K834)","v":200},{"$f":"IF(LEFT(J834, 1)=\"<\", VALUE(RIGHT(J834,LEN(J834)-1)), J834)","v":30}]
["Martin Marietta","Pomona Quarry - Greensboro","2005-06-29","#57 Stone for Electrochemical","CA51",382281,"Stafford, Jeffrey L",18830,7.9,"<30","<200","MEETS","MEETS","N/A","N/A",200,30]
["Hanson Aggregates Southeast, Inc.","Holly Springs Quarry","2005-06-21","#57 Stone for Electrochemical","CA282",381014,"Townsend, Daniel A",22300,8.6,"<30","<200","MEETS","MEETS","N/A","N/A",200,30]
["Martin Marietta","Pomona Quarry - Greensboro","2005-05-31","#57 Stone for Electrochemical","CA51",378581,"Baughman, Scott A",14440,7.6,"< 30","< 200","MEETS","MEETS","N/A","N/A",200,30]
["Wake Stone Corp.","Knightdale Quarry - Knightdale","2005-04-07","#57 Stone for Electrochemical","CA98",372457,"Wright, Shane",27090,6.6,"< 30","< 200","MEETS","MEETS","N/A","N/A",200,30]
["Wake Stone Corp.","Knightdale Quarry - Knightdale","2005-04-07","#57 Stone for Electrochemical","CA98",372371,"Wright, Shane",21630,6.8,"< 30","< 200","MEETS","MEETS","N/A","N/A",200,30]
["Wake Stone Corp.","Knightdale Quarry - Knightdale","2005-03-22","#57 Stone for Electrochemical","CA98",370781,"Wright, Shane",5923,7.8,"< 30","< 200","MEETS","MEETS","N/A","N/A",200,30]
["Wake Stone Corp.","Knightdale Quarry - Knightdale","2005-03-21","#57 Stone for Electrochemical","CA98",370779,"Wright, Shane",4536,7.8,30,"< 200","MEETS","MEETS","N/A","N/A",200,30]
["Wake Stone Corp.","Knightdale Quarry - Knightdale","2005-02-23","#57 Stone for Electrochemical","CA98",368058,"Wright, Shane",15010,8.1,"< 30","< 200","MEETS","MEETS","N/A","N/A",200,30]
["Wake Stone Corp.","Knightdale Quarry - Knightdale","2005-02-17","#57 Stone for Electrochemical","CA98",367623,"Wright, Shane",18490,8.4,"< 30","< 200","MEETS","MEETS","N/A","N/A",200,30]
["Wake Stone Corp.","Knightdale Quarry - Knightdale","2005-02-10","#57 Stone for Electrochemical","CA98",366749,"Wright, Shane",17040,8.6999999999999993,"< 30","< 200","MEETS","MEETS","N/A","N/A",200,30]
["Wake Stone Corp.","Knightdale Quarry - Knightdale","2005-02-01","#57 Stone for Electrochemical","CA98",365875,"Wright, Shane",18590,7.8,"< 30","< 200","MEETS","MEETS","N/A","N/A",200,30]
["Martin Marietta","Pomona Quarry - Greensboro","2005-01-24","#57 Stone for Electrochemical","CA51",364980,"Lorenz, PE, Kris",17940,8.4,"< 30","< 200","MEETS","MEETS","N/A","N/A",200,30]
["Wake Stone Corp.","Knightdale Quarry - Knightdale","2005-01-20","#57 Stone for Electrochemical","CA98",364751,"Ray, Roy Lynn",17210,8.1,"< 30","< 200","MEETS","MEETS","N/A","N/A",200,30]
["Wake Stone Corp.","Knightdale Quarry - Knightdale","2005-01-10","#57 Stone for Electrochemical","CA98",363425,"Smith, David L",23580,7.5,"<30","<200","MEETS","MEETS","N/A","N/A",200,30]
["Vulcan Materials Co.","Elkin Quarry - Elkin","2005-01-07","#57 Stone for Electrochemical","CA68",363269,"Wagoner, Roy M",21620,7.2,"< 30","< 200","MEETS","MEETS","N/A","N/A",200,30]
["Martin Marietta","Franklin Quarry - Franklinton","2004-10-29","#57 Stone for Electrochemical","CA270",357022,"Myrick, William T",20550,8.5,"<26","<400","MEETS","MEETS","N/A","N/A",400,26]
["Martin Marietta","Franklin Quarry - Franklinton","2004-10-26","#57 Stone for Electrochemical","CA270",356652,"Contino, Daniel L",21700,8.8000000000000007,"<26","<200","MEETS","MEETS","N/A","N/A",200,26]
["Martin Marietta","Franklin Quarry - Franklinton","2004-10-19","#57 Stone for Electrochemical","CA270",355849,"Contino, Daniel L",16770,8.6,"<26","<200","MEETS","MEETS","N/A","N/A",200,26]
["Martin Marietta","Jamestown Quarry - Jamestown","2004-10-19","#57 Stone for Electrochemical","CA46",356100,"Crissman, Albert Lynn",23320,8.3000000000000007,"<26","<400","MEETS","MEETS","N/A","N/A",400,26]
["Martin Marietta","Franklin Quarry - Franklinton","2004-10-07","#57 Stone for Electrochemical","CA270",354557,"Myrick, William T",20450,8.4,"<26","<200","MEETS","MEETS","N/A","N/A",200,26]
["Hanson Aggregates Southeast, Inc.","Rougemont Quarry","2004-09-03","#57 Stone for Electrochemical","CA217",350905,"Turlington, James E",18590,8.4,"<26","<200","MEETS","MEETS","N/A","N/A",200,26]
["Martin Marietta","Franklin Quarry - Franklinton","2004-08-23","#57 Stone for Electrochemical","CA270",349194,"Myrick, William T",28360,7.4,"<26","<200","MEETS","MEETS","N/A","N/A",200,26]
["Martin Marietta","Franklin Quarry - Franklinton","2004-08-17","#57 Stone for Electrochemical","CA270",348529,"Myrick, William T",17150,7.2,"<26","<200","MEETS","MEETS","N/A","N/A",200,26]
["Martin Marietta","Franklin Quarry - Franklinton","2004-08-12","#57 Stone for Electrochemical","CA270",347953,"Myrick, William T",20220,7.8,"<26","<200","MEETS","MEETS","N/A","N/A",200,26]
["Martin Marietta","Franklin Quarry - Franklinton","2004-08-09","#57 Stone for Electrochemical","CA270",347343,"Joyner, PE, W. Steve",18410,7.8,26,"<200","MEETS","MEETS","N/A","N/A",200,26]
["Martin Marietta","Franklin Quarry - Franklinton","2004-07-21","#57 Stone for Electrochemical","CA270",345128,"Joyner, PE, W. Steve",19500,8,26,null,"MEETS","MEETS","N/A","N/A",0,26]
["Thompson Contractors","Miller Creek Quarry - Rutherfordton","2004-07-01","ABC Stone for Electrochemical","CA59",342622,"Worley, Lester V",22050,9,26,null,"MEETS","MEETS","N/A","N/A",0,26]
["Thompson Contractors","Miller Creek Quarry - Rutherfordton","2004-07-01","ABC Stone for Electrochemical","CA59",342623,"Worley, Lester V",24120,9.1,26,null,"DOES NOT MEET","MEETS","N/A","N/A",0,26]
["Martin Marietta","Pomona Quarry - Greensboro","2004-05-06","#57 Stone for Electrochemical","CA51",335650,"Lorenz, PE, Kris",22220,7.9,26,null,"MEETS","MEETS","N/A","N/A",0,26]
["Hanson Aggregates Southeast, Inc.","Rougemont Quarry","2004-04-08","#57 Stone for Electrochemical","CA217",331869,"Silliman, Gregory H",16180,8.8000000000000007,"<26",null,"MEETS","MEETS","N/A","N/A",0,26]
["Vulcan Materials Co.","Cabarrus Quarry - Concord","2004-01-28","#57 Stone for Electrochemical","CA186",324504,"Lynn, Ronald F",21770,8.1,26,null,"MEETS","MEETS","N/A","N/A",0,26]
["Martin Marietta","Hicone Quarry","2003-12-02","#57 Stone for Electrochemical","CA44",320591,"Cassada, James Tim",24160,7.2,26,null,"MEETS","MEETS","N/A","N/A",0,26]
["Martin Marietta","Statesville Quarry - Statesville","2003-11-20","Stone for Erosion Control (#57)","CA54",320107,"Leatherman, Barbara L",21950,6.3,26,null,"MEETS","MEETS","N/A","N/A",0,26]
["Martin Marietta","Hicone Quarry","2003-11-13","#57 Stone for Electrochemical","CA44",318708,"Dearing, Michael",25220,6.7,26,null,"MEETS","MEETS","N/A","N/A",0,26]
["Harrison Construction Co., Inc.","Waynesville Quarry - Waynesville","2003-11-07","#57 Stone for Electrochemical","CA1",318042,"Rhymer, Robert C",18480,6.2,26,null,"MEETS","MEETS","N/A","N/A",0,26]
["Martin Marietta","Hicone Quarry","2003-10-24","#57 Stone for Electrochemical","CA44",316593,"Cassada, James Tim",19870,7.7,26,null,"MEETS","MEETS","N/A","N/A",0,26]
["Martin Marietta","Hicone Quarry","2003-10-22","#57 Stone for Electrochemical","CA44",316279,"Fosque, Robert W",28730,7.7,26,null,"MEETS","MEETS","N/A","N/A",0,26]
["Martin Marietta","Hicone Quarry","2003-10-21","#57 Stone for Electrochemical","CA44",316521,"Cassada, James Tim",21450,7.7,26,null,"MEETS","MEETS","N/A","N/A",0,26]
["Martin Marietta","Hicone Quarry","2003-10-21","#57 Stone for Electrochemical","CA44",316519,"Cassada, James Tim",20760,7.8,26,null,"MEETS","MEETS","N/A","N/A",0,26]
["LBM Industries","Whitewater Falls Quarry - Sapphire","2003-02-24","#57 Stone for Electrochemical","CA119",290231,"Rhymer, Robert C",43478,7.2,26,null,"MEETS","MEETS","N/A","N/A",0,26]
["Martin Marietta","I-40 Sales Yard (Castle Hayne)","2002-10-03","#57 Stone for Electrochemical","CA235",278281,"Allen, Daniel W",14706,8.8000000000000007,26,null,"MEETS","MEETS","N/A","N/A",0,26]
["Harrison Construction Co., Inc.","Waynesville Quarry - Waynesville","2002-09-09","#57 Stone for Electrochemical","CA1",274805,"Rhymer, Robert C",17241,7.2,26,null,"MEETS","MEETS","N/A","N/A",0,26]
["Martin Marietta","I-40 Sales Yard (Castle Hayne)","2002-08-15","#57 Stone for Electrochemical","CA235",271897,"Allen, Daniel W",11765,8.5,26,null,"MEETS","MEETS","N/A","N/A",0,26]
["Martin Marietta","I-40 Sales Yard (Castle Hayne)","2002-06-28","#57 Stone for Electrochemical","CA235",265004,"Allen, Daniel W",19231,6.2,"<26",null,"MEETS","MEETS","N/A","N/A",0,26]
["Boone's Concrete Supply, LLC","Woodlawn Quarry - Marion","2002-05-07","#57 Stone for Electrochemical","CA190",257089,"Tallent, Randy L",10870,8.6999999999999993,"<26",null,"MEETS","MEETS","N/A","N/A",0,26]
["Martin Marietta","I-40 Sales Yard (Castle Hayne)","2002-05-03","#57 Stone for Electrochemical","CA235",257037,"Allen, Daniel W",15873,8.5,"<26",null,"MEETS","MEETS","N/A","N/A",0,26]
["Martin Marietta","Bakers Quarry - Monroe","2002-02-28","#57 Stone for Electrochemical","CA32",248847,"Allen, Daniel W",15630,8.5,"<32",null,"MEETS","MEETS","N/A","N/A",0,32]
["Martin Marietta","I-40 Sales Yard (Castle Hayne)","2002-02-25","#57 Stone for Electrochemical","CA235",248413,"Allen, Daniel W",16950,7.3,null,null,"MEETS","MEETS","N/A","N/A",0,0]
["Vulcan Materials Co.","Elkin Quarry - Elkin","2002-02-22","#57 Stone for Electrochemical","CA68",248839,"Wagoner, Roy M",19610,7.8,"<32",null,"MEETS","MEETS","N/A","N/A",0,32]
["Vulcan Materials Co.","Elkin Quarry - Elkin","2002-02-01","#57 Stone for Electrochemical","CA68",246000,"Wagoner, Roy M",18519,7.1,null,null,"MEETS","MEETS","N/A","N/A",0,0]
["Vulcan Materials Co.","Elkin Quarry - Elkin","2002-01-16","#57 Stone for Electrochemical","CA68",244840,"Wagoner, Roy M",19231,7.3,null,null,"MEETS","MEETS","N/A","N/A",0,0]
["Vulcan Materials Co.","Elkin Quarry - Elkin","2001-12-19","#57 Stone for Electrochemical","CA68",243010,"Wagoner, Roy M",16950,8.1999999999999993,null,null,"MEETS","MEETS","N/A","N/A",0,0]
["Martin Marietta","Pomona Quarry - Greensboro","2001-12-17","#57 Stone for Electrochemical","CA51",242899,"Smith, Joe A",15625,8.1999999999999993,null,null,"MEETS","MEETS","N/A","N/A",0,0]
["Martin Marietta","Pomona Quarry - Greensboro","2001-12-08","#57 Stone for Electrochemical","CA51",242516,"Smith, Joe A",17240,8.6,null,null,"MEETS","MEETS","N/A","N/A",0,0]
["Harrison Construction Co., Inc.","Waynesville Quarry - Waynesville","2001-11-15","#57 Stone for Electrochemical","CA1",239065,"Wallace, Robert R",13900,6.8,null,null,"MEETS","MEETS","N/A","N/A",0,0]
["Harrison Construction Co., Inc.","Dillsboro Quarry - Dillsboro","2001-10-23","#57 Stone for Electrochemical","CA15",235973,"Wallace, Robert R",19600,6.8,null,null,"MEETS","MEETS","N/A","N/A",0,0]
["Harrison Construction Co., Inc.","Massey Branch Quarry - Robbinsville","2001-10-22","#78-M Stone for Electrochemical","CA193",235848,"Wallace, Robert R",8300,5.7,null,null,"MEETS","MEETS","N/A","N/A",0,0]
["Carolina Sunrock LLC","Butner Quarry - Butner","2001-10-12","#57 Stone for Electrochemical","CA178",234863,"Speaks, Dennis",12820,7.4,null,null,"MEETS","MEETS","N/A","N/A",0,0]
["Carolina Sunrock LLC","Butner Quarry - Butner","2001-10-09","#57 Stone for Electrochemical","CA178",233942,"Speaks, Dennis",16400,8.1999999999999993,null,null,"MEETS","MEETS","N/A","N/A",0,0]
["Carolina Sunrock LLC","Butner Quarry - Butner","2001-10-02","#57 Stone for Electrochemical","CA178",232867,"Nosworthy, Kenneth E",15600,9.5,null,null,"DOES NOT MEET","MEETS","N/A","N/A",0,0]
["Carolina Sunrock LLC","Butner Quarry - Butner","2001-09-13","#57 Stone for Electrochemical","CA178",230255,"Speaks, Dennis",17900,9.6,null,null,"DOES NOT MEET","MEETS","N/A","N/A",0,0]
["Carolina Sunrock LLC","Butner Quarry - Butner","2001-08-22","#57 Stone for Electrochemical","CA178",227232,"Speaks, Dennis",16900,9.4,null,null,"DOES NOT MEET","MEETS","N/A","N/A",0,0]
["Martin Marietta","Jamestown Quarry - Jamestown","2001-08-21","#57 Stone for Electrochemical","CA46",226898,"Vincent, Timothy L",37000,8.1999999999999993,null,null,"MEETS","MEETS","N/A","N/A",0,0]
["Martin Marietta","Pomona Quarry - Greensboro","2001-08-20","#57 Stone for Electrochemical","CA51",228157,"Coates, Thomas W",19600,7.9,null,null,{"$f":"IF(AND(4.5 <= $I898, $I898 <= 9), \"MEETS\", \"DOES NOT MEET\")","v":"MEETS"},{"$f":"IF(AND(5 <= $I898, $I898 <= 10), \"MEETS\", \"DOES NOT MEET\")","v":"MEETS"},{"$f":"IF(OR(ISBLANK(H898), NOT(ISNUMBER(MATCH($E898, Coastal,0)))), \"N/A\", IF(AND(4.5 <= $I898, $I898 <= 9),IF($H898>=5000,IF($Q898<=100,IF($P898<=200,\"MEETS\",\"DOES NOT MEET\"),\"DOES NOT MEET\"),\"DOES NOT MEET\"),\"DOES NOT MEET\"))","v":"N/A"},{"$f":"IF(OR(ISBLANK(I898), NOT(ISNUMBER(MATCH($E898, Coastal, 0)))), \"N/A\", IF(AND(5 <= $I898, $I898 <= 10),IF($H898>=5000,IF($Q898<=100,IF($P898<=200,\"MEETS\",\"DOES NOT MEET\"),\"DOES NOT MEET\"),\"DOES NOT MEET\"),\"DOES NOT MEET\"))","v":"N/A"},{"$f":"IF(LEFT(K898, 1)=\"<\", VALUE(RIGHT(K898,LEN(K898)-1)), K898)","v":0},{"$f":"IF(LEFT(J898, 1)=\"<\", VALUE(RIGHT(J898,LEN(J898)-1)), J898)","v":0}]
["Harrison Construction Co., Inc.","Massey Branch Quarry - Robbinsville","2001-08-09","#57 Stone for Electrochemical","CA193",225525,"Wallace, Robert R",83300,7.9,null,null,"MEETS","MEETS","N/A","N/A",0,0]
["Carolina Sunrock LLC","Butner Quarry - Butner","2001-07-18","#57 Stone for Electrochemical","CA178",221988,"Speaks, Dennis",47600,8,null,null,"MEETS","MEETS","N/A","N/A",0,0]
["Vulcan Materials Co.","Lenior Quarry - Lenoir","2001-07-18","#57 Stone for Electrochemical","CA91",221880,"Parsons, Benjamin R",26300,8.1,null,null,"MEETS","MEETS","N/A","N/A",0,0]
["Vulcan Materials Co.","Lenior Quarry - Lenoir","2001-07-11","#57 Stone for Electrochemical","CA91",220852,"Parsons, Benjamin R",21300,7.9,null,null,"MEETS","MEETS","N/A","N/A",0,0]
["Vulcan Materials Co.","115 Quarry - N. Wilkesboro","2001-07-02","#57 Stone for Electrochemical","CA79",219849,"Parsons, Benjamin R",21740,8.1999999999999993,null,null,"MEETS","MEETS","N/A","N/A",0,0]
["Vulcan Materials Co.","115 Quarry - N. Wilkesboro","2001-07-02","#57 Stone for Electrochemical","CA79",219850,"Parsons, Benjamin R",22220,8.1999999999999993,null,null,"MEETS","MEETS","N/A","N/A",0,0]
["Vulcan Materials Co.","115 Quarry - N. Wilkesboro","2001-06-29","#57 Stone for Electrochemical","CA79",219898,"Smith, David L",37000,7.2,null,null,"MEETS","MEETS","N/A","N/A",0,0]
["Vulcan Materials Co.","115 Quarry - N. Wilkesboro","2001-06-29","#57 Stone for Electrochemical","CA79",219897,"Smith, David L",16400,8.1999999999999993,null,null,"MEETS","MEETS","N/A","N/A",0,0]
["Vulcan Materials Co.","115 Quarry - N. Wilkesboro","2001-06-28","#57 Stone for Electrochemical","CA79",219773,"Parsons, Benjamin R",3400,4.5,null,null,"MEETS","DOES NOT MEET","N/A","N/A",0,0]
["Martin Marietta","Jamestown Quarry - Jamestown","2001-06-25","#57 Stone for Electrochemical","CA46",198363,"Vincent, Timothy L",38460,8.3000000000000007,null,null,"MEETS","MEETS","N/A","N/A",0,0]
["Vulcan Materials Co.","115 Quarry - N. Wilkesboro","2001-06-22","#57 Stone for Electrochemical","CA79",198025,"Parsons, Benjamin R",4590,4.5,null,null,"MEETS","DOES NOT MEET","N/A","N/A",0,0]
["Martin Marietta","Jamestown Quarry - Jamestown","2001-06-21","#57 Stone for Electrochemical","CA46",197877,"Vincent, Timothy L",25000,9.1999999999999993,null,null,"DOES NOT MEET","MEETS","N/A","N/A",0,0]
["Martin Marietta","Jamestown Quarry - Jamestown","2001-06-18","#57 Stone for Electrochemical","CA46",197127,"Vincent, Timothy L",25600,9,null,null,"MEETS","MEETS","N/A","N/A",0,0]
["Martin Marietta","Jamestown Quarry - Jamestown","2001-06-14","#57 Stone for Electrochemical","CA46",196561,"Vincent, Timothy L",24400,8.8000000000000007,null,null,"MEETS","MEETS","N/A","N/A",0,0]
["Martin Marietta","Jamestown Quarry - Jamestown","2001-06-06","#57 Stone for Electrochemical","CA46",194725,"Vincent, Timothy L",25000,9,null,null,"MEETS","MEETS","N/A","N/A",0,0]
["Hanson Aggregates Southeast, Inc.","Raleigh Quarry - Wake Forest","2001-06-04","#78-M Stone for Electrochemical","CA67",194279,"Clodgo, PE, David J",17500,8.3000000000000007,null,null,"MEETS","MEETS","N/A","N/A",0,0]
["Martin Marietta","Jamestown Quarry - Jamestown","2001-05-24","#57 Stone for Electrochemical","CA46",192989,"Vincent, Timothy L",23800,9,null,null,"MEETS","MEETS","N/A","N/A",0,0]
["Martin Marietta","Jamestown Quarry - Jamestown","2001-05-14","#57 Stone for Electrochemical","CA46",190423,"Vincent, Timothy L",20800,9,null,null,"MEETS","MEETS","N/A","N/A",0,0]
["Hanson Aggregates Southeast, Inc.","Raleigh Quarry - Wake Forest","2001-05-04","#78-M Stone for Electrochemical","CA67",189001,"Clodgo, PE, David J",14290,9,null,null,"MEETS","MEETS","N/A","N/A",0,0]
["Martin Marietta","Jamestown Quarry - Jamestown","2001-04-30","#57 Stone for Electrochemical","CA46",188454,"Vincent, Timothy L",23810,9.1999999999999993,null,null,"DOES NOT MEET","MEETS","N/A","N/A",0,0]
["Hanson Aggregates Southeast, Inc.","Raleigh Quarry - Wake Forest","2001-04-19","#78-M Stone for Electrochemical","CA67",186626,"Clodgo, PE, David J",16950,8.8000000000000007,null,null,"MEETS","MEETS","N/A","N/A",0,0]
["Hanson Aggregates Southeast, Inc.","Raleigh Quarry - Wake Forest","2001-03-13","#78-M Stone for Electrochemical","CA67",180321,"Clodgo, PE, David J",14500,7.7,null,null,"MEETS","MEETS","N/A","N/A",0,0]
["Martin Marietta","Fuquay Quarry - Fuquay-Varina","2001-02-28","#57 Stone for Electrochemical","CA220",178836,"Townsend, Daniel A",22700,8.3000000000000007,null,null,"MEETS","MEETS","N/A","N/A",0,0]
["Hanson Aggregates Southeast, Inc.","Raleigh Quarry - Wake Forest","2001-02-27","#78-M Stone for Electrochemical","CA67",178171,"Clodgo, PE, David J",20000,7.8,null,null,"MEETS","MEETS","N/A","N/A",0,0]
["L.B.M. Industries","Hewitt Quarry - Topton","2001-02-26","#57 Stone for Electrochemical","CA23",178164,"Wallace, Robert R",15600,8.6,null,null,"MEETS","MEETS","N/A","N/A",0,0]
["Hanson Aggregates Southeast, Inc.","Raleigh Quarry - Wake Forest","2001-01-24","#57 Stone for Electrochemical","CA67",173391,"Clodgo, PE, David J",17200,7.8,null,null,"MEETS","MEETS","N/A","N/A",0,0]
["Martin Marietta","Fuquay Quarry - Fuquay-Varina","2001-01-22","#57 Stone for Electrochemical","CA220",173147,"Townsend, Daniel A",23800,8.5,null,null,"MEETS","MEETS","N/A","N/A",0,0]
["Hanson Aggregates Southeast, Inc.","Raleigh Quarry - Wake Forest","2001-01-05","#57 Stone for Electrochemical","CA67",171083,"Clodgo, PE, David J",13500,7.2,null,null,"MEETS","MEETS","N/A","N/A",0,0]
["Hanson Aggregates Southeast, Inc.","Raleigh Quarry - Wake Forest","2001-01-05","#57 Stone for Electrochemical","CA67",171084,"Clodgo, PE, David J",19200,7.4,null,null,"MEETS","MEETS","N/A","N/A",0,0]
["Martin Marietta","Burlington Quarry - Burlington","2000-10-09","#57 Stone for Electrochemical","CA39",158706,"Miller, Michael R",18900,8.8000000000000007,null,null,"MEETS","MEETS","N/A","N/A",0,0]
["Martin Marietta","Hickory Quarry - Hickory","2000-10-04","#57 Stone for Electrochemical","CA43",157799,"Houser, Ben M",16700,7.5,null,null,"MEETS","MEETS","N/A","N/A",0,0]
["Martin Marietta","Hickory Quarry - Hickory","2000-09-22","#57 Stone for Electrochemical","CA43",156110,"Houser, Ben M",18500,8.3000000000000007,null,null,"MEETS","MEETS","N/A","N/A",0,0]
["Martin Marietta","Hickory Quarry - Hickory","2000-08-21","#57 Stone for Electrochemical","CA43",150122,"Parsons, Benjamin R",22700,7.9,null,null,"MEETS","MEETS","N/A","N/A",0,0]
["Martin Marietta","Pomona Quarry - Greensboro","2000-07-27","#57 Stone for Electrochemical","CA51",146750,"Ferguson, Darrell L",20800,8.1999999999999993,null,null,"MEETS","MEETS","N/A","N/A",0,0]
["Martin Marietta","Burlington Quarry - Burlington","2000-07-22","#57 Stone for Electrochemical","CA39",145220,"Owens, Daniel B",20800,8,null,null,"MEETS","MEETS","N/A","N/A",0,0]
["Martin Marietta","Pomona Quarry - Greensboro","2000-07-19","#57 Stone for Electrochemical","CA51",145157,"Ferguson, Darrell L",21700,8.9,null,null,"MEETS","MEETS","N/A","N/A",0,0]
["Martin Marietta","Pomona Quarry - Greensboro","2000-07-17","#57 Stone for Electrochemical","CA51",145156,"Ferguson, Darrell L",18500,8.6999999999999993,null,null,"MEETS","MEETS","N/A","N/A",0,0]
["Martin Marietta","Pomona Quarry - Greensboro","2000-07-14","#57 Stone for Electrochemical","CA51",145154,"Ferguson, Darrell L",20800,8.3000000000000007,null,null,"MEETS","MEETS","N/A","N/A",0,0]
["Martin Marietta","Pomona Quarry - Greensboro","2000-07-12","#57 Stone for Electrochemical","CA51",143407,"Ferguson, Darrell L",20800,8.9,null,null,"MEETS","MEETS","N/A","N/A",0,0]
["Martin Marietta","Pomona Quarry - Greensboro","2000-07-10","#57 Stone for Electrochemical","CA51",142800,"Ferguson, Darrell L",19200,8.6,null,null,"MEETS","MEETS","N/A","N/A",0,0]
["Martin Marietta","Pomona Quarry - Greensboro","2000-06-30","#57 Stone for Electrochemical","CA51",141348,"Ferguson, Darrell L",24400,9,null,null,"MEETS","MEETS","N/A","N/A",0,0]
["Martin Marietta","Pomona Quarry - Greensboro","2000-06-29","#57 Stone for Electrochemical","CA51",141347,"Ferguson, Darrell L",23800,8.9,null,null,"MEETS","MEETS","N/A","N/A",0,0]
["Martin Marietta","Pomona Quarry - Greensboro","2000-06-24","#57 Stone for Electrochemical","CA51",141019,"Ferguson, Darrell L",25000,8.9,null,null,"MEETS","MEETS","N/A","N/A",0,0]
["Martin Marietta","Pomona Quarry - Greensboro","2000-06-22","#57 Stone for Electrochemical","CA51",141018,"Ferguson, Darrell L",21700,8.1999999999999993,null,null,"MEETS","MEETS","N/A","N/A",0,0]
["Martin Marietta","Pomona Quarry - Greensboro","2000-06-13","#57 Stone for Electrochemical","CA51",138751,"Ferguson, Darrell L",22200,8.5,null,null,"MEETS","MEETS","N/A","N/A",0,0]
["Martin Marietta","Pomona Quarry - Greensboro","2000-06-10","#57 Stone for Electrochemical","CA51",138747,"Ferguson, Darrell L",22700,8.3000000000000007,null,null,"MEETS","MEETS","N/A","N/A",0,0]
["Martin Marietta","Pomona Quarry - Greensboro","2000-06-09","#57 Stone for Electrochemical","CA51",138744,"Ferguson, Darrell L",22700,8,null,null,"MEETS","MEETS","N/A","N/A",0,0]

{"sheet":"Historical Data FineAggregate","index":3,"n_rows":335,"n_cols":15,"rows_kept":335,"cut":false,"hidden":false,"merged":[]}
["Producer Name","Facility Name","Sample Date","Material Description","Facility ID","Sample ID","Sampled By","Resistivity [ohm-cm]:","pH Units:","Chloride [ppm]:","Sulfate [ppm]:","Geosynthetic Spec","Steel Spec","SO4","Cl"]
["Martin Marietta","Edmund Pit - Lexington, SC","2000-07-14","Yearly Quality Check for Fine Aggregate (Strength, Soundness, etc.)","FA265",143321,"Keyes, Terry L",null,null,35.4,null,{"$f":"IF(ISBLANK(I2),\"N/A\",IF(AND(4.5<=$I2,$I2<=9),IF($H2>=3000,IF($O2<=100,IF($N2<=200,\"MEETS\",\"DOES NOT MEET\"),\"DOES NOT MEET\"),\"DOES NOT MEET\"),\"DOES NOT MEET\"))","v":"N/A"},{"$f":"IF(ISBLANK(I2), \"N/A\", IF(AND(5 <= $I2, $I2 <= 10),IF($H2>=3000,IF($O2<=100,IF($N2<=200,\"MEETS\",\"DOES NOT MEET\"),\"DOES NOT MEET\"),\"DOES NOT MEET\"),\"DOES NOT MEET\"))","v":"N/A"},{"$f":"IF(LEFT(K2, 1)=\"<\", VALUE(RIGHT(K2,LEN(K2)-1)), K2)","v":0},{"$f":"IF(LEFT(J2, 1)=\"<\", VALUE(RIGHT(J2,LEN(J2)-1)), J2)","v":35.4}]
["Martin Marietta","Woodleaf Quarry - Salisbury","2000-07-26","Sand, 2MS - Chemistry Check","FA100",145927,"Wrenn, Kevin O",null,null,null,null,"N/A","N/A",0,0]
["Cardinal Stone Company","Carolina Sand Pee Dee Pit","2001-01-31","Sand, 2MS - Chemistry Check","FA22152",175117,"Allen, Daniel W",null,null,7,null,"N/A","N/A",0,7]
["Cardinal Stone Company","Carolina Sand Pee Dee Pit","2001-01-31","Sand, 2MS - Chemistry Check","FA22152",175118,"Allen, Daniel W",null,null,7,null,"N/A","N/A",0,7]
["Hanson Aggregates Southeast, Inc.","Marlboro S&G - Bennettsville","2001-03-08","Sand, 2S - Chemistry Check","FA10",179786,"Chavis, Raymond S",null,null,null,null,"N/A","N/A",0,0]
["Hanson Aggregates Southeast, Inc.","Hasskamp Pit - Horatio, SC","2001-03-20","Sand, 2S","FA117",182599,"Chavis, Raymond S",null,null,null,null,"N/A","N/A",0,0]
["GS Materials, Inc.","Hall Pit - Lemon Springs","2001-04-24","Sand, 2S - Chemistry Check","FA122",187477,"Chavis, Raymond S",null,null,null,null,"N/A","N/A",0,0]
["APAC-Atlantic - Thompson-Arthur","Candor Pit","2001-05-07","Sand, 2S - Chemistry Check","FA60",189728,"Chavis, Raymond S",null,null,null,null,"N/A","N/A",0,0]
["Hedrick Industries","Norman Sand Pit (D&J) - Candor, NC","2001-05-07","Sand, 2S - Chemistry Check","FA111",189730,"Chavis, Raymond S",null,null,null,null,"N/A","N/A",0,0]
["Vulcan Materials Co.","Smith Grove Q. - Mocksville","2001-07-25","Sand, 2MS - Chemistry Check","CA80",223322,"Wagoner, Roy M",null,null,null,null,"N/A","N/A",0,0]
["Maymead Materials, Inc.","421 Quarry - Mountain City, TN","2001-07-30","Sand, 2MS - Chemistry Check","FA164",223851,"Hamby Jr, Kenneth R",null,null,null,null,"N/A","N/A",0,0]
["Vulcan Materials Co.","Boone Quarry - Boone","2001-07-30","Sand, 2MS - Chemistry Check","FA236",223852,"Hamby Jr, Kenneth R",null,null,null,null,"N/A","N/A",0,0]
["Vulcan Materials Co.","Pacolet Quarry - Pacolet, SC","2001-08-09","Sand, 2MS - Chemistry Check","FA212",225521,"McLain Jr, Raeford L",null,null,null,null,"N/A","N/A",0,0]
["Austinville Limestone Co.","Austinville Limestone","2001-08-28","Sand, 2MS - Chemistry Check","FA337",228420,"Wagoner, Roy M",null,null,null,null,"N/A","N/A",0,0]
["GS Materials, Inc.","Emery Pit - Jackson Springs","2002-01-08","Sand, 2S - Chemistry Check","FA113",243674,"Chavis, Raymond S",null,null,"<26",null,"N/A","N/A",0,26]
["Vulcan Materials Co.","115 Quarry - N. Wilkesboro","2002-06-27","Sand, 2MS - Chemistry Check","FA173",264750,"Hamby Jr, Kenneth R",null,null,null,null,"N/A","N/A",0,0]
["Maymead Materials, Inc.","421 Quarry - Mountain City, TN","2002-06-27","Sand, 2MS - Chemistry Check","FA164",264749,"Hamby Jr, Kenneth R",null,null,null,null,"N/A","N/A",0,0]
["Blue Water Industries","Abingdon Quarry","2002-08-22","Sand, 2MS - Chemistry Check","FA88",272854,"Hamby Jr, Kenneth R",null,null,null,null,"N/A","N/A",0,0]
["Vulcan Materials Co.","Bristol Quarry - Bristol, TN","2002-08-22","Sand, 2MS - Chemistry Check","FA66",272855,"Hamby Jr, Kenneth R",null,null,null,null,"N/A","N/A",0,0]
["Blue Water Industries","Watauga Quarry","2002-08-22","Sand, 2MS - Chemistry Check","FA78",272853,"Hamby Jr, Kenneth R",null,null,null,null,"N/A","N/A",0,0]
["Blue Water Industries","Abingdon Quarry","2002-10-03","Sand, 2MS - Chemistry Check","FA88",279423,"Hamby Jr, Kenneth R",null,null,null,null,"N/A","N/A",0,0]
["Vulcan Materials Co.","Bristol Quarry - Bristol, TN","2002-10-03","Sand, 2MS - Chemistry Check","FA66",279424,"Hamby Jr, Kenneth R",null,null,null,null,"N/A","N/A",0,0]
["Blue Water Industries","Watauga Quarry","2002-10-03","Sand, 2MS - Chemistry Check","FA78",279422,"Hamby Jr, Kenneth R",null,null,null,null,"N/A","N/A",0,0]
["L.B.M. Industries","Hewitt Quarry - Topton","2011-01-05","Sand, 2MS - Chemistry Check","FA247",529435,"Rhymer, Robert C",11000,7.7,0,0,"MEETS","MEETS",0,0]
["Wake Stone Corp.","Knightdale Quarry - Knightdale","2011-01-28","Sand, 2MS - Chemistry Check","CA98",531413,"Gowl, Adam L",8217,8.6,0,0,"MEETS","MEETS",0,0]
["Wake Stone Corp.","Triangle Quarry - Cary","2011-02-22","Sand, 2MS - Chemistry Check","CA157",533019,"Gowl, Adam L",6925,8.6999999999999993,0,0,"MEETS","MEETS",0,0]
["Wake Stone Corp.","Triangle Quarry - Cary","2011-03-22","Sand, 2MS - Chemistry Check","CA157",534964,"Gowl, Adam L",5216,9.8000000000000007,0,0,"DOES NOT MEET","MEETS",0,0]
["Wake Stone Corp.","Triangle Quarry - Cary","2011-04-20","Sand, 2MS - Chemistry Check","CA157",537245,"Gowl, Adam L",7716,8.4,0,0,"MEETS","MEETS",0,0]
["Wake Stone Corp.","Triangle Quarry - Cary","2011-05-10","Sand, 2MS - Chemistry Check","CA157",538744,"Gowl, Adam L",3,8.5,0,0,"DOES NOT MEET","DOES NOT MEET",0,0]
["Wake Stone Corp.","Triangle Quarry - Cary","2011-05-24","Sand, 2MS - Chemistry Check","CA157",540670,"Gowl, Adam L",8397,8.9,0,0,"MEETS","MEETS",0,0]
["Wake Stone Corp.","Triangle Quarry - Cary","2011-06-27","Sand, 2MS - Chemistry Check","CA157",543105,"Gowl, Adam L",36670,7.9,0,0,"MEETS","MEETS",0,0]
["Wake Stone Corp.","Triangle Quarry - Cary","2011-06-30","Sand, 2MS - Chemistry Check","CA157",543270,"Gowl, Adam L",14224,8.5,0,0,"MEETS","MEETS",0,0]
["GS Materials, Inc.","Hall Pit - Lemon Springs","2011-07-25","Sand, 2S - Chemistry Check","FA122",595665,"Gowl, Adam L",51572,5,0,0,"MEETS","MEETS",0,0]
["Wake Stone Corp.","Triangle Quarry - Cary","2011-08-09","Sand, 2S - Chemistry Check","CA157",597278,"Gowl, Adam L",8889,7.6,0,0,"MEETS","MEETS",0,0]
["Wake Stone Corp.","Triangle Quarry - Cary","2011-09-20","Sand, 2MS - Chemistry Check","CA157",601722,"Gowl, Adam L",6988,8.6,0,0,"MEETS","MEETS",0,0]
["Wake Stone Corp.","Triangle Quarry - Cary","2011-11-14","Sand, 2MS - Chemistry Check","CA157",607605,"Gowl, Adam L",8176,7.2,0,0,"MEETS","MEETS",0,0]
["Wake Stone Corp.","Triangle Quarry - Cary","2012-01-20","Sand, 2MS - Chemistry Check","CA157",613096,"Gowl, Adam L",7893,6.7,0,0,"MEETS","MEETS",0,0]
["Wake Stone Corp.","Triangle Quarry - Cary","2012-01-20","Sand, 2MS - Chemistry Check","CA157",613126,"Gowl, Adam L",7288,8.4,0,0,"MEETS","MEETS",0,0]
["Wake Stone Corp.","Triangle Quarry - Cary","2012-03-08","Sand, 2MS - Chemistry Check","CA157",617879,"Gowl, Adam L",9560,8.1,0,0,"MEETS","MEETS",0,0]
["Wake Stone Corp.","Triangle Quarry - Cary","2012-03-12","Sand, 2MS - Chemistry Check","CA157",617977,"Gowl, Adam L",7052,7.8,0,0,"MEETS","MEETS",0,0]
["Vulcan Materials Co.","Enka Quarry - Enka","2013-05-29","Sand, 2MS - Chemistry Check","CA69",668686,"Rhymer, Robert C",4277,5.4,0,0,"MEETS","MEETS",0,0]
["Vulcan Materials Co.","East Forsyth Quarry - Kernersville","2013-05-30","Sand, 2MS - Chemistry Check","FA158",668582,"Vincent, Timothy L",9852,7.6,0,0,"MEETS","MEETS",0,0]
["Martin Marietta","Salem Stone Quarry - Kernersville","2013-06-04","Sand, 2MS - Chemistry Check","FA305",668916,"Vincent, Timothy L",4250,7.3,0,0,"MEETS","MEETS",0,0]
["Martin Marietta","Salem Stone Quarry - Kernersville","2013-08-20","Sand, 2MS - Chemistry Check","FA305",677612,"Vincent, Timothy L",7413,7.3,0,0,"MEETS","MEETS",0,0]
["Martin Marietta","Edmund Pit - Lexington, SC","2013-10-03","Sand, 2S - Chemistry Check","FA265",683832,"Rhymer, Robert C",43178,7.1,0,0,"MEETS","MEETS",0,0]
["Martin Marietta","Arrowood Quarry - Charlotte","2013-12-09","Miscellaneous Material for Electrochemical","CA31",692533,"Adair, Mildred (Millie) L",7446,6.7,0,0,"MEETS","MEETS",0,0]
["Martin Marietta","Mallard Creek Quarry - Charlotte","2014-01-02","Miscellaneous Material for Electrochemical","CA188",694428,"Adair, Mildred (Millie) L",11794,8.1999999999999993,0,0,"MEETS","MEETS",0,0]
["Martin Marietta","Charlotte Quarry - Charlotte","2014-01-13","Miscellaneous Material for Electrochemical","CA41",694430,"Adair, Mildred (Millie) L",9930,8.6999999999999993,0,0,"MEETS","MEETS",0,0]
["Martin Marietta","Matthews Quarry - Matthews","2014-01-21","Miscellaneous Material for Electrochemical","CA37",695351,"Thomas, Mark D",12788,8.1,0,0,"MEETS","MEETS",0,0]
["Blue Water Industries","Midway Quarry - Mascot, TN","2014-08-29","Sand, 2MS - Chemistry Check","FA168",725256,"Medford, Robert H",5931,9.1999999999999993,0,0,"DOES NOT MEET","MEETS",0,0]
["American Materials Co.","Bailey Mine - Linden","2014-10-29","Sand, 2S - Chemistry Check","FA483",733305,"Russell, Jonathan T",26695,6,0,0,"MEETS","MEETS",0,0]
["American Materials Co.","Bailey Mine - Linden","2014-10-29","Sand, 2S - Chemistry Check","FA483",733315,"Russell, Jonathan T",35039,5.3,0,0,"MEETS","MEETS",0,0]
["American Materials Co.","Bailey Mine - Linden","2014-10-29","Sand, 2S - Chemistry Check","FA483",733313,"Russell, Jonathan T",34953,5.0999999999999996,0,0,"MEETS","MEETS",0,0]
["Martin Marietta","Matthews Quarry - Matthews","2014-12-08","Miscellaneous Material for Electrochemical","CA37",738409,"Thomas, Mark D",7605,8,0,0,"MEETS","MEETS",0,0]
["American Materials Co.","Bailey Mine - Linden","2014-12-10","Sand, 2S - Chemistry Check","FA483",739129,"Russell, Jonathan T",33134,7.1,0,0,"MEETS","MEETS",0,0]
["American Materials Co.","Bailey Mine - Linden","2014-12-11","Sand, 2S - Chemistry Check","FA483",739135,"Russell, Jonathan T",69013,6.4,0,0,"MEETS","MEETS",0,0]
["American Materials Co.","Bailey Mine - Linden","2014-12-15","Sand, 2S - Chemistry Check","FA483",739132,"Russell, Jonathan T",44743,5.8,0,0,"MEETS","MEETS",0,0]
["American Materials Co.","Bailey Mine - Linden","2015-05-04","Sand, 2S - Chemistry Check","FA483",756586,"Russell, Jonathan T",79491,6.8,0,0,"MEETS","MEETS",0,0]
["American Materials Co.","Bailey Mine - Linden","2015-05-05","Sand, 2S - Chemistry Check","FA483",756587,"Russell, Jonathan T",81967,5.0999999999999996,0,0,"MEETS","MEETS",0,0]
["American Materials Co.","Bailey Mine - Linden","2015-06-17","Sand, 2S - Chemistry Check","FA483",763246,"Russell, Jonathan T",49432,6,0,0,"MEETS","MEETS",0,0]
["Martin Marietta","Bakers Quarry - Monroe","2015-06-24","Miscellaneous Material for Electrochemical","CA32",763935,"Adair, Mildred (Millie) L",11515,9,0,200,"MEETS","MEETS",200,0]
["Martin Marietta","Arrowood Quarry - Charlotte","2015-06-26","Miscellaneous Material for Electrochemical","CA31",763931,"Adair, Mildred (Millie) L",2106,7.7,0,200,"DOES NOT MEET","DOES NOT MEET",200,0]
["Georgia Stone Products","Lynches River Quarry - Jefferson, SC","2015-06-29","Miscellaneous Material for Electrochemical","CA325",764178,"Jordan, Daniel H",16875,8.4,0,200,"MEETS","MEETS",200,0]
["American Materials Co.","Bailey Mine - Linden","2015-07-16","Sand, 2S - Chemistry Check","FA483",766765,"Russell, Jonathan T",52521,5.8,0,200,"MEETS","MEETS",200,0]
["Martin Marietta","Arrowood Quarry - Charlotte","2015-07-23","Miscellaneous Material for Electrochemical","CA31",767814,"Adair, Mildred (Millie) L",8013,8.4,0,0,{"$f":"IF(ISBLANK(I66),\"N/A\",IF(AND(4.5<=$I66,$I66<=9),IF($H66>=3000,IF($O66<=100,IF($N66<=200,\"MEETS\",\"DOES NOT MEET\"),\"DOES NOT MEET\"),\"DOES NOT MEET\"),\"DOES NOT MEET\"))","v":"MEETS"},{"$f":"IF(ISBLANK(I66), \"N/A\", IF(AND(5 <= $I66, $I66 <= 10),IF($H66>=3000,IF($O66<=100,IF($N66<=200,\"MEETS\",\"DOES NOT MEET\"),\"DOES NOT MEET\"),\"DOES NOT MEET\"),\"DOES NOT MEET\"))","v":"MEETS"},{"$f":"IF(LEFT(K66, 1)=\"<\", VALUE(RIGHT(K66,LEN(K66)-1)), K66)","v":0},{"$f":"IF(LEFT(J66, 1)=\"<\", VALUE(RIGHT(J66,LEN(J66)-1)), J66)","v":0}]
["Vulcan Materials Co.","Spruce Pine Quarry - Bakersville","2015-08-11","Sand, 2MS - Chemistry Check","CA111",770808,"Rhymer, Robert C",931966,7.2,0,300,"DOES NOT MEET","DOES NOT MEET",300,0]
["American Materials Co.","Bailey Mine - Linden","2015-08-24","Sand, 2S - Chemistry Check","FA483",773443,"Russell, Jonathan T",69013,6.2,0,0,"MEETS","MEETS",0,0]
["American Materials Co.","Bailey Mine - Linden","2015-08-26","Sand, 2S - Chemistry Check","FA483",773446,"Russell, Jonathan T",60132,5.7,0,0,"MEETS","MEETS",0,0]
["American Materials Co.","Bailey Mine - Linden","2015-08-27","Sand, 2S - Chemistry Check","FA483",773447,"Russell, Jonathan T",60350,5.4,0,0,"MEETS","MEETS",0,0]
["Martin Marietta","Matthews Quarry - Matthews","2015-11-12","Sand, 2MS - Chemistry Check","CA37",783957,"Adair, Mildred (Millie) L",3383,7.6,5,300,"DOES NOT MEET","DOES NOT MEET",300,5]
["Ararat Rock Products","Mt. Airy Quarry - Mt. Airy","2016-01-11","Miscellaneous Material for Electrochemical","CA3",790444,"Whitley, Christopher D",1655,7.7,10,0,"DOES NOT MEET","DOES NOT MEET",0,10]
["Hedrick Industries","South McDowell Quarry - Marion","2016-01-29","Screenings - Chemistry Check","CA283",792270,"Rhymer, Robert C",9497,7,5.4,33.6,"MEETS","MEETS",33.6,5.4]
["Dawson Contracting Inc","Ashley Heights Sand","2016-02-03","Sand, 2S - Chemistry Check","FA494",792505,"Jordan, Daniel H",90498,6.5,0,6.9,"MEETS","MEETS",6.9,0]
["SC Rock","Goretown Mine -- Longs, SC","2016-02-03","Screenings - Chemistry Check","FA344",792514,"Walker, Steven E",6510,8.1999999999999993,0,37.9,"MEETS","MEETS",37.9,0]
["Wade Moore Equipment Co.","Fleming Pit - Louisburg","2016-02-04","Sand, 2S - Chemistry Check","FA165",792780,"Skinner, III, John L",92678,6.8,0,7.1,"MEETS","MEETS",7.1,0]
["Carolina Sunrock LLC","Kittrell Quarry - Kittrell","2016-02-04","Screenings - Chemistry Check","CA304",792563,"Skinner, III, John L",9872,7.9,5,67.7,"MEETS","MEETS",67.7,5]
["Martin Marietta","Pomona Quarry - Greensboro","2016-02-04","Sand, 2MS - Chemistry Check","CA51",792603,"Westmoreland, Braxton J",24498,9.1,0,27.3,"DOES NOT MEET","MEETS",27.3,0]
["Martin Marietta","Loamy Sand and Gravel - Bethune, SC","2016-02-05","Sand, 2S - Chemistry Check","FA429",793009,"Jordan, Daniel H",94967,5.0999999999999996,5,2.1,"MEETS","MEETS",2.1,5]
["Martin Marietta","Raleigh-Durham Quarry - Raleigh","2016-02-05","Screenings - Chemistry Check","CA156",792804,"Skinner, III, John L",10752,8.6,0,62.1,"MEETS","MEETS",62.1,0]
["Thomas Cement, Inc.","Simpson Mine - Pageland, SC","2016-02-05","Sand, 2S - Chemistry Check","FA456",793008,"Jordan, Daniel H",68540,5.0999999999999996,5,1.7,"MEETS","MEETS",1.7,5]
["Carolina Sunrock LLC","Butner Quarry - Butner","2016-02-08","Sand, 2MS - Chemistry Check","FA171",793012,"Skinner, III, John L",7930,10,0,9,"DOES NOT MEET","MEETS",9,0]
["Martin Marietta","Garner Quarry - Garner","2016-02-09","Sand, 2MS - Chemistry Check","FA382",793219,"Skinner, III, John L",18765,8.1999999999999993,5,2.4,"MEETS","MEETS",2.4,5]
["Wake Stone Corp.","Knightdale Quarry - Knightdale","2016-02-09","Sand, 2MS - Chemistry Check","FA481",793144,"Skinner, III, John L",13198,8.9,5,8.9,"MEETS","MEETS",8.9,5]
["Pea Creek Mines","Pea Creek Mines","2016-02-09","Sand, 2S - Chemistry Check","FA447",793199,"Cobb, James R",11682,3.9,0,18.5,"DOES NOT MEET","DOES NOT MEET",18.5,0]
["Martin Marietta","Reidsville Quarry - Reidsville","2016-02-09","Screenings - Chemistry Check","CA52",793251,"Loshinskiy, Roman",16518,9,5,18.899999999999999,"MEETS","MEETS",18.899999999999999,5]
["Hanson Aggregates Southeast, Inc.","Brewer (Pageland #1) - Jefferson, SC","2016-02-10","Sand, 2MS - Chemistry Check","FA64",793426,"Jordan, Daniel H",63052,7.3,0,9.5,"MEETS","MEETS",9.5,0]
["Vulcan Materials Co.","Greystone Quarry - Henderson","2016-02-10","Sand, 2MS - Chemistry Check","FA183",793398,"Skinner, III, John L",14501,8.5,0,10.9,"MEETS","MEETS",10.9,0]
["Hanson Aggregates Southeast, Inc.","Jefferson Quarry - Jefferson, SC","2016-02-10","Screenings - Chemistry Check","CA120",793427,"Jordan, Daniel H",10508,7.2,5.4,8.6999999999999993,"MEETS","MEETS",8.6999999999999993,5.4]
["Vulcan Materials Co.","Skippers Quarry - Skippers, VA","2016-02-10","Screenings - Chemistry Check","CA55",793425,"Thomas, Grady Q",7440,8.9,10,37.700000000000003,"MEETS","MEETS",37.700000000000003,10]
["Georgia Stone Products","Lynches River Quarry - Jefferson, SC","2016-02-11","Sand, 2MS - Chemistry Check","FA425",793639,"Jordan, Daniel H",23154,7.3,0,9.1999999999999993,"MEETS","MEETS",9.1999999999999993,0]
["Neuse Sand And Gravel","Tilghman Pit","2016-02-11","Sand, 2S - Chemistry Check","FA446",793688,"Cobb, James R",19829,4.4000000000000004,0,14.3,"DOES NOT MEET","DOES NOT MEET",14.3,0]
["Martin Marietta","Franklin Quarry - Franklinton","2016-02-12","Sand, 2MS - Chemistry Check","FA349",793726,"Skinner, III, John L",14188,7.8,0,10.8,"MEETS","MEETS",10.8,0]
["Hanson Aggregates Southeast, Inc.","Raleigh Quarry - Wake Forest","2016-02-12","Screenings - Chemistry Check","CA67",793722,"Skinner, III, John L",17053,7.4,0,0,"MEETS","MEETS",0,0]
["Hanson Aggregates Southeast, Inc.","Rougemont Quarry","2016-02-16","Sand, 2MS - Chemistry Check","FA464",793937,"Skinner, III, John L",19128,8.3000000000000007,0,9.8000000000000007,"MEETS","MEETS",9.8000000000000007,0]
["Boxley Materials Company","Fieldale Quarry - Martinsville, VA","2016-02-17","Sand, 2MS - Chemistry Check","CA142",794066,"Westmoreland, Braxton J",6061,7.7,0,57.1,"MEETS","MEETS",57.1,0]
["Salem Stone Corp.","Southside Materials - Shelton Quarry - Pelham","2016-02-17","Screenings - Chemistry Check","CA75",794125,"Loshinskiy, Roman",23469,8.3000000000000007,0,0,"MEETS","MEETS",0,0]
["APAC-Atlantic - Thompson-Arthur","Candor Pit","2016-02-19","Sand, 2S - Chemistry Check","FA60",794457,"Jackson, Brandon M",126183,6.7,0,5,"MEETS","MEETS",5,0]
["Hanson Aggregates Southeast, Inc.","Crabtree Quarry - Raleigh","2016-02-19","Screenings - Chemistry Check","CA61",794472,"Skinner, III, John L",13367,8.3000000000000007,0,8.6,"MEETS","MEETS",8.6,0]
["Martin Marietta","Fountain Quarry - Fountain","2016-02-19","Screenings - Chemistry Check","CA42",794454,"Cobb, James R",8496,8.3000000000000007,0,13.3,"MEETS","MEETS",13.3,0]
["Rogers Group, Inc.","Henrietta Quarry - Mooresboro","2016-02-19","Screenings - Chemistry Check","CA369",794436,"Rhymer, Robert C",7663,8,5.4,24.7,"MEETS","MEETS",24.7,5.4]
["Martin Marietta","Lemon Springs - Sanford","2016-02-19","Screenings - Chemistry Check","CA97",794479,"Jackson, Brandon M",10602,8.5,0,10.7,"MEETS","MEETS",10.7,0]
["Hanson Aggregates Southeast, Inc.","Marlboro S&G - Bennettsville","2016-02-19","Sand, 2S - Chemistry Check","FA10",794731,"Jordan, Daniel H",109565,4.8,0,4.2,"MEETS","DOES NOT MEET",4.2,0]
["Martin Marietta","Arrowood Quarry - Charlotte","2016-02-22","Miscellaneous Material for Electrochemical","CA31",796285,"Adair, Mildred (Millie) L",2182,7.5,0,198.3,"DOES NOT MEET","DOES NOT MEET",198.3,0]
["Martin Marietta","Mallard Creek Quarry - Charlotte","2016-02-22","Sand, 2MS - Chemistry Check","FA423",794786,"Pegues, Jr., Henderson",18875,8.8000000000000007,0,4.2,"MEETS","MEETS",4.2,0]
["Vulcan Materials Co.","Pineville Quarry - Charlotte","2016-02-24","Miscellaneous Material for Electrochemical","CA101",796027,"Adair, Mildred (Millie) L",5187,7.7,0,76.5,"MEETS","MEETS",76.5,0]
["Hanson Aggregates Southeast, Inc.","Holly Springs Quarry","2016-02-26","Screenings - Chemistry Check","CA282",795306,"Skinner, III, John L",7553,7.9,0,27.8,"MEETS","MEETS",27.8,0]
["Martin Marietta","Burlington Quarry - Burlington","2016-02-29","Screenings - Chemistry Check","CA39",795925,"Loshinskiy, Roman",8518,8.1999999999999993,0,29.3,"MEETS","MEETS",29.3,0]
["Vulcan Materials Co.","Stokesdale Quarry - Stokesdale","2016-03-03","Screenings - Chemistry Check","CA76",796410,"Fosque, Robert W",24661,8.5,0,4.8,"MEETS","MEETS",4.8,0]
["American Materials Co.","Black Creek Plant - Mt. Croghan, SC","2016-03-04","Select Material, Class III, Type 3 - Chemistry Check","FA422",797150,"Jordan, Daniel H",96618,5.5,0,5.0999999999999996,"MEETS","MEETS",5.0999999999999996,0]
["Salem Stone Corp.","Cardinal Realty - Galax Quarry - Galax, VA","2016-03-07","Miscellaneous Material for Electrochemical","CA11",797296,"Whitley, Christopher D",4916,9.5,0,28,"DOES NOT MEET","MEETS",28,0]
["GS Materials, Inc.","Hall Pit - Lemon Springs","2016-03-08","Sand, 2S - Chemistry Check","FA122",796684,"Murphy, Billy J",117385,5.4,0,6.1,"MEETS","MEETS",6.1,0]
["Weeks Sand Company","Weeks Sand #3","2016-03-08","Sand, 2S - Chemistry Check","FA368",796682,"Murphy, Billy J",62344,5.2,0,5.0999999999999996,"MEETS","MEETS",5.0999999999999996,0]
["Wake Stone Corp.","Nash County Quarry - Battleboro","2016-03-11","Sand, 2MS - Chemistry Check","FA480",797388,"Raines, James R",8361,8.5,0,12.1,"MEETS","MEETS",12.1,0]
["Hanson Aggregates Southeast, Inc.","Neverson Quarry - Sims","2016-03-15","Sand, 2MS - Chemistry Check","CA66",798235,"Raines, James R",25867,7.9,0,4.5,"MEETS","MEETS",4.5,0]
["Martin Marietta","Benson Quarry - Benson","2016-03-16","Screenings - Chemistry Check","CA176",798245,"Raines, James R",10971,8,0,8.1,"MEETS","MEETS",8.1,0]
["Hedrick Industries","Piedmont (Pageland #3) - Pageland, SC","2016-03-18","Sand, 2MS","FA239",798283,"Jordan, Daniel H",25530,6.8,0,12.8,"MEETS","MEETS",12.8,0]
["American Materials Co.","Black Creek Plant - Mt. Croghan, SC","2016-03-22","Sand, 2MS","FA422",798885,"Jordan, Daniel H",127113,7.4,0,11.2,"MEETS","MEETS",11.2,0]
["Oldcastle Stone Products - Bonsal Mining","Lilesville Pit","2016-03-23","Sand, 2S","FA6",799217,"Jackson, Brandon M",139121,6.8,0,6.1,"MEETS","MEETS",6.1,0]
["Vulcan Materials Co.","North Quarry - Winston Salem","2016-03-23","Sand, 2MS - Chemistry Check","CA72",798945,"Wallace, Weston G",24278,8,0,7.1,"MEETS","MEETS",7.1,0]
["Hedrick Industries","B.V. Hedrick Gravel & Sand - Lilesville","2016-03-24","Sand, 2S - Chemistry Check","CA379",799231,"Jackson, Brandon M",185254,7.2,0,6.2,"MEETS","MEETS",6.2,0]
["Hanson Aggregates Southeast, Inc.","Princeton Quarry","2016-03-24","Screenings - Chemistry Check","CA64",799118,"Raines, James R",6472,8.4,10,14.1,"MEETS","MEETS",14.1,10]
["American Materials Co.","Dupree Mine - Greenville","2016-03-29","Sand, 2S - Chemistry Check","FA478",799594,"Cobb, James R",21245,4.8,0,16.3,"MEETS","DOES NOT MEET",16.3,0]
["Luck Stone Corporation","Pittsboro Quarry - Moncure","2016-03-29","Miscellaneous Material for Electrochemical","CA292",799661,"Jackson, Brandon M",3383,7.3,0,123,"MEETS","MEETS",123,0]
["Appalachian Aggregates, LLC","Bluefield Plant","2016-04-05","Miscellaneous Material for Electrochemical","CA307",800739,"Whitley, Christopher D",9766,8.6999999999999993,8.6,17.5,"MEETS","MEETS",17.5,8.6]
["Mid-East Services, Inc.","Massengill Mine","2016-04-05","Sand, 2S - Chemistry Check","FA384",801022,"Raines, James R",87108,7.4,0,5.2,"MEETS","MEETS",5.2,0]
["Matthews Sand and Gravel","Matthews 3 Pit","2016-04-05","Sand, 2S - Chemistry Check","FA472",801023,"Raines, James R",71531,7.3,0,0,"MEETS","MEETS",0,0]
["Best Sand & Gravel, Inc.","Brooks Pit - Goldsboro","2016-04-07","Sand, 2S - Chemistry Check","FA340",801024,"Raines, James R",16537,7.3,0,0,"MEETS","MEETS",0,0]
["Hedrick Industries","Grove Stone Quarry - Black Mountain","2016-04-08","Screenings - Chemistry Check","FA400",801536,"Rhymer, Robert C",8157,7.5,0,38.799999999999997,"MEETS","MEETS",38.799999999999997,0]
["Martin Marietta","Charlotte Quarry - Charlotte","2016-04-14","Miscellaneous Material for Electrochemical","CA41",802309,"Adair, Mildred (Millie) L",9970,7.7,0,8.6,{"$f":"IF(ISBLANK(I130),\"N/A\",IF(AND(4.5<=$I130,$I130<=9),IF($H130>=3000,IF($O130<=100,IF($N130<=200,\"MEETS\",\"DOES NOT MEET\"),\"DOES NOT MEET\"),\"DOES NOT MEET\"),\"DOES NOT MEET\"))","v":"MEETS"},{"$f":"IF(ISBLANK(I130), \"N/A\", IF(AND(5 <= $I130, $I130 <= 10),IF($H130>=3000,IF($O130<=100,IF($N130<=200,\"MEETS\",\"DOES NOT MEET\"),\"DOES NOT MEET\"),\"DOES NOT MEET\"),\"DOES NOT MEET\"))","v":"MEETS"},{"$f":"IF(LEFT(K130, 1)=\"<\", VALUE(RIGHT(K130,LEN(K130)-1)), K130)","v":8.6},{"$f":"IF(LEFT(J130, 1)=\"<\", VALUE(RIGHT(J130,LEN(J130)-1)), J130)","v":0}]
["Hanson Aggregates Southeast, Inc.","Rocky Mount Quarry (#2)","2016-04-14","Sand, 2MS - Chemistry Check","FA491",802199,"Raines, James R",19135,8.4,0,38.799999999999997,"MEETS","MEETS",38.799999999999997,0]
["GS Materials, Inc.","Blue Water Sand & Gravel - Mill Creek Pit","2016-04-15","Sand, 2S - Chemistry Check","FA489",803132,"Raines, James R",46729,4.9000000000000004,0,8,"MEETS","DOES NOT MEET",8,0]
["GS Materials, Inc.","Emery Pit - Jackson Springs","2016-04-15","Sand, 2S - Chemistry Check","FA113",802369,"Jackson, Brandon M",73529,6.8,0,4.2,"MEETS","MEETS",4.2,0]
["Mar-Mac Sand and Gravel, LLC","Mar-Mac Sand & Gravel - Goldsboro","2016-04-15","Sand, 2S - Chemistry Check","FA336",803130,"Raines, James R",1812,3.1,8.6,146,"DOES NOT MEET","DOES NOT MEET",146,8.6]
["PGS Aggregates, LLC","Great Pit","2016-04-18","Sand, 2S - Chemistry Check","FA254",803141,"Raines, James R",49727,5.0999999999999996,0,7.1,"MEETS","MEETS",7.1,0]
["Vulcan Materials Co.","Morganton Quarry - Morganton","2016-04-21","Screenings - Chemistry Check","FA85",803463,"Ausley, Jeff A",10686,8.5,0,0,"MEETS","MEETS",0,0]
["Stony Creek Sand and Gravel, LLC","Stony Creek Sand & Gravel - Carson, VA","2016-04-22","Sand, 2S - Chemistry Check","FA503",803774,"Raines, James R",8210,4.0999999999999996,4.3,31.3,"DOES NOT MEET","DOES NOT MEET",31.3,4.3]
["Vulcan Materials Co.","Smith Grove Q. - Mocksville","2016-04-26","Sand, 2MS - Chemistry Check","FA76",803859,"Wallace, Weston G",6254,6.2,0,49,"MEETS","MEETS",49,0]
["American Materials Co.","Wade Pit - Wade","2016-05-10","Sand, 2S - Chemistry Check","FA211",805958,"Murphy, Billy J",91075,5.8,0,7.3,"MEETS","MEETS",7.3,0]
["LBM Industries","Whitewater Falls - Sapphire","2016-05-24","Sand, 2MS - Chemistry Check","FA162",808253,"Wood, Dean Michael M",12303,7.9,2.1,24.8,"MEETS","MEETS",24.8,2.1]
["LBM Industries","Whitewater Falls - Sapphire","2016-05-24","Screenings - Chemistry Check","FA162",808254,"Wood, Dean Michael M",14663,8.6,2.1,9.3000000000000007,"MEETS","MEETS",9.3000000000000007,2.1]
["Bent River Materials","Bent River Pit","2016-06-08","Sand, 2S - Chemistry Check","FA460",810508,"Thomas, Grady Q",45393,6.4,2.1,14.8,"MEETS","MEETS",14.8,2.1]
["Vulcan Materials Co.","Rockingham Quarry - Rockingham","2016-06-09","Sand, 2MS - Chemistry Check","FA374",810588,"Tucker, Rusty J",9407,8.9,2.1,16.7,"MEETS","MEETS",16.7,2.1]
["Commercial Ready Mix Products","Newsome Pit #2 - Pendleton","2016-06-10","Sand, 2S - Chemistry Check","FA317",810907,"Thomas, Grady Q",47103,5.0999999999999996,2.1,16.100000000000001,"MEETS","MEETS",16.100000000000001,2.1]
["B.E. Singleton & Sons, Inc.","Talley-Whichard Pitt","2016-06-13","Sand, 2S - Chemistry Check","FA488",810903,"Cobb, James R",109613,6.8,2.1,15.1,"MEETS","MEETS",15.1,2.1]
["Vulcan Materials Co.","Penrose Quarry - Pisgah Forest","2016-06-14","Screenings - Chemistry Check","FA229",811091,"Wood, Dean Michael M",14872,8.8000000000000007,2.1,13.2,"MEETS","MEETS",13.2,2.1]
["Vulcan Materials Co.","Lenior Quarry - Lenoir","2016-06-24","Miscellaneous Material for Electrochemical","CA91",815310,"Church, Tracy G",11291,8.5,2.1,25,"MEETS","MEETS",25,2.1]
["Harrison Construction Co., Inc.","Hayesville Quarry - Hayesville","2016-07-15","Screenings - Chemistry Check","FA542",816297,"Ledford, Brandon S",2440,7.8,2.1,144.69999999999999,"DOES NOT MEET","DOES NOT MEET",144.69999999999999,2.1]
["Westside Minerals LLC","Dempsey Wood Pit - LaGrange","2016-07-27","Sand, 2S - Chemistry Check","FA403",818140,"Cobb, James R",4955,3.9,12.9,65.8,"DOES NOT MEET","DOES NOT MEET",65.8,12.9]
["Salem Stone Corp.","Cardinal Quarries - Smethport Quarry - W. Jefferson","2016-08-02","Miscellaneous Material for Electrochemical","CA123",819964,"Church, Tracy G",3880,8,0,73,"MEETS","MEETS",73,0]
["Martin Marietta","Clarks Quarry - New Bern","2016-08-03","Miscellaneous Material for Electrochemical","CA189",819245,"Maynard, William BJ T",8163,8.4,0,31.8,"MEETS","MEETS",31.8,0]
["Martin Marietta","Clarks Quarry - New Bern","2016-08-03","Sand, 2MS - Chemistry Check","FA214",819242,"Maynard, William BJ T",932,7.4,0,612,"DOES NOT MEET","DOES NOT MEET",612,0]
["Martin Marietta","Charlotte Quarry - Charlotte","2016-09-08","Sand, 2MS - Chemistry Check","FA562",825585,"Adair, Mildred (Millie) L",6112,7.5,0,50.7,"MEETS","MEETS",50.7,0]
["Martin Marietta","Statesville Quarry - Statesville","2016-09-09","Miscellaneous Material for Electrochemical","CA54",825461,"Whitley, Christopher D",2408,7.3,0,192,"DOES NOT MEET","DOES NOT MEET",192,0]
["Martin Marietta","Bonds Quarry - Concord","2016-09-19","Sand, 2MS - Chemistry Check","FA392",826548,"Pegues, Jr., Henderson",3953,7.3,0,103.2,"MEETS","MEETS",103.2,0]
["Harrison Construction Co., Inc.","Waynesville Quarry - Waynesville","2016-09-26","Screenings - Chemistry Check","FA564",827851,"Kindley, Wallace Quint",2380,7.5,0,40.9,"DOES NOT MEET","DOES NOT MEET",40.9,0]
["Harrison Construction Co., Inc.","Dillsboro Quarry - Dillsboro","2016-10-04","Screenings - Chemistry Check","FA573",828925,"Kindley, Wallace Quint",1382,7.3,0,33.5,"DOES NOT MEET","DOES NOT MEET",33.5,0]
["Vulcan Materials Co.","Pineville Quarry - Charlotte","2016-10-06","Screenings - Chemistry Check","FA266",832586,"Adair, Mildred (Millie) L",1872,7.6,0,93.3,"DOES NOT MEET","DOES NOT MEET",93.3,0]
["Hedrick Industries","North Buncombe Quarry - Asheville","2016-10-10","Screenings - Chemistry Check","FA126",829882,"Kindley, Wallace Quint",867,3.4,17.7,43.7,"DOES NOT MEET","DOES NOT MEET",43.7,17.7]
["McCrary Stone","Marshall Quarry - Marshall","2016-10-17","Screenings - Chemistry Check","FA557",830775,"Kindley, Wallace Quint",5718,8.1,0,36.6,"MEETS","MEETS",36.6,0]
["Vulcan Materials Co.","Havre De Grace Quarry - Havre De Grace, MD","2016-10-26","Screenings - Chemistry Check","FA584",832493,"Bonds, Maria M",2755,7.9,17.7,70.5,"DOES NOT MEET","DOES NOT MEET",70.5,17.7]
["Vulcan Materials Co.","Jack Quarry - Petersburg, VA","2016-10-26","Screenings - Chemistry Check","FA549",832475,"Bonds, Maria M",7880,9,0,12.3,"MEETS","MEETS",12.3,0]
["Vulcan Materials Co.","Puddledock Quarry - Prince George, VA","2016-10-26","Sand, 2S - Chemistry Check","FA172",832522,"Bonds, Maria M",48146,4.7,0,0,"MEETS","DOES NOT MEET",0,0]
["McCrary Stone","Low Gap Quarry - Burnsville","2016-10-27","Screenings - Chemistry Check","FA540",832526,"Kindley, Wallace Quint",2322,7.6,0,60.4,"DOES NOT MEET","DOES NOT MEET",60.4,0]
["Martin Marietta","Mallard Creek Quarry - Charlotte","2016-11-01","Sand, 2MS - Chemistry Check","FA423",832986,"Pegues, Jr., Henderson",12887,9.1,0,3.5,"DOES NOT MEET","MEETS",3.5,0]
["Sloan Construction Co.","Blacksburg Quarry - Blacksburg, SC","2016-11-22","Miscellaneous Material for Electrochemical","CA382",836477,"Brinson, Joseph",53937,6.9,0,0,"MEETS","MEETS",0,0]
["Sloan Construction Co.","Blacksburg Quarry - Blacksburg, SC","2016-11-22","Screenings - Chemistry Check","FA476",836479,"Brinson, Joseph",19342,5.4,0,8.6999999999999993,"MEETS","MEETS",8.6999999999999993,0]
["Martin Marietta","Arrowood Quarry - Charlotte","2016-12-06","Sand, 2MS - Chemistry Check","FA203",837865,"Adair, Mildred (Millie) L",3339,7.3,8.9,8.5,"MEETS","MEETS",8.5,8.9]
["Vulcan Materials Co.","Morganton Quarry - Morganton","2016-12-06","Screenings - Chemistry Check","FA85",838536,"Ausley, Jeff A",7402,7.7,0,26.3,"MEETS","MEETS",26.3,0]
["Vulcan Materials Co.","Spruce Pine Quarry - Bakersville","2016-12-06","Screenings - Chemistry Check","FA558",838537,"Ausley, Jeff A",4955,7,0,48,"MEETS","MEETS",48,0]
["Hedrick Industries","Grove Stone Quarry - Black Mountain","2016-12-12","Yearly Quality Check for Fine Aggregate (Strength, Soundness, etc.)","FA400",838364,"Rhymer, Robert C",6575,7.3,0,22.2,"MEETS","MEETS",22.2,0]
["Hedrick Industries","Lake Norman Quarry","2016-12-13","Sand, 2MS - Chemistry Check","FA226",838936,"Kindley, Wallace Quint",10284,8.5,0,3.8,"MEETS","MEETS",3.8,0]
["Carolina Sand","Burke County Pit","2016-12-14","Sand, 2S - Chemistry Check","FA334",839021,"Ausley, Jeff A",35486,6.7,0,4.5999999999999996,"MEETS","MEETS",4.5999999999999996,0]
["Hanson Aggregates Southeast, Inc.","Jefferson Quarry - Jefferson, SC","2016-12-14","Miscellaneous Material for Electrochemical","CA120",838779,"Jordan, Daniel H",14691,8.1,0,0,"MEETS","MEETS",0,0]
["Hanson Aggregates Southeast, Inc.","Sandy Flats Quarry - Taylors, SC","2016-12-14","Sand, 2MS - Chemistry Check","FA438",839146,"Wood, Dean Michael M",14616,7.8,0,5.6,"MEETS","MEETS",5.6,0]
["Martin Marietta","Denver Quarry - Denver","2016-12-20","Sand, 2MS - Chemistry Check","FA377",839463,"Brinson, Joseph",2731,7.7,0,74,"DOES NOT MEET","DOES NOT MEET",74,0]
["Hedrick Industries","South McDowell Quarry - Marion","2017-01-13","Screenings - Chemistry Check","FA415",841899,"Rhymer, Robert C",10930,7.5,0,55.9,"MEETS","MEETS",55.9,0]
["Ararat Rock Products","Mt. Airy Quarry - Mt. Airy","2017-01-31","Miscellaneous Material for Electrochemical","CA3",843862,"Whitley, Christopher D",9355,7.7,0,64.400000000000006,"MEETS","MEETS",64.400000000000006,0]
["Martin Marietta","Denver Quarry - Denver","2017-02-06","Sand, 2MS - Chemistry Check","FA377",844563,"Brinson, Joseph",6693,7.3,0,92,"MEETS","MEETS",92,0]
["Vulcan Materials Co.","Skippers Quarry - Skippers, VA","2017-02-07","Screenings - Chemistry Check","FA531",844774,"Thomas, Grady Q",5382,7.9,22.1,18,"MEETS","MEETS",18,22.1]
["Blue Water Industries","Midway Quarry - Mascot, TN","2017-02-20","Sand, 2MS - Chemistry Check","FA168",845874,"Rhymer, Robert C",4405,9.4,8.9,37.4,"DOES NOT MEET","MEETS",37.4,8.9]
["Vulcan Materials Co.","Penrose Quarry - Pisgah Forest","2017-03-07","Screenings - Chemistry Check","FA229",848244,"Wood, Dean Michael M",16044,9.1999999999999993,0,37.4,"DOES NOT MEET","MEETS",37.4,0]
["Hedrick Industries","Aquadale Quarry - Norwood","2017-03-21","Sand, 2MS","FA479",850263,"Thomas, Mark D",2023,8,0,96.6,"DOES NOT MEET","DOES NOT MEET",96.6,0]
["Appalachian Aggregates, LLC","Bluefield Plant","2017-03-22","Miscellaneous Material for Electrochemical","CA307",850415,"Church, Tracy G",5817,8.8000000000000007,8.9,103.9,"MEETS","MEETS",103.9,8.9]
["Martin Marietta","Charlotte Quarry - Charlotte","2017-06-19","Screenings - Chemistry Check","FA562",864046,"Adair, Mildred (Millie) L",5144,8.4,4.7,120.3,"MEETS","MEETS",120.3,4.7]
["Martin Marietta","Central Rock Quarry - Greensboro","2017-07-05","Select Material, Class III, Type 1","FA496",866376,"Cravens, Lane T",9091,7.3,4.7,62.2,"MEETS","MEETS",62.2,4.7]
["Martin Marietta","Bonds Quarry - Concord","2017-09-05","Sand, 2MS - Chemistry Check","FA392",875547,"Pegues, Jr., Henderson",18015,8.3000000000000007,0,75.900000000000006,"MEETS","MEETS",75.900000000000006,0]
["Hanson Aggregates Southeast, Inc.","Morehead City Sales Yard","2017-09-14","Screenings - Chemistry Check","FA570",876864,"Bartlett, Jr., Charles T",5669,8.8000000000000007,0,86.2,"MEETS","MEETS",86.2,0]
["Vulcan Materials Co.","Cabarrus Quarry - Concord","2017-09-18","Miscellaneous Material for Electrochemical","CA186",877672,"Adair, Mildred (Millie) L",3644,8,4.7,172.8,"MEETS","MEETS",172.8,4.7]
["Martin Marietta","Rock Hill Quarry - Rock Hill, SC","2017-09-26","Miscellaneous Material for Electrochemical","CA271",878999,"Adair, Mildred (Millie) L",11268,9.1,2.4,55.3,"DOES NOT MEET","MEETS",55.3,2.4]
["Martin Marietta","Kings Mountain Quarry - Kings Mountain","2017-10-30","Screenings - Chemistry Check","FA414",883907,"Brinson, Joseph",1107,7.8,0,274.5,"DOES NOT MEET","DOES NOT MEET",274.5,0]
["Martin Marietta","Rock Hill Quarry - Rock Hill, SC","2017-10-30","Miscellaneous Material for Electrochemical","CA271",885412,"Adair, Mildred (Millie) L",15755,8.9,0,38.6,"MEETS","MEETS",38.6,0]
["Martin Marietta","Mallard Creek Quarry - Charlotte","2017-11-07","Screenings - Chemistry Check","FA423",885615,"Pegues, Jr., Henderson",11131,9,3.6,55.7,"MEETS","MEETS",55.7,3.6]
["Martin Marietta","Kings Mountain Quarry - Kings Mountain","2017-11-17","Screenings - Chemistry Check","FA414",886931,"Brinson, Joseph",1644,7.3,8.3000000000000007,163,{"$f":"IF(ISBLANK(I194),\"N/A\",IF(AND(4.5<=$I194,$I194<=9),IF($H194>=3000,IF($O194<=100,IF($N194<=200,\"MEETS\",\"DOES NOT MEET\"),\"DOES NOT MEET\"),\"DOES NOT MEET\"),\"DOES NOT MEET\"))","v":"DOES NOT MEET"},{"$f":"IF(ISBLANK(I194), \"N/A\", IF(AND(5 <= $I194, $I194 <= 10),IF($H194>=3000,IF($O194<=100,IF($N194<=200,\"MEETS\",\"DOES NOT MEET\"),\"DOES NOT MEET\"),\"DOES NOT MEET\"),\"DOES NOT MEET\"))","v":"DOES NOT MEET"},{"$f":"IF(LEFT(K194, 1)=\"<\", VALUE(RIGHT(K194,LEN(K194)-1)), K194)","v":163},{"$f":"IF(LEFT(J194, 1)=\"<\", VALUE(RIGHT(J194,LEN(J194)-1)), J194)","v":8.3000000000000007}]
["Vulcan Materials Co.","Pineville Quarry - Charlotte","2017-12-05","Miscellaneous Material for Electrochemical","CA101",889576,"Adair, Mildred (Millie) L",2972,8.1,4.0999999999999996,62.8,"DOES NOT MEET","DOES NOT MEET",62.8,4.0999999999999996]
["Martin Marietta","Arrowood Quarry - Charlotte","2017-12-11","Miscellaneous Material for Electrochemical","CA31",889716,"Adair, Mildred (Millie) L",5754,8.6,4.0999999999999996,115.1,"MEETS","MEETS",115.1,4.0999999999999996]
["Vulcan Materials Co.","Skippers Quarry - Skippers, VA","2018-02-07","Screenings - Chemistry Check","FA531",897125,"Thomas, Grady Q",4174,7.9,27.4,39.4,"MEETS","MEETS",39.4,27.4]
["American Materials Co.","Dupree Mine - Greenville","2018-02-14","Sand, 2S - Chemistry Check","FA478",897182,"Cobb, James R",22442,5.2,0,28.4,"MEETS","MEETS",28.4,0]
["Neuse Sand And Gravel","Tilghman Pit","2018-02-15","Sand, 2S - Chemistry Check","FA446",897315,"Cobb, James R",93197,7.5,0,7.1,"MEETS","MEETS",7.1,0]
["B.E. Singleton & Sons, Inc.","Talley-Whichard Pitt","2018-03-27","Sand, 2S - Chemistry Check","FA488",903394,"Cobb, James R",2203,4,21.6,30.5,"DOES NOT MEET","DOES NOT MEET",30.5,21.6]
["Wake Stone Corp.","Moncure Quarry - Moncure","2018-03-29","Screenings, Washed","FA502",904094,"Jackson, Brandon M",4476,7.5,0,124.3,"MEETS","MEETS",124.3,0]
["Vulcan Materials Co.","Boone Quarry - Boone","2018-05-11","Miscellaneous Material for Electrochemical","CA21",911785,"Bumgarner, Dan F",26702,9.1999999999999993,0,"<21.68","DOES NOT MEET","MEETS",21.68,0]
["Vulcan Materials Co.","Rockingham Quarry - Rockingham","2018-05-11","Miscellaneous Material for Electrochemical","CA94",911061,"Jordan, Daniel H",5811,9.1999999999999993,0,99,"DOES NOT MEET","MEETS",99,0]
["Martin Marietta","Statesville Quarry - Statesville","2018-05-11","Screenings - Chemistry Check","FA534",911143,"Brinson, Joseph",2254,7.7,0,158,"DOES NOT MEET","DOES NOT MEET",158,0]
["Martin Marietta","Kings Mountain Quarry - Kings Mountain","2018-06-01","Screenings - Chemistry Check","FA414",913647,"Brinson, Joseph",4233,8.6,8,52.2,"MEETS","MEETS",52.2,8]
["Hedrick Industries","Lake Norman Quarry","2018-06-14","Sand, 2MS - Chemistry Check","FA226",916133,"Gosnell, Jimmy L",14518,9.1999999999999993,0,"<39.80","DOES NOT MEET","MEETS",39.799999999999997,0]
["Martin Marietta","Statesville Quarry - Statesville","2018-06-18","Screenings - Chemistry Check","FA534",916197,"Brinson, Joseph",1181,7.7,4,239.9,"DOES NOT MEET","DOES NOT MEET",239.9,4]
["Martin Marietta","Statesville Quarry - Statesville","2018-07-03","Screenings - Chemistry Check","FA534",918694,"Brinson, Joseph",2318,8.4,0,144,"DOES NOT MEET","DOES NOT MEET",144,0]
["Vulcan Materials Co.","Blacksburg Quarry - Blacksburg, SC","2018-07-05","Screenings - Chemistry Check","FA550",920668,"Gosnell, Jimmy L",4436,9.8000000000000007,0,63.4,"DOES NOT MEET","MEETS",63.4,0]
["Hedrick Industries","Lake Norman Quarry","2018-07-05","Sand, 2MS - Chemistry Check","FA226",920656,"Gosnell, Jimmy L",5972,8.6999999999999993,0,59.4,"MEETS","MEETS",59.4,0]
["Martin Marietta","Bonds Quarry - Concord","2018-09-10","Sand, 2MS - Chemistry Check","FA392",930605,"Pegues, Jr., Henderson",4721,8.3000000000000007,0,83.6,"MEETS","MEETS",83.6,0]
["McCrary Stone","Marshall Quarry - Marshall","2018-09-14","Screenings - Chemistry Check","FA557",931135,"Kindley, Wallace Quint",8707,9,0,"<79.89","MEETS","MEETS",79.89,0]
["Martin Marietta","Denver Quarry - Denver","2018-09-26","Sand, 2MS - Chemistry Check","FA377",932760,"Gosnell, Jimmy L",4548,8.1,0,93.6,"MEETS","MEETS",93.6,0]
["Martin Marietta","Hickory Quarry - Hickory","2018-09-26","Screenings - Chemistry Check","FA541",932403,"Brinson, Joseph",11010,8.8000000000000007,0,"<65.53","MEETS","MEETS",65.53,0]
["Thompson Contractors","Miller Creek Quarry - Rutherfordton","2018-10-02","Screenings - Chemistry Check","FA585",933262,"Rhymer, Robert C",9296,8.8000000000000007,0,"<71.87","MEETS","MEETS",71.87,0]
["Sloan Construction Co.","Blacksburg Quarry - Blacksburg, SC","2018-10-04","Sand, 2MS - Chemistry Check","FA476",934379,"Gosnell, Jimmy L",16620,7,0,"<45.38","MEETS","MEETS",45.38,0]
["Vulcan Materials Co.","Enka Quarry - Enka","2018-10-05","Screenings - Chemistry Check","FA458",933928,"Rhymer, Robert C",493,4,0,">1200","DOES NOT MEET","DOES NOT MEET",">1200",0]
["Vulcan Materials Co.","Spruce Pine Quarry - Bakersville","2018-10-08","Screenings - Chemistry Check","FA558",934018,"Rhymer, Robert C",6614,8.5,0,50,"MEETS","MEETS",50,0]
["Vulcan Materials Co.","Pacolet Quarry - Pacolet, SC","2018-10-10","Sand, 2MS - Chemistry Check","FA212",935070,"Gosnell, Jimmy L",1035,7.6,0,640,"DOES NOT MEET","DOES NOT MEET",640,0]
["Vulcan Materials Co.","Rockingham Quarry - Rockingham","2018-10-15","Screenings - Chemistry Check","FA374",935256,"Jordan, Daniel H",8249,8.6999999999999993,0,"<92.08","MEETS","MEETS",92.08,0]
["Vulcan Materials Co.","Cabarrus Quarry -- Concord","2018-10-18","Sand, 2MS - Chemistry Check","FA339",935931,"Cero, Kevin M",7516,9,0,"<87.8","MEETS","MEETS",87.8,0]
["Hanson Aggregates Southeast, Inc.","Marlboro S&G - Bennettsville","2018-10-24","Sand, 2S - Chemistry Check","FA10",936891,"Jordan, Daniel H",102100,5.4,0,"<6.4","MEETS","MEETS",6.4,0]
["Martin Marietta","Lemon Springs - Sanford","2018-10-29","Select Material, Class III, Type 3 - Chemistry Check","FA518",937185,"Jackson, Brandon M",10060,8.6,0,"<65.6","MEETS","MEETS",65.599999999999994,0]
["Martin Marietta","Mallard Creek Quarry - Charlotte","2018-11-12","Sand, 2MS - Chemistry Check","FA423",939052,"Pegues, Jr., Henderson",10080,9.1999999999999993,0,"<65.5","DOES NOT MEET","MEETS",65.5,0]
["Luck Stone Corporation","Pittsboro Quarry - Moncure","2018-11-30","Screenings - Chemistry Check","FA561",941285,"Jackson, Brandon M",13310,9.4,0,"<49.59","DOES NOT MEET","MEETS",49.59,0]
["Georgia Stone Products","Lynches River Quarry - Jefferson, SC","2018-12-06","Screenings, Washed","FA425",942224,"Jordan, Daniel H",21340,9.1,0,"<30.928","DOES NOT MEET","MEETS",30.928000000000001,0]
["Hanson Aggregates Southeast, Inc.","Jefferson Quarry - Jefferson, SC","2018-12-07","Screenings, Washed","FA587",942236,"Jordan, Daniel H",17700,9.1999999999999993,0,"<37.288","DOES NOT MEET","MEETS",37.287999999999997,0]
["Vulcan Materials Co.","Pineville Quarry - Charlotte","2018-12-12","Miscellaneous Material for Electrochemical","CA101",942490,"Adair, Mildred (Millie) L",13760,9.1,0,"<47.965","DOES NOT MEET","MEETS",47.965000000000003,0]
["Martin Marietta","Arrowood Quarry - Charlotte","2018-12-13","Miscellaneous Material for Electrochemical","CA31",942689,"Adair, Mildred (Millie) L",6783,9.1,0,"<97.302","DOES NOT MEET","MEETS",97.302000000000007,0]
["Hanson Aggregates Southeast, Inc.","Raleigh Quarry - Wake Forest","2019-01-09","Screenings, Washed","FA515",944673,"Skinner, III, John L",15740,9.3000000000000007,0,"<41.931","DOES NOT MEET","MEETS",41.930999999999997,0]
["Hanson Aggregates Southeast, Inc.","Rougemont Quarry","2019-01-11","Sand, 2MS - Chemistry Check","FA464",945248,"Skinner, III, John L",19060,9.4,0,"<34.627","DOES NOT MEET","MEETS",34.627000000000002,0]
["Carolina Sunrock LLC","Woodsdale Quarry - Roxboro","2019-01-11","Sand, 2MS - Chemistry Check","FA440",945252,"Skinner, III, John L",13210,9.1,0,"<49.962","DOES NOT MEET","MEETS",49.962000000000003,0]
["Wake Stone Corp.","Knightdale Quarry - Knightdale","2019-01-15","Sand, 2MS - Chemistry Check","FA481",945620,"Skinner, III, John L",15920,9.1,0,"<41.457","DOES NOT MEET","MEETS",41.457000000000001,0]
["Martin Marietta","Raleigh-Durham Quarry - Raleigh","2019-01-18","Screenings - Chemistry Check","FA578",946462,"Skinner, III, John L",12420,9.4,0,"<53.140","DOES NOT MEET","MEETS",53.14,0]
["Hedrick Industries","South McDowell Quarry - Marion","2019-01-24","Screenings, Washed","FA415",946851,"Rhymer, Robert C",17770,8.6999999999999993,0,"<37.141","MEETS","MEETS",37.140999999999998,0]
["Martin Marietta","Garner Quarry - Garner","2019-01-29","Screenings - Chemistry Check","FA382",947430,"Skinner, III, John L",15190,9.1,0,"<43.45","DOES NOT MEET","MEETS",43.45,0]
["Wade Moore Equipment Co.","Fleming Pit - Louisburg","2019-02-01","Sand, 2S - Chemistry Check","FA165",948020,"Skinner, III, John L",79110,6.7,0,"<8.343","MEETS","MEETS",8.343,0]
["Carolina Sunrock LLC","Kittrell Quarry - Kittrell","2019-02-01","Sand, 2MS - Chemistry Check","FA397",948023,"Skinner, III, John L",6444,10.6,0,"<102.421","DOES NOT MEET","DOES NOT MEET",102.42100000000001,0]
["Wake Stone Corp.","Moncure Quarry - Moncure","2019-02-05","Miscellaneous Material for Electrochemical","CA100",948576,"Jordan, Daniel H",13360,9.1999999999999993,0,"<49.401","DOES NOT MEET","MEETS",49.401000000000003,0]
["Rogers Group, Inc.","Henrietta Quarry - Mooresboro","2019-02-20","Screenings, Washed","FA528",951033,"Norton, Stephen S",23970,9.1999999999999993,0,"<27.534","DOES NOT MEET","MEETS",27.533999999999999,0]
["Vulcan Materials Co.","Skippers Quarry - Skippers, VA","2019-02-21","Screenings - Chemistry Check","FA531",952209,"Thomas, Grady Q",6189,9.1,"<30","<106.641","DOES NOT MEET","MEETS",106.64100000000001,30]
["Salem Stone Corp.","Southside Materials - Shelton Quarry - Pelham","2019-02-28","Screenings - Chemistry Check","FA533",952403,"Westmoreland, Braxton J",18390,9,0,"<35.889","MEETS","MEETS",35.889000000000003,0]
["Vulcan Materials Co.","Stokesdale Quarry - Stokesdale","2019-02-28","Screenings - Chemistry Check","FA499",952380,"Westmoreland, Braxton J",19350,9.1,0,"<34.109","DOES NOT MEET","MEETS",34.109000000000002,0]
["Boxley Materials Company","Blue Ridge Quarry - Blue Ridge, VA","2019-03-05","Sand, 2MS - Chemistry Check","FA362",953113,"Westmoreland, Braxton J",4005,8.8000000000000007,"<30","<164.794","MEETS","MEETS",164.79400000000001,30]
["Boxley Materials Company","Fieldale Quarry - Martinsville, VA","2019-03-05","Sand, 2MS - Chemistry Check","FA373",953150,"Westmoreland, Braxton J",6135,8,0,"<107.579","MEETS","MEETS",107.57899999999999,0]
["McCrary Stone","Low Gap Quarry - Burnsville","2019-03-05","Screenings - Chemistry Check","FA540",952987,"Kindley, Wallace Quint",1371,3.1,"<30","<481.4","DOES NOT MEET","DOES NOT MEET",481.4,30]
["Hanson Aggregates Southeast, Inc.","Crabtree Quarry - Raleigh","2019-03-13","Screenings - Chemistry Check","FA568",954291,"Skinner, III, John L",6379,8,0,"<103.464","MEETS","MEETS",103.464,0]
["Vulcan Materials Co.","Pineville Quarry - Charlotte","2019-03-15","Miscellaneous Material for Electrochemical","CA101",954943,"Adair, Mildred (Millie) L",6899,8.9,0,"<95.666","MEETS","MEETS",95.665999999999997,0]
["Vulcan Materials Co.","Pineville Quarry - Charlotte","2019-03-15","Miscellaneous Material for Electrochemical","CA101",954944,"Adair, Mildred (Millie) L",14850,9,"<30","<44.444","MEETS","MEETS",44.444000000000003,30]
["Carolina Sunrock LLC","Butner Quarry - Butner","2019-03-25","Sand, 2MS - Chemistry Check","FA171",955937,"Skinner, III, John L",6505,10.3,"<30","<101.46","DOES NOT MEET","DOES NOT MEET",101.46,30]
["Martin Marietta","Franklin Quarry - Franklinton","2019-03-27","Sand, 2MS - Chemistry Check","FA349",956774,"Skinner, III, John L",14320,8.6999999999999993,"<30","<46.089","MEETS","MEETS",46.088999999999999,30]
["Hanson Aggregates Southeast, Inc.","Holly Springs Quarry","2019-03-29","Screenings - Chemistry Check","FA513",956970,"Skinner, III, John L",8079,8.8000000000000007,"<30","<81.693","MEETS","MEETS",81.692999999999998,30]
["Vulcan Materials Co.","Greystone Quarry - Henderson","2019-04-01","Sand, 2MS - Chemistry Check","FA183",957256,"Skinner, III, John L",14610,9.1,"<30","<45.175","DOES NOT MEET","MEETS",45.174999999999997,30]
["Martin Marietta","Bonds Quarry - Concord","2019-04-09","Sand, 2MS","FA392",958526,"Pegues, Jr., Henderson",7606,8.6999999999999993,"<30","<86.774","MEETS","MEETS",86.774000000000001,30]
["Hedrick Industries","Grove Stone Quarry - Black Mountain","2019-04-23","Screenings, Washed","FA400",960226,"Rhymer, Robert C",10150,8.4,"<30","<65.025","MEETS","MEETS",65.025000000000006,30]
["Hedrick Industries","North Buncombe Quarry - Asheville","2019-04-29","Screenings - Chemistry Check","FA126",961055,"Kindley, Wallace Quint",767,3.6,"<30",">800<1200","DOES NOT MEET","DOES NOT MEET",">800<1200",30]
["Rogers Group, Inc.","Henrietta Quarry - Mooresboro","2019-04-30","Screenings, Washed","FA528",961360,"Rhymer, Robert C",22130,8.6999999999999993,"<30","<29.824","MEETS","MEETS",29.824000000000002,30]
["Salem Stone Corp.","Southside Materials - S. Boston Quarry (VA)","2019-05-21","Screenings - Chemistry Check","FA197",964761,"Westmoreland, Braxton J",7227,9,"<30","<91.324",{"$f":"IF(ISBLANK(I258),\"N/A\",IF(AND(4.5<=$I258,$I258<=9),IF($H258>=3000,IF($O258<=100,IF($N258<=200,\"MEETS\",\"DOES NOT MEET\"),\"DOES NOT MEET\"),\"DOES NOT MEET\"),\"DOES NOT MEET\"))","v":"MEETS"},{"$f":"IF(ISBLANK(I258), \"N/A\", IF(AND(5 <= $I258, $I258 <= 10),IF($H258>=3000,IF($O258<=100,IF($N258<=200,\"MEETS\",\"DOES NOT MEET\"),\"DOES NOT MEET\"),\"DOES NOT MEET\"),\"DOES NOT MEET\"))","v":"MEETS"},{"$f":"IF(LEFT(K258, 1)=\"<\", VALUE(RIGHT(K258,LEN(K258)-1)), K258)","v":91.323999999999998},{"$f":"IF(LEFT(J258, 1)=\"<\", VALUE(RIGHT(J258,LEN(J258)-1)), J258)","v":30}]
["Martin Marietta","Pomona Quarry - Greensboro","2019-05-28","Sand, 2MS - Chemistry Check","FA163",965380,"Waller, John M",10610,8.9,"<30","<62.205","MEETS","MEETS",62.204999999999998,30]
["Martin Marietta","Burlington Quarry - Burlington","2019-05-31","Screenings - Chemistry Check","FA497",966240,"Waller, John M",7640,8.83,"<30","<86.387","MEETS","MEETS",86.387,30]
["Martin Marietta","Central Rock Quarry - Greensboro","2019-06-04","Screenings - Chemistry Check","FA496",966794,"Waller, John M",6334,8.65,"<30","<104.2","MEETS","MEETS",104.2,30]
["Martin Marietta","Jamestown Quarry - Jamestown","2019-06-04","Sand, 2MS - Chemistry Check","FA251",966795,"Waller, John M",13850,9.17,"<30","<47.653","DOES NOT MEET","MEETS",47.652999999999999,30]
["American Materials Co.","Black Creek Plant - Mt. Croghan, SC","2019-06-12","Sand, 2MS - Chemistry Check","FA422",968053,"Jordan, Daniel H",23730,7.54,"<30","<27.813","MEETS","MEETS",27.812999999999999,30]
["Hanson Aggregates Southeast, Inc.","Brewer (Pageland #1) - Jefferson, SC","2019-06-12","Sand, 2MS - Chemistry Check","FA64",968057,"Jordan, Daniel H",34930,6.41,"<30","<18.895","MEETS","MEETS",18.895,30]
["Osprey Minerals","Osprey Sand Pit - Mt. Croghan","2019-06-12","Sand, 2S - Chemistry Check","FA603",968060,"Jordan, Daniel H",51310,5.54,"<30","<12.863","MEETS","MEETS",12.863,30]
["Hedrick Industries","Piedmont (Pageland #3) - Pageland, SC","2019-06-12","Sand, 2MS - Chemistry Check","FA239",968059,"Jordan, Daniel H",40530,6.44,"<30","<16.284","MEETS","MEETS",16.283999999999999,30]
["Hanson Aggregates Southeast, Inc.","Marlboro S&G - Bennettsville","2019-06-19","Sand, 2S - Chemistry Check","FA10",968878,"Jordan, Daniel H",142100,5.07,"<29","<4.645","MEETS","MEETS",4.6449999999999996,29]
["Martin Marietta","Loamy Sand and Gravel - Bethune, SC","2019-06-21","Sand, 2S - Chemistry Check","FA429",969545,"Jordan, Daniel H",82960,5.48,"<29","<7.956","MEETS","MEETS",7.9560000000000004,29]
["Hedrick Industries","B.V. Hedrick Gravel & Sand - Lilesville","2019-06-25","Sand, 2S - Chemistry Check","FA221",969726,"Jordan, Daniel H",130300,5.84,"<29","<5.065","MEETS","MEETS",5.0650000000000004,29]
["American Materials Co.","Dupree Mine - Greenville","2019-06-25","Sand, 2S - Chemistry Check","FA478",969846,"Cobb, James R",34300,5.1100000000000003,"<29","<19.242","MEETS","MEETS",19.242000000000001,29]
["Martin Marietta","Fountain Quarry - Fountain","2019-06-25","Screenings - Chemistry Check","FA572",969849,"Cobb, James R",4103,8.69,"<29","<160.858","MEETS","MEETS",160.858,29]
["Ernie Everett Site Prep., Inc.","Shepard Pit - Kinston","2019-06-25","Sand, 2S - Chemistry Check","FA605",969847,"Cobb, James R",65280,5.58,"<29","<10.11","MEETS","MEETS",10.11,29]
["Thomas Cement, Inc.","Simpson Mine - Pageland, SC","2019-06-25","Sand, 2S - Chemistry Check","FA456",969963,"Jordan, Daniel H",66420,4.9000000000000004,"<29","<9.937","MEETS","DOES NOT MEET",9.9369999999999994,29]
["American Materials Co.","Sumter County Pit - Sumter, SC","2019-06-25","Sand, 2S - Chemistry Check","FA607",969961,"Jordan, Daniel H",79610,5.05,"<29","<8.29","MEETS","MEETS",8.2899999999999991,29]
["Westside Minerals LLC","Dempsey Wood Pit - LaGrange","2019-06-26","Sand, 2S - Chemistry Check","FA403",970244,"Cobb, James R",47700,4.8600000000000003,"<29","<13.836","MEETS","DOES NOT MEET",13.836,29]
["Pea Creek Mines","Pea Creek Mines","2019-06-26","Sand, 2S - Chemistry Check","FA447",970248,"Cobb, James R",28120,4.7699999999999996,"<29","<23.471","MEETS","DOES NOT MEET",23.471,29]
["Titan Mid-Atlantic Aggregates LLC","Waverly Sand","2019-06-26","Sand, 2S - Chemistry Check","FA589",970946,"Thomas, Grady Q",43060,5.0199999999999996,"<29","<15.327","MEETS","MEETS",15.327,29]
["Martin Marietta","Kings Mountain Quarry - Kings Mountain","2019-07-01","Screenings - Chemistry Check","FA414",970681,"Gosnell, Jimmy L",1946,7.96,"<29","<339.157","DOES NOT MEET","DOES NOT MEET",339.15699999999998,29]
["Bent River Materials","Bent River Pit","2019-07-02","Sand, 2S - Chemistry Check","FA460",970953,"Thomas, Grady Q",23650,4.9800000000000004,"<29","<27.907","MEETS","DOES NOT MEET",27.907,29]
["Commercial Ready Mix Products","Newsome Pit #2 - Pendleton","2019-07-02","Sand, 2S - Chemistry Check","FA317",970968,"Thomas, Grady Q",80320,5.5,"<29","<8.217","MEETS","MEETS",8.2170000000000005,29]
["Martin Marietta","Hickory Quarry - Hickory","2019-07-08","Screenings - Chemistry Check","FA541",971767,"Gosnell, Jimmy L",18600,9.0500000000000007,"<29","<35.484","DOES NOT MEET","MEETS",35.484000000000002,29]
["Martin Marietta","Statesville Quarry - Statesville","2019-07-08","Screenings - Chemistry Check","FA534",971773,"Gosnell, Jimmy L",3285,7.89,"<29","<200.913","DOES NOT MEET","DOES NOT MEET",200.91300000000001,29]
["Martin Marietta","Charlotte Quarry - Charlotte","2019-07-10","Screenings, Washed","FA562",972773,"Pegues, Jr., Henderson",5792,8.36,"<29","<113.950","MEETS","MEETS",113.95,29]
["Hedrick Industries","Lake Norman Quarry","2019-07-12","Sand, 2MS - Chemistry Check","FA226",972394,"Gosnell, Jimmy L",4117,8.24,"<29","<160.311","MEETS","MEETS",160.31100000000001,29]
["Hedrick Industries","Norman Sand Pit (D&J) - Candor, NC","2019-07-12","Sand, 2S - Chemistry Check","FA111",972349,"Jackson, Brandon M",44790,4.88,"<29","<14.735","MEETS","DOES NOT MEET",14.734999999999999,29]
["Martin Marietta","Denver Quarry - Denver","2019-07-25","Sand, 2MS - Chemistry Check","FA377",974528,"Gosnell, Jimmy L",1219,3.92,"<29",">400<800","DOES NOT MEET","DOES NOT MEET",">400<800",29]
["Harrison Construction Co., Inc.","Waynesville Quarry - Waynesville","2019-07-29","Screenings - Chemistry Check","FA564",974815,"Kindley, Wallace Quint",2712,7.95,"<32","<243.363","DOES NOT MEET","DOES NOT MEET",243.363,32]
["Vulcan Materials Co.","Blacksburg Quarry - Blacksburg, SC","2019-07-30","Screenings - Chemistry Check","FA550",975114,"Gosnell, Jimmy L",8724,9.35,"<29","<75.653","DOES NOT MEET","MEETS",75.653000000000006,29]
["Vulcan Materials Co.","Pacolet Quarry - Pacolet, SC","2019-08-01","Sand, 2MS - Chemistry Check","FA212",975600,"Gosnell, Jimmy L",1466,7.41,"<29",">400<800","DOES NOT MEET","DOES NOT MEET",">400<800",29]
["APAC-Atlantic - Thompson-Arthur","Candor Pit","2019-08-12","Sand, 2S - Chemistry Check","FA60",977381,"Jackson, Brandon M",68040,5.0999999999999996,"<29","<9.7002","MEETS","MEETS",9.7002000000000006,29]
["GS Materials, Inc.","Emery Pit - Jackson Springs","2019-08-12","Sand, 2S - Chemistry Check","FA113",977380,"Jackson, Brandon M",48450,4.88,"<29","<13.622","MEETS","DOES NOT MEET",13.622,29]
["McCrary Stone","Marshall Quarry - Marshall","2019-08-12","Screenings - Chemistry Check","FA557",978217,"Kindley, Wallace Quint",6053,9.07,"<29","<109.0","DOES NOT MEET","MEETS",109,29]
["Vulcan Materials Co.","Rockingham Quarry - Rockingham","2019-08-13","Screenings - Chemistry Check","FA374",977732,"Jordan, Daniel H",5849,8.7200000000000006,"<29","<112.8","MEETS","MEETS",112.8,29]
["Martin Marietta","Lemon Springs - Sanford","2019-08-16","Screenings - Chemistry Check","FA518",978240,"Jackson, Brandon M",9415,9.15,"<29","<70.10","DOES NOT MEET","MEETS",70.099999999999994,29]
["Covia Holdings Corporation","Marston Facility - Marston","2019-08-16","Screenings - Chemistry Check","FA617",978801,"Jordan, Daniel H",91790,6.91,"<29","<7.1903","MEETS","MEETS",7.1902999999999997,29]
["Vulcan Materials Co.","Pineville Quarry - Charlotte","2019-08-21","Miscellaneous Material for Electrochemical","CA101",979255,"Smith, Michael L",2661,7.78,"<32","<248.027","DOES NOT MEET","DOES NOT MEET",248.02699999999999,32]
["Sloan Construction Co.","Blacksburg Quarry - Blacksburg, SC","2019-08-22","Miscellaneous Material for Electrochemical","CA382",979542,"Brinson, Joseph",27180,8.14,"<29","<24.283","MEETS","MEETS",24.283000000000001,29]
["Sloan Construction Co.","Blacksburg Quarry - Blacksburg, SC","2019-08-22","Sand, 2MS - Chemistry Check","FA476",979544,"Brinson, Joseph",14950,8.3000000000000007,"<29","<44.147","MEETS","MEETS",44.146999999999998,29]
["Vulcan Materials Co.","Havre De Grace Quarry - Havre De Grace, MD","2019-08-26","Miscellaneous Material for Electrochemical","CA345",980139,"Bonds, Maria M",17270,9.18,"<29","<38.217","DOES NOT MEET","MEETS",38.216999999999999,29]
["Vulcan Materials Co.","Havre De Grace Quarry - Havre De Grace, MD","2019-08-26","Screenings - Chemistry Check","FA584",980141,"Bonds, Maria M",3264,8.17,"<29","<202.206","DOES NOT MEET","DOES NOT MEET",202.20599999999999,29]
["Vulcan Materials Co.","Jack Quarry - Petersburg, VA","2019-08-26","Screenings - Chemistry Check","FA549",980162,"Bonds, Maria M",6465,9.1300000000000008,"<29","<102.088","DOES NOT MEET","MEETS",102.08799999999999,29]
["Vulcan Materials Co.","Puddledock Quarry - Prince George, VA","2019-08-26","Sand, 2S - Chemistry Check","FA172",980143,"Bonds, Maria M",52160,4.99,"<29","<12.653","MEETS","DOES NOT MEET",12.653,29]
["Martin Marietta","Denver Quarry - Denver","2019-08-28","Sand, 2MS - Chemistry Check","FA377",980196,"Brinson, Joseph",3357,7.5,"<32","<196.604","MEETS","MEETS",196.60400000000001,32]
["Vulcan Materials Co.","Enka Quarry - Enka","2019-09-05","Screenings, Washed","FA458",981857,"Rhymer, Robert C",873,5.14,"<32",">400<800","DOES NOT MEET","DOES NOT MEET",">400<800",32]
["Martin Marietta","Rock Hill Quarry - Rock Hill, SC","2019-09-10","Miscellaneous Material for Electrochemical","CA271",982312,"Adair, Mildred (Millie) L",9347,9.23,"<32","<70.611","DOES NOT MEET","MEETS",70.611000000000004,32]
["Martin Marietta","Statesville Quarry - Statesville","2019-09-12","Screenings - Chemistry Check","FA534",982694,"Brinson, Joseph",2262,7.73,"<32","<291.777","DOES NOT MEET","DOES NOT MEET",291.77699999999999,32]
["Hanson Aggregates Southeast, Inc.","Jefferson Quarry - Jefferson, SC","2019-09-13","Screenings - Chemistry Check","FA587",982920,"Jordan, Daniel H",16120,8.4700000000000006,"<32","<40.943","MEETS","MEETS",40.942999999999998,32]
["Vulcan Materials Co.","Spruce Pine Quarry - Bakersville","2019-09-16","Screenings - Chemistry Check","FA558",983094,"Norton, Stephen S",3326,7.47,"<32","<198.437","MEETS","MEETS",198.43700000000001,32]
["Martin Marietta","Arrowood Quarry - Charlotte","2019-09-18","Miscellaneous Material for Electrochemical","CA31",983528,"Smith, Michael L",3535,7.92,"<32","<186.704","MEETS","MEETS",186.70400000000001,32]
["Martin Marietta","Denver Quarry - Denver","2019-09-20","Sand, 2MS - Chemistry Check","FA377",983982,"Myers, Jesse J",5025,7.89,"<32","<131.343","MEETS","MEETS",131.34299999999999,32]
["Boone's Concrete Supply, LLC","Woodlawn Quarry - Marion","2019-09-23","Screenings - Chemistry Check","FA546",984076,"Norton, Stephen S",12950,10,"<32","<50.965","DOES NOT MEET","MEETS",50.965000000000003,32]
["Vulcan Materials Co.","Cabarrus Quarry - Concord","2019-09-24","Miscellaneous Material for Electrochemical","CA186",985125,"Cero, Kevin M",6884,9.08,"<32","<95.874","DOES NOT MEET","MEETS",95.873999999999995,32]
["Martin Marietta","Clarks Quarry - New Bern","2019-09-25","Sand, 2MS - Chemistry Check","FA214",984815,"Cobb, James R",1669,7.92,"<32","<395.446","DOES NOT MEET","DOES NOT MEET",395.44600000000003,32]
["Thompson Contractors","Miller Creek Quarry - Rutherfordton","2019-09-27","Screenings - Chemistry Check","FA585",985275,"Norton, Stephen S",9480,8.84,"<30","<69.620","MEETS","MEETS",69.62,30]
["Martin Marietta","Statesville Quarry - Statesville","2019-10-09","Screenings - Chemistry Check","FA534",987454,"Brinson, Joseph",2276,7.81,"<30","<289.982","DOES NOT MEET","DOES NOT MEET",289.98200000000003,30]
["Martin Marietta","Mallard Creek Quarry - Charlotte","2019-11-06","Sand, 2MS - Chemistry Check","FA423",990709,"Pegues, Jr., Henderson",8025,8.94,"<32","<82.243","MEETS","MEETS",82.242999999999995,32]
["Martin Marietta","Bakers Quarry - Monroe","2019-11-27","Miscellaneous Material for Electrochemical","CA32",993355,"Smith, Michael L",11890,8.8800000000000008,"<30","<55.509","MEETS","MEETS",55.509,30]
["Martin Marietta","Matthews Quarry - Matthews","2019-12-03","Miscellaneous Material for Electrochemical","CA37",993338,"Smith, Michael L",9169,8.9499999999999993,"<30","<71.982","MEETS","MEETS",71.981999999999999,30]
["Titan Mid-Atlantic Aggregates LLC","Branchville Sand Plant - Sebrell Farms","2020-01-22","Sand, 2S - Chemistry Check","FA613",997214,"Bonds, Maria M",36700,6.25,"<30","<17.894","MEETS","MEETS",17.893999999999998,30]
["Vulcan Materials Co.","Clear Creek Q. - Charlotte","2020-02-04","Miscellaneous Material for Electrochemical","CA249",998654,"Pegues, Jr., Henderson",5334,8.91,"<30","<123.735","MEETS","MEETS",123.735,30]
["Vulcan Materials Co.","Skippers Quarry - Skippers, VA","2020-02-05","Screenings - Chemistry Check","FA531",998861,"Thomas, Grady Q",6484,8.8000000000000007,"<30","<101.789","MEETS","MEETS",101.789,30]
["American Materials Co.","Bailey Mine - Linden","2020-07-08","Screenings - Chemistry Check","FA483",1013293,"Gilliam, Christopher",70035,5.61,"<30","<9.424",{"$f":"IF(ISBLANK(I322),\"N/A\",IF(AND(4.5<=$I322,$I322<=9),IF($H322>=3000,IF($O322<=100,IF($N322<=200,\"MEETS\",\"DOES NOT MEET\"),\"DOES NOT MEET\"),\"DOES NOT MEET\"),\"DOES NOT MEET\"))","v":"MEETS"},{"$f":"IF(ISBLANK(I322), \"N/A\", IF(AND(5 <= $I322, $I322 <= 10),IF($H322>=3000,IF($O322<=100,IF($N322<=200,\"MEETS\",\"DOES NOT MEET\"),\"DOES NOT MEET\"),\"DOES NOT MEET\"),\"DOES NOT MEET\"))","v":"MEETS"},{"$f":"IF(LEFT(K322, 1)=\"<\", VALUE(RIGHT(K322,LEN(K322)-1)), K322)","v":9.4239999999999995},{"$f":"IF(LEFT(J322, 1)=\"<\", VALUE(RIGHT(J322,LEN(J322)-1)), J322)","v":30}]
["American Materials Co.","Bailey Mine - Linden","2020-07-08","Screenings - Chemistry Check","FA483",1013296,"Gilliam, Christopher",68034,5.43,"<30","<9.701","MEETS","MEETS",9.7010000000000005,30]
["Commercial Ready Mix Products","Newsome Pit #2 - Pendleton","2020-07-09","Sand, 2S - Chemistry Check","FA317",1013570,"Thomas, Grady Q",260130,6.33,"<30","<2.537","MEETS","MEETS",2.5369999999999999,30]
["Vulcan Materials Co.","North Quarry - Winston Salem","2020-08-19","Select Material, Class III, Type 1","FA466",1017747,"Carpenter, Gregory S",7337,8.6,"<30","<141.056","MEETS","MEETS",141.05600000000001,30]
["Vulcan Materials Co.","North Quarry - Winston Salem","2020-08-19","Select Material, Class III, Type 1","FA466",1017748,"Carpenter, Gregory S",16008,8.82,"<30","<71.467","MEETS","MEETS",71.466999999999999,30]
["Vulcan Materials Co.","North Quarry - Winston Salem","2020-08-19","Select Material, Class III, Type 1","FA466",1017749,"Carpenter, Gregory S",10005,8.6999999999999993,"<30","<117.312","MEETS","MEETS",117.312,30]
["Ernie Everett Site Prep., Inc.","Shepard Pit - Kinston","2020-09-21","Sand, 2S - Chemistry Check","FA605",1020626,"Harris, Kevin T",140070,5.39,"<30",12,"MEETS","MEETS",12,30]
["Vulcan Materials Co.","Kitty Hawk Sales Yard","2020-09-21","Sand, 2S - Chemistry Check","FA338",1021098,"Bonds, Maria M",43355,4.3099999999999996,"<30","<30.192","DOES NOT MEET","DOES NOT MEET",30.192,30]
["Vulcan Materials Co.","Kitty Hawk Sales Yard","2020-09-21","Screenings - Chemistry Check","FA338",1021097,"Bonds, Maria M",17676,8.74,"<30","<59.621","MEETS","MEETS",59.621000000000002,30]
["Vulcan Materials Co.","Elizabeth City Yard (#216) - Elizabeth City","2020-09-21","Screenings - Chemistry Check","FA539",1021107,"Bonds, Maria M",14674,9.24,"<30","<75.334","DOES NOT MEET","MEETS",75.334000000000003,30]
["American Materials Co.","Dupree Mine - Greenville","2020-09-22","Sand, 2S - Chemistry Check","FA478",1020735,"Harris, Kevin T",100050,4.91,"<30","<19.125","MEETS","DOES NOT MEET",19.125,30]
["Westside Minerals LLC","Dempsey Wood Pit - LaGrange","2020-09-24","Sand, 2S - Chemistry Check","FA403",1021168,"Cobb, James R",80040,4.88,"<30","<18.739","MEETS","DOES NOT MEET",18.739000000000001,30]
["Martin Marietta","Fountain Quarry - Fountain","2020-09-25","Screenings - Chemistry Check","FA572",1021242,"Cobb, James R",11339,9.1999999999999993,"<30","<98.758","DOES NOT MEET","MEETS",98.757999999999996,30]
["Matthews Sand and Gravel","Matthews Pit #4 - Princeton","2020-10-14","Sand, 2S - Chemistry Check","FA616",1023373,"Calestru, Steliana",113390,5.51,"<30","<14.502","MEETS","MEETS",14.502000000000001,30]

{"sheet":"Coord.","index":4,"n_rows":818,"n_cols":5,"rows_kept":818,"cut":false,"hidden":false,"merged":[]}
["Plant ID","Facility Type Latitude Dir","Facility Type Latitude","Facility Type Longitude Dir","Facility Type Longitude"]
["CA1","N",35.440697,"W",-83.007457000000002]
["CA100","N",35.616160000000001,"W",-79.103876]
["CA101","N",35.115856000000001,"W",-80.896596000000002]
["CA10129"]
["CA10133"]
["CA102","N",35.853850000000001,"W",-80.160167999999999]
["CA1022"]
["CA104","N",36.586725000000001,"W",-82.277083000000005]
["CA1041"]
["CA105"]
["CA1088"]
["CA109","N",null,"W"]
["CA11","N",36.574818999999998,"W",-80.929176999999996]
["CA111","N",35.583199999999998,"W",-82.054100000000005]
["CA113","N",35.792836000000001,"W",-82.655023]
["CA114","N",34.861781999999998,"W",-83.952575999999993]
["CA115","N",35.013970999999998,"W",-84.231311000000005]
["CA116","N",35.069811000000001,"W",-83.923047999999994]
["CA119","N",35.056310000000003,"W",-82.582790000000003]
["CA12","N",35.273408000000003,"W",-82.641863999999998]
["CA120","N",34.699689999999997,"W",-80.332674999999995]
["CA121"]
["CA122","N",36.215747,"W",-81.636511999999996]
["CA123","N",36.439355999999997,"W",-81.488720000000001]
["CA124"]
["CA127"]
["CA131","N",35.687100000000001,"W",-82.6083]
["CA133","N",36.370564999999999,"W",-82.296366000000006]
["CA137",null,37.197637999999998,null,-77.504617999999994]
["CA138","N",35.357883999999999,"W",-78.776043999999999]
["CA139","N",36.024622999999998,"W",-80.060130000000001]
["CA140"]
["CA141"]
["CA142","N",36.688294999999997,"W",-79.938883000000004]
["CA146","N",35.610683999999999,"W",-82.364768999999995]
["CA147"]
["CA15","N",35.365220999999998,"W",-83.261218]
["CA153","N",36.426709000000002,"W",-81.773808000000002]
["CA154"]
["CA156","N",35.894070999999997,"W",-78.749120000000005]
["CA157","N",35.838397000000001,"W",-78.767809]
["CA158","N",36.251818,"W",-82.328174000000004]
["CA16","N",35.163902,"W",-83.425331]
["CA161","N",34.415743999999997,"W",-77.868156999999997]
["CA163","N",null,"W"]
["CA164"]
["CA165"]
["CA168","N",35.428623999999999,"W",-81.017241999999996]
["CA169","N",35.527092000000003,"W",-81.026443999999998]
["CA171"]
["CA176","N",35.422584999999998,"W",-78.501491999999999]
["CA177"]
["CA178","N",36.121974999999999,"W",-78.772541000000004]
["CA180","N",36.584158000000002,"W",-81.307518000000002]
["CA182"]
["CA183","N",36.066125,"W",-83.728346999999999]
["CA184"]
["CA186","N",35.404029999999999,"W",-80.704829000000004]
["CA188","N",35.318085000000004,"W",-80.728077999999996]
["CA189","N",35.150663999999999,"W",-77.151770999999997]
["CA190","N",35.787314000000002,"W",-82.036208000000002]
["CA193","N",35.335340000000002,"W",-83.836816999999996]
["CA194"]
["CA195","N",34.991819999999997,"W",-83.848622000000006]
["CA2","N",35.927264999999998,"W",-79.153772000000004]
["CA201",null,36.131428,null,-79.34957]
["CA203"]
["CA205","N",37.356340000000003,"W",-77.496752999999998]
["CA207","N",35.284793999999998,"W",-80.571691000000001]
["CA208"]
["CA209","N",36.035980000000002,"W",-80.106778000000006]
["CA21","N",36.205551,"W",-81.718419999999995]
["CA210","N",33.978574000000002,"W",-81.033345999999995]
["CA212"]
["CA214",null,38.478498999999999,null,-77.458839999999995]
["CA215"]
["CA216","N",36.313502,"W",-76.209416000000004]
["CA217","N",36.224888,"W",-78.951487999999998]
["CA218","N",37.512453999999998,"W",-77.427318999999997]
["CA220",null,35.579534000000002,"W",-78.875698999999997]
["CA221",null,33.974719999999998,"W",-81.051914999999994]
["CA222","N",34.828549000000002,"W",-81.269585000000006]
["CA223","N",36.060037000000001,"W",-77.83229]
["CA224","N",37.260108000000002,"W",-77.364734999999996]
["CA225"]
["CA226","N",35.504739000000001,"W",-80.330614999999995]
["CA227"]
["CA228"]
["CA229","N",36.347453000000002,"W",-81.396168000000003]
["CA23","N",35.18289,"W",-83.389880000000005]
["CA231"]
["CA232","N",null,"W"]
["CA233","N",36.740738,"W",-78.214027999999999]
["CA235","N",null,"W"]
["CA236","N",36.098593000000001,"W",-82.744871000000003]
["CA238"]
["CA239"]
["CA24","N",36.507544000000003,"W",-80.591076000000001]
["CA241"]
["CA242","N",35.002491999999997,"W",-82.125208000000001]
["CA243","N",37.494267000000001,"W",-77.429885999999996]
["CA244","N",35.523000000000003,"W",-82.175399999999996]
["CA245"]
["CA246","N",36.017083999999997,"W",-78.874267000000003]
["CA247"]
["CA248"]
["CA249","N",35.220500000000001,"W",-80.647542000000001]
["CA25","N",34.978484000000002,"W",-83.359215000000006]
["CA250"]
["CA251","N",36.695324999999997,"W",-81.982737]
["CA252"]
["CA256"]
["CA259","N",34.840071999999999,"W",-77.540515999999997]
["CA26","N",35.230055999999998,"W",-80.244849000000002]
["CA260"]
["CA265"]
["CA266","N",null,"W"]
["CA267","N",34.623536999999999,"W",-80.382289999999998]
["CA268","N",35.585920999999999,"W",-81.241063999999994]
["CA269"]
["CA270","N",36.070531000000003,"W",-78.485541999999995]
["CA271","N",34.894787000000001,"W",-80.999021999999997]
["CA272","N",34.014186000000002,"W",-78.783805999999998]
["CA273","N",36.019967999999999,"W",-81.576071999999996]
["CA274","N",35.236497999999997,"W",-80.239287000000004]
["CA275"]
["CA276","N",35.379277999999999,"W",-80.698134999999994]
["CA277"]
["CA278","N",34.805928000000002,"W",-82.669137000000006]
["CA28","N",36.005654,"W",-79.748210999999998]
["CA280","N",35.248423000000003,"W",-82.40231]
["CA281","N",null,"W"]
["CA282","N",35.602601999999997,"W",-78.877609000000007]
["CA283","N",35.632061,"W",-81.961977000000005]
["CA284"]
["CA285","N",33.958351,"W",-83.338830999999999]
["CA286"]
["CA287","N",35.133237999999999,"W",-78.849585000000005]
["CA288","N",36.054645999999998,"W",-75.720911999999998]
["CA289","N",34.006599000000001,"W",-78.786107000000001]
["CA290","N",34.159120000000001,"W",-78.059139999999999]
["CA291"]
["CA292","N",35.660415999999998,"W",-79.176833000000002]
["CA293",null,37.197637999999998,null,-77.504617999999994]
["CA294"]
["CA295","N",34.828549000000002,"W",-81.269585000000006]
["CA296"]
["CA297","N",null,"W"]
["CA298","N",35.008490999999999,"W",-82.345754999999997]
["CA299","N",36.121972,"W",-78.772541000000004]
["CA3","N",36.461475999999998,"W",-80.593323999999996]
["CA30","N",35.766084999999997,"W",-79.823999000000001]
["CA300","N",null,"W"]
["CA301","N",null,"W"]
["CA302",null,35.114674000000001,null,-80.891079000000005]
["CA303","N",35.892403999999999,"W",-78.746623999999997]
["CA304","N",36.169713000000002,"W",-78.444863999999995]
["CA305"]
["CA306","N",39.846800999999999,"W",-82.130589999999998]
["CA307","N",37.236153999999999,"W",-81.319535000000002]
["CA308","N",36.134875999999998,"W",-81.218914999999996]
["CA309"]
["CA31","N",35.111865000000002,"W",-80.921875]
["CA310",null,34.097372999999997,null,-79.313676999999998]
["CA311","N",35.914296,"W",-81.072593999999995]
["CA312","N",35.014719999999997,"W",-80.542900000000003]
["CA313","N",36.385179000000001,"W",-81.962238999999997]
["CA314"]
["CA315","N",35.899016000000003,"W",-82.100712000000001]
["CA316","N",34.430999999999997,"W",-82.631600000000006]
["CA317","N",35.343172000000003,"W",-78.034409999999994]
["CA318","N",36.146419999999999,"W",-80.230710000000002]
["CA319","N",34.359216000000004,"W",-77.857907999999995]
["CA32","N",35.027617999999997,"W",-80.603740999999999]
["CA320","N",null,"W"]
["CA321","N",35.066482000000001,"W",-83.988085999999996]
["CA322","N",null,"W"]
["CA323","N",null,"W"]
["CA324","N",null,"W"]
["CA325","N",34.703234999999999,"W",-80.461099000000004]
["CA326","N",null,"W"]
["CA327","N",null,"W"]
["CA328","N",33.800556999999998,"W",-83.531406000000004]
["CA329","N",36.516776,"W",-78.963525000000004]
["CA330","N",33.511789999999998,"W",-82.618388999999993]
["CA331","N",35.669918000000003,"W",-77.908022000000003]
["CA332","N",35.926960999999999,"W",-78.539962000000003]
["CA333","N",33.767195000000001,"W",-84.665999999999997]
["CA334","N",37.386913,"W",-79.794443999999999]
["CA335","N",37.693855999999997,"W",-77.652664999999999]
["CA336","N",37.600633999999999,"W",-77.728961999999996]
["CA337","N",36.766759,"W",-76.293198000000004]
["CA338","N",null,"W"]
["CA339","N",35.215510000000002,"W",-78.933400000000006]
["CA34","N",34.584676000000002,"W",-79.748296999999994]
["CA340","N",34.635494000000001,"W",-77.750290000000007]
["CA341","N",35.323690999999997,"W",-77.977524000000003]
["CA342","N",null,"W"]
["CA343","N",35.271616000000002,"W",-80.832454999999996]
["CA344","N",35.907753,"W",-82.473167000000004]
["CA345","N",35.584989999999998,"W",-76.103046000000006]
["CA346","N",36.881715,"W",-80.766205999999997]
["CA347","N",32.931431000000003,"W",-83.521416000000002]
["CA348","N",35.911943000000001,"W",-82.364975000000001]
["CA349","N",34.260326999999997,"W",-78.092613]
["CA35"]
["CA350","N",null,"W"]
["CA351","N",36.457309000000002,"W",-81.029449]
["CA352","N",35.351045999999997,"W",-80.833551]
["CA353","N",35.947763999999999,"W",-79.941361999999998]
["CA354","N",null,"W"]
["CA355","N",37.134045,"W",-79.297027999999997]
["CA356","N",35.975686000000003,"W",-83.604321999999996]
["CA357","N",35.848987000000001,"W",-83.564329000000001]
["CA358","N",35.727826,"W",-83.945863000000003]
["CA359","N",36.148826,"W",-81.029984999999996]
["CA360","N",35.876202999999997,"W",-82.479816999999997]
["CA361","N",36.934990999999997,"W",-81.040857000000003]
["CA362","N",35.911943000000001,"W",-82.364975000000001]
["CA363","N",null,"W"]
["CA364","N",35.876202999999997,"W",-82.479816999999997]
["CA365","N",34.131726999999998,"W",-83.927490000000006]
["CA366","N",35.876202999999997,"W",-82.479816999999997]
["CA367","N",34.573900000000002,"W",-83.551900000000003]
["CA368","N",34.563899999999997,"W",-83.369399999999999]
["CA369","N",35.239412999999999,"W",-81.814165000000003]
["CA37",null,35.131262999999997,"W",-80.720371999999998]
["CA370","N",null,"W"]
["CA371","N",35.972839999999998,"W",-77.760082999999995]
["CA372","N",33.603946000000001,"W",-84.394870999999995]
["CA373","N",null,"W"]
["CA374","N",36.541252,"W",-79.665728000000001]
["CA375","N",null,"W"]
["CA376","N",36.060400000000001,"W",-79.925364999999999]
["CA377","N",36.126730000000002,"W",-79.347309999999993]
["CA378","N",35.912036999999998,"W",-82.232461999999998]
["CA379","N",34.953819000000003,"W",-79.928801000000007]
["CA38","N",34.884103000000003,"W",-77.231482999999997]
["CA380","N",35.351115999999998,"W",-77.986407]
["CA381","N",34.742764999999999,"W",-76.801862999999997]
["CA382","N",35.136633000000003,"W",81.528683000000001]
["CA383","N",35.382914,"W",-80.196016]
["CA384","N",35.382914,"W",-80.196016]
["CA385","N",36.035980000000002,"W",-80.106778000000006]
["CA386","N",36.349400000000003,"W",-76.816900000000004]
["CA387","N",35.433540000000001,"W",-82.513400000000004]
["CA388","N",35.271402000000002,"W",-80.832740999999999]
["CA389","N",36.005654,"W",-79.748210999999998]
["CA39","N",36.051876,"W",-79.508236999999994]
["CA390","N",35.396352999999998,"W",-78.306456999999995]
["CA391","N",35.912036999999998,"W",-82.232461999999998]
["CA392","N",35.879984,"W",-81.556652999999997]
["CA393","N",35.753703999999999,"W",-78.593214000000003]
["CA394","N",null,"W"]
["CA395","N",null,"W"]
["CA396","N",null,"W"]
["CA397","N",34.124943000000002,"W",-81.113951]
["CA398","N",null,"W"]
["CA399","N",34.902856999999997,"W",-83.711551]
["CA40","N",34.356884000000001,"W",-77.864245999999994]
["CA400","N",37.310775999999997,"W",-79.196890999999994]
["CA401","N",36.379508999999999,"W",-82.183282000000005]
["CA402","N",35.753931999999999,"W",-78.593648999999999]
["CA403","N",35.345421000000002,"W",-79.914164999999997]
["CA404","N",36.561255000000003,"W",-82.608337000000006]
["CA405","N",34.995162999999998,"W",-80.542354000000003]
["CA406","N",33.527788000000001,"W",-82.035972999999998]
["CA407","N",34.996065000000002,"W",-77.986407]
["CA408","N",34.720542999999999,"W",-76.703952000000001]
["CA409","N",36.132052000000002,"W",-80.131322999999995]
["CA41","N",35.297229000000002,"W",-80.863066000000003]
["CA410","N",32.928499000000002,"W",-82.499821999999995]
["CA411","N",36.481489000000003,"W",-76.131649999999993]
["CA412","N",32.928499000000002,"W",-82.499821999999995]
["CA413","N",null,"W"]
["CA414","N",33.386087000000003,"W",-82.637716999999995]
["CA415","N",35.275416,"W",-81.244534999999999]
["CA416","N",36.379508999999999,"W",-82.183282000000005]
["CA417","N",39.254219999999997,"W",-78.085634999999996]
["CA418","N",35.833753000000002,"W",-78.764370999999997]
["CA419","N",36.474367000000001,"W",-76.128793000000002]
["CA42","N",35.668506000000001,"W",-77.630317000000005]
["CA420","N",34.185671999999997,"W",-77.953963999999999]
["CA421","N",45.160879999999999,"W",-67.137915000000007]
["CA422","N",35.605012000000002,"W",-78.879883000000007]
["CA423","N",null,"W"]
["CA424","N",45.633876999999998,"W",-61.422125999999999]
["CA425","N",32.076151000000003,"W",-81.048097999999996]
["CA426","N",null,"W"]
["CA427","N",null,"W"]
["CA428","N",35.855463,"W",-78.711314000000002]
["CA429","N",38.211095,"W",-77.550777999999994]
["CA43","N",35.717019999999998,"W",-81.301822999999999]
["CA430","N",null,"W"]
["CA431","N",34.326649000000003,"W",-78.776977000000002]
["CA432","N",null,"W"]
["CA433","N",43.849910999999999,"W",-79.980613000000005]
["CA434","N",36.426709000000002,"W",-81.773808000000002]
["CA435","N",null,"W"]
["CA436","N",35.061321999999997,"W",-84.188734999999994]
["CA437","N",null,"W"]
["CA438","N",37.157887000000002,"W",-80.304383999999999]
["CA44"]
["CA46",null,35.964756000000001,"W",-79.920193999999995]
["CA47","N",35.520546000000003,"W",-80.584057999999999]
["CA48","N",35.225724,"W",-81.339361999999994]
["CA5","N",35.879984,"W",-81.556652999999997]
["CA50"]
["CA51",null,36.060417999999999,null,-79.925364999999999]
["CA52",null,36.371012,null,-79.726775000000004]
["CA54","N",35.804465999999998,"W",-80.913083999999998]
["CA55","N",36.608707000000003,"W",-77.582424000000003]
["CA56","N",35.773539,"W",-80.598793000000001]
["CA57","N",35.702164000000003,"W",-78.577136999999993]
["CA59","N",35.213900000000002,"W",-82.002099999999999]
["CA6","N",35.34695,"W",-81.312623000000002]
["CA60","N",35.296335999999997,"W",-82.149410000000003]
["CA61","N",35.846781999999997,"W",-78.710387999999995]
["CA62","N",36.070152999999998,"W",-78.894054999999994]
["CA63","N",35.283766999999997,"W",-78.724027000000007]
["CA64","N",35.472107000000001,"W",-78.137972000000005]
["CA65","N",35.971511999999997,"W",-77.751231000000004]
["CA66","N",35.766500999999998,"W",-78.084275000000005]
["CA67","N",35.931106999999997,"W",-78.543345000000002]
["CA68","N",36.256413999999999,"W",-80.811103000000003]
["CA69","N",35.323700000000002,"W",-82.400899999999993]
["CA7","N",35.461010000000002,"W",-81.394000000000005]
["CA70","N",36.355213999999997,"W",-78.348459000000005]
["CA71","N",36.759404000000004,"W",-77.743176000000005]
["CA72","N",36.176855000000003,"W",-80.268285000000006]
["CA75",null,36.535156999999998,null,-79.459670000000003]
["CA76",null,36.241660000000003,"W",-79.935815000000005]
["CA78","N",36.727434000000002,"W",-78.846988999999994]
["CA79","N",36.106467000000002,"W",-81.099030999999997]
["CA8"]
["CA80","N",35.967185000000001,"W",-80.530692999999999]
["CA81","N",35.364775000000002,"W",-82.454474000000005]
["CA82","N",35.151584,"W",-81.435598999999996]
["CA83","N",34.907637000000001,"W",-81.784471999999994]
["CA85","N",35.507567999999999,"W",-80.323988]
["CA898"]
["CA899","N",35.654052999999998,"W",-80.488632999999993]
["CA9000"]
["CA900000"]
["CA91","N",35.935250000000003,"W",-81.488753000000003]
["CA9266"]
["CA94","N",34.938706000000003,"W",-79.823207999999994]
["CA97",null,35.410660999999998,null,-79.206500000000005]
["CA98","N",35.797772999999999,"W",-78.502251000000001]
["CA998","N",36.053156999999999,"W",-81.882369999999995]
["CA9999111"]
["CA9999114"]
["CA99992"]
["FA10","N",34.584905999999997,"W",-79.748661999999996]
["FA100","N",35.773536,"W",-80.598793000000001]
["FA104","N",34.884099999999997,"W",-77.231482999999997]
["FA107","N",34.131726999999998,"W",-83.927490000000006]
["FA11"]
["FA110","N",34.305303000000002,"W",-77.980520999999996]
["FA111","N",35.198165000000003,"W",-79.752889999999994]
["FA113","N",35.247394,"W",-79.722059000000002]
["FA115"]
["FA116","N",null,"W"]
["FA117"]
["FA118"]
["FA119","N",34.415740999999997,"W",-77.868156999999997]
["FA120"]
["FA121"]
["FA122","N",35.410108999999999,"W",-79.199066000000002]
["FA125"]
["FA126","N",35.681038999999998,"W",-82.600757999999999]
["FA129","N",34.425035999999999,"W",-79.866028]
["FA132"]
["FA134"]
["FA141","N",33.475107000000001,"W",-81.904539999999997]
["FA142","N",32.597915,"W",-84.465147000000002]
["FA143","N",36.543387000000003,"W",-77.324883999999997]
["FA144"]
["FA145"]
["FA149"]
["FA153"]
["FA154"]
["FA155","N",36.940117000000001,"W",-81.025672]
["FA157"]
["FA158","N",36.024619999999999,"W",-80.060130000000001]
["FA159","N",36.339466000000002,"W",-76.064421999999993]
["FA16"]
["FA162","N",35.056310000000003,"W",-82.582790000000003]
["FA163",null,36.060400000000001,null,-79.925364999999999]
["FA164","N",36.426709000000002,"W",-81.773808000000002]
["FA165","N",36.076608999999998,"W",-78.268575999999996]
["FA168","N",36.066125,"W",-83.728346999999999]
["FA171","N",36.121972,"W",-78.772541000000004]
["FA172","N",37.260105000000003,"W",-77.364734999999996]
["FA173","N",36.106464000000003,"W",-81.099030999999997]
["FA176","N",35.915992000000003,"W",-77.517129999999995]
["FA177","N",35.882089000000001,"W",-81.581438000000006]
["FA18"]
["FA181","N",33.824388999999996,"W",-79.269859999999994]
["FA183","N",36.355217000000003,"W",-78.348459000000005]
["FA184"]
["FA185","N",35.357883999999999,"W",-78.776043999999999]
["FA188"]
["FA192","N",36.925708999999998,"W",-80.993099000000001]
["FA195"]
["FA197","N",36.727431000000003,"W",-78.846988999999994]
["FA202"]
["FA203","N",35.111862000000002,"W",-80.921875]
["FA204","N",35.520549000000003,"W",-80.584057999999999]
["FA207"]
["FA208"]
["FA210","N",34.591636000000001,"W",-78.987003999999999]
["FA211",null,35.163220000000003,null,-78.808756000000002]
["FA212","N",34.907637000000001,"W",-81.784471999999994]
["FA213"]
["FA214","N",35.150666999999999,"W",-77.151770999999997]
["FA2140"]
["FA215"]
["FA216"]
["FA217"]
["FA219"]
["FA22","N",35.283763999999998,"W",-78.724027000000007]
["FA22002"]
["FA22022"]
["FA22030"]
["FA22039"]
["FA22063"]
["FA22074"]
["FA22075"]
["FA22076"]
["FA22091"]
["FA22093"]
["FA22097"]
["FA221","N",34.953819000000003,"W",-79.928801000000007]
["FA22133"]
["FA22134","N",36.574818999999998,"W",-80.929176999999996]
["FA22140"]
["FA22150"]
["FA22152"]
["FA222",null,35.392080999999997,null,-82.500812999999994]
["FA226","N",35.428623999999999,"W",-81.017241999999996]
["FA227"]
["FA228"]
["FA229","N",35.275877999999999,"W",-82.643300999999994]
["FA230"]
["FA231"]
["FA232"]
["FA233"]
["FA236","N",36.205551,"W",-81.718419999999995]
["FA237"]
["FA238"]
["FA239","N",34.756193000000003,"W",-80.313792000000007]
["FA241","N",34.156030000000001,"W",-79.155979000000002]
["FA242"]
["FA244"]
["FA245"]
["FA246"]
["FA247","N",35.18432,"W",-83.389529999999993]
["FA249","N",null,"W"]
["FA251","N",35.964759000000001,"W",-79.920193999999995]
["FA252","N",null,"W"]
["FA253","N",34.623362,"W",-78.266627999999997]
["FA254","N",35.966748000000003,"W",-77.685067000000004]
["FA255"]
["FA256"]
["FA257","N",null,"W"]
["FA258","N",null,"W"]
["FA259"]
["FA260","N",35.932398999999997,"W",-81.479355999999996]
["FA262"]
["FA263"]
["FA264","N",38.25591,"W",-76.641606999999993]
["FA265","N",33.855843,"W",-81.204701999999997]
["FA266","N",35.115859,"W",-80.896596000000002]
["FA28"]
["FA30"]
["FA305","N",36.035983000000002,"W",-80.106778000000006]
["FA306"]
["FA307","N",null,"W"]
["FA308","N",null,"W"]
["FA309","N",35.35116,"W",-77.986407]
["FA310","N",34.840071999999999,"W",-77.540515999999997]
["FA311","N",35.282482000000002,"W",-81.680446000000003]
["FA312"]
["FA313","N",35.664374000000002,"W",-77.902207000000004]
["FA314"]
["FA315","N",35.577753999999999,"W",-77.807636000000002]
["FA316"]
["FA317","N",36.508727,"W",-77.151347999999999]
["FA318"]
["FA319","N",35.889015000000001,"W",-80.781053]
["FA320","N",null,"W"]
["FA322"]
["FA323"]
["FA324"]
["FA325"]
["FA327","N",35.133234999999999,"W",-78.849585000000005]
["FA328"]
["FA329","N",33.845222999999997,"W",-79.521135999999998]
["FA330","N",null,"W"]
["FA332",null,33.866273,null,-83.406699000000003]
["FA333","N",null,"W"]
["FA334","N",35.4617,"W",-81.410499999999999]
["FA335","N",null,"W"]
["FA336","N",35.342328999999999,"W",-78.034531999999999]
["FA337","N",null,"W"]
["FA338","N",36.054642999999999,"W",-75.720911999999998]
["FA339","N",35.406385,"W",-80.704421999999994]
["FA34","N",34.978481000000002,"W",-83.359215000000006]
["FA340","N",35.302289999999999,"W",-77.936389000000005]
["FA341","N",null,"W"]
["FA343","N",null,"W"]
["FA344","N",34.014183000000003,"W",-78.783805999999998]
["FA345","N",null,"W"]
["FA346","N",35.294398000000001,"W",-77.912477999999993]
["FA347","N",36.678815,"W",-80.973974999999996]
["FA348","N",35.550314999999998,"W",-77.065726999999995]
["FA349","N",36.070531000000003,"W",-78.485541999999995]
["FA350"]
["FA351"]
["FA352","N",34.828549000000002,"W",-81.269585000000006]
["FA353","N",35.743841000000003,"W",-80.46266]
["FA354","N",null,"W"]
["FA356","N",34.195610000000002,"W",-77.597890000000007]
["FA357","N",null,"W"]
["FA358"]
["FA359","N",35.892403999999999,"W",-78.746623999999997]
["FA360","N",35.664374000000002,"W",-77.902207000000004]
["FA361","N",null,"W"]
["FA362","N",37.391289,"W",-79.796707999999995]
["FA363"]
["FA364",null,33.493504000000001,null,-81.933245999999997]
["FA365","N",null,"W"]
["FA366","N",34.807250000000003,"W",-81.474823999999998]
["FA367","N",39.350591000000001,"W",-81.344023000000007]
["FA368","N",35.296216999999999,"W",-79.149028000000001]
["FA369"]
["FA370"]
["FA371","N",36.759407000000003,"W",-77.743176000000005]
["FA372","N",34.805928000000002,"W",-82.669137000000006]
["FA373","N",36.688298000000003,"W",-79.938883000000004]
["FA374","N",34.938709000000003,"W",-79.823207999999994]
["FA375","N",36.022275,"W",-77.206959999999995]
["FA376","N",36.134875999999998,"W",-81.218914999999996]
["FA377","N",35.527092000000003,"W",-81.026443999999998]
["FA378","N",null,"W"]
["FA379",null,35.264060999999998,null,-83.401759999999996]
["FA380","N",36.348148999999999,"W",-80.565472]
["FA381",null,35.395487000000003,null,-78.331146000000004]
["FA382","N",35.702160999999997,"W",-78.577136999999993]
["FA383"]
["FA384","N",35.373412000000002,"W",-78.310283999999996]
["FA385","N",36.100529999999999,"W",-80.509780000000006]
["FA386"]
["FA387","N",35.702477999999999,"W",-77.482544000000004]
["FA388","N",null,"W"]
["FA389","N",null,"W"]
["FA390","N",null,"W"]
["FA391","N",null,"W"]
["FA392","N",35.379275,"W",-80.698134999999994]
["FA393","N",36.055908000000002,"W",-77.750072000000003]
["FA394","N",34.430025999999998,"W",-82.629285999999993]
["FA395","N",36.061149999999998,"W",-80.50985]
["FA396","N",35.093783000000002,"W",-82.971615]
["FA397","N",36.169710000000002,"W",-78.444863999999995]
["FA398","N",35.284796999999998,"W",-80.571691000000001]
["FA399","N",34.281111000000003,"W",-77.972103000000004]
["FA400","N",35.610199999999999,"W",-82.364768999999995]
["FA401","N",null,"W"]
["FA402","N",null,"W"]
["FA403","N",35.228448,"W",-77.722069000000005]
["FA404","N",36.490878000000002,"W",-77.117208000000005]
["FA405","N",34.603920000000002,"W",-79.006754000000001]
["FA406","N",null,"W"]
["FA407","N",35.254744000000002,"W",-77.113153999999994]
["FA408","N",37.236156999999999,"W",-81.319535000000002]
["FA409","N",35.854230000000001,"W",-80.386480000000006]
["FA410","N",null,"W"]
["FA411","N",34.894784000000001,"W",-80.999021999999997]
["FA412","N",34.756034999999997,"W",-80.315595000000002]
["FA413","N",null,"W"]
["FA414","N",35.225721,"W",-81.339361999999994]
["FA415","N",35.375700000000002,"W",-81.574100000000001]
["FA416","N",36.098596000000001,"W",-82.744871000000003]
["FA417","N",33.855843,"W",-81.204701999999997]
["FA418","N",35.97683,"W",-80.402609999999996]
["FA419","N",33.475107000000001,"W",-81.904539999999997]
["FA420","N",33.800556999999998,"W",-83.531406000000004]
["FA421","N",36.269579999999998,"W",-80.720209999999994]
["FA422","N",34.717706999999997,"W",-80.284664000000006]
["FA423","N",35.318081999999997,"W",-80.728077999999996]
["FA424","N",35.806294000000001,"W",-78.706552000000002]
["FA425","N",34.730891,"W",-80.452881000000005]
["FA426","N",37.242049999999999,"W",-76.938069999999996]
["FA427","N",34.749318000000002,"W",-81.476411999999996]
["FA428","N",null,"W"]
["FA429","N",34.524980999999997,"W",-80.373751999999996]
["FA430","N",33.848712999999996,"W",-81.120687000000004]
["FA431","N",null,"W"]
["FA432","N",33.843998999999997,"W",-79.279725999999997]
["FA433","N",35.395299999999999,"W",-81.562700000000007]
["FA434","N",34.799833,"W",-81.484138999999999]
["FA435","N",33.767411000000003,"W",-84.668025999999998]
["FA436","N",null,"W"]
["FA437","N",null,"W"]
["FA438","N",35.008493999999999,"W",-82.345754999999997]
["FA439","N",33.202804,"W",-82.187047000000007]
["FA440","N",36.516779,"W",-78.963525000000004]
["FA441","N",34.260323999999997,"W",-78.092613]
["FA442","N",35.821767000000001,"W",-80.481994999999998]
["FA443","N",34.818962999999997,"W",-77.812892000000005]
["FA444","N",32.563380000000002,"W",-83.197978000000006]
["FA445","N",35.504736000000001,"W",-80.330614999999995]
["FA446","N",35.259956000000003,"W",-77.518299999999996]
["FA447","N",35.665993999999998,"W",-77.191417999999999]
["FA448","N",34.635497000000001,"W",-77.750290000000007]
["FA449","N",35.889814999999999,"W",-80.780732999999998]
["FA450","N",34.471077999999999,"W",-81.535099000000002]
["FA451","N",35.184199999999997,"W",-83.389529999999993]
["FA452","N",36.934990999999997,"W",-81.040857000000003]
["FA453","N",33.062198000000002,"W",-83.805770999999993]
["FA454","N",34.717706999999997,"W",-80.284664000000006]
["FA455","N",34.131202999999999,"W",-83.924324999999996]
["FA456","N",34.708316000000003,"W",-80.368080000000006]
["FA457","N",35.848987000000001,"W",-83.564329000000001]
["FA458","N",35.548361999999997,"W",-82.651510000000002]
["FA459","N",35.670954999999999,"W",-77.448036000000002]
["FA460","N",36.095441000000001,"W",-77.256911000000002]
["FA461","N",36.060333999999997,"W",-80.469869000000003]
["FA462","N",32.596305999999998,"W",-84.254024999999999]
["FA463","N",null,"W"]
["FA464","N",36.224885,"W",-78.951487999999998]
["FA465","N",35.712207999999997,"W",-80.435452999999995]
["FA466","N",36.177826000000003,"W",-80.265812999999994]
["FA467","N",36.175955000000002,"W",-81.102169000000004]
["FA468","N",36.222205000000002,"W",-80.909982999999997]
["FA469","N",33.885807,"W",-81.037959999999998]
["FA470","N",34.799833,"W",-81.484138999999999]
["FA471","N",35.683920999999998,"W",81.098515000000006]
["FA472","N",35.396352999999998,"W",-78.306456999999995]
["FA473","N",36.767066,"W",-76.289304000000001]
["FA474","N",35.211886999999997,"W",-81.894369999999995]
["FA475","N",33.876624,"W",-81.081449000000006]
["FA476","N",35.158248999999998,"W",-81.453967000000006]
["FA477","N",36.460549999999998,"W",-77.085599999999999]
["FA478","N",35.703060999999998,"W",-77.480889000000005]
["FA479","N",35.236497999999997,"W",-80.239287000000004]
["FA480","N",36.060037000000001,"W",-77.83229]
["FA481","N",35.797772999999999,"W",-78.502251000000001]
["FA482","N",35.255169000000002,"W",-77.113234000000006]
["FA483","N",35.207301999999999,"W",-78.764446000000007]
["FA484","N",36.349400000000003,"W",-76.816900000000004]
["FA485","N",null,"W"]
["FA486","N",34.524980999999997,"W",-80.373751999999996]
["FA487","N",35.92004,"W",-82.057500000000005]
["FA488","N",35.526294999999998,"W",-77.064216000000002]
["FA489","N",35.352075999999997,"W",-78.194147999999998]
["FA490","N",35.591397999999998,"W",-78.869038000000003]
["FA491","N",35.891002999999998,"W",-77.865480000000005]
["FA492","N",35.766483999999998,"W",-78.084317999999996]
["FA493","N",34.351261999999998,"W",-78.127099999999999]
["FA494","N",35.076430000000002,"W",-79.389662000000001]
["FA495","N",36.370953999999998,"W",-79.726792000000003]
["FA496","N",36.008398,"W",-79.748478000000006]
["FA497","N",36.054313,"W",-79.509247000000002]
["FA498","N",35.927205999999998,"W",-79.153065999999995]
["FA499","N",36.23968,"W",-79.933006000000006]
["FA500","N",36.461485000000003,"W",-80.593356]
["FA501","N",null,"W"]
["FA502","N",35.618667000000002,"W",-79.105463]
["FA503","N",36.978999000000002,"W",-77.347684000000001]
["FA504","N",35.433540000000001,"W",-82.513400000000004]
["FA505","N",35.894109,"W",-84.909718999999996]
["FA506","N",36.379508999999999,"W",-82.183282000000005]
["FA507","N",36.016837000000002,"W",-78.874245000000002]
["FA508","N",35.926802000000002,"W",-78.539445000000001]
["FA509","N",null,"W"]
["FA510","N",null,"W"]
["FA511","N",31.860927,"W",-81.472010999999995]
["FA512","N",38.683095999999999,"W",-75.565813000000006]
["FA513","N",35.603318000000002,"W",-78.883706000000004]
["FA514","N",null,"W"]
["FA515","N",35.931151999999997,"W",-78.543353999999994]
["FA516","N",36.347427000000003,"W",-81.396415000000005]
["FA517","N",35.22822,"W",-80.618033999999994]
["FA518","N",35.409128000000003,"W",-79.211861999999996]
["FA519","N",36.533093999999998,"W",-79.670736000000005]
["FA520","N",36.439382000000002,"W",-81.488687999999996]
["FA521","N",35.131093,"W",-80.720411999999996]
["FA522","N",36.255541999999998,"W",-80.811363999999998]
["FA523","N",35.29665,"W",-82.148083]
["FA524","N",35.879773999999998,"W",-81.556259999999995]
["FA525","N",35.016643000000002,"W",-84.244545000000002]
["FA526","N",35.346862999999999,"W",-81.312664999999996]
["FA527","N",35.163902,"W",-83.425331]
["FA528","N",35.239448000000003,"W",-81.814254000000005]
["FA529","N",35.420034999999999,"W",-78.503099000000006]
["FA53"]
["FA530","N",35.335340000000002,"W",-83.836816999999996]
["FA531","N",36.607691000000003,"W",-77.582035000000005]
["FA532","N",36.507531,"W",-80.591874000000004]
["FA533","N",36.534802999999997,"W",-79.459612000000007]
["FA534","N",35.804439000000002,"W",-80.913158999999993]
["FA535","N",35.588802000000001,"W",-81.240898999999999]
["FA536","N",null,"W"]
["FA537","N",36.126705999999999,"W",-79.347279]
["FA538","N",35.507534,"W",-80.323955999999995]
["FA539","N",36.313476000000001,"W",-76.209417000000002]
["FA540","N",35.867697,"W",-82.298516000000006]
["FA541","N",35.717028999999997,"W",-81.301833999999999]
["FA542","N",34.991819999999997,"W",-83.848622000000006]
["FA543","N",35.027535999999998,"W",-80.603808000000001]
["FA544","N",37.698937999999998,"W",-77.655788999999999]
["FA545","N",33.974404999999997,"W",-81.051775000000006]
["FA546","N",35.787350000000004,"W",-82.036387000000005]
["FA547","N",35.838380000000001,"W",-78.767765999999995]
["FA548","N",35.364775000000002,"W",-82.454474000000005]
["FA549","N",37.197592999999998,"W",-77.504630000000006]
["FA550","N",35.151105999999999,"W",-81.435475999999994]
["FA551","N",34.902856999999997,"W",-83.711551]
["FA552","N",35.763005999999997,"W",-79.825091999999998]
["FA553","N",35.357883999999999,"W",-78.776043999999999]
["FA554","N",35.066580000000002,"W",-83.988077000000004]
["FA555","N",35.248423000000003,"W",-82.40231]
["FA556","N",34.096789999999999,"W",-79.309495999999996]
["FA557","N",35.793067000000001,"W",-82.654432]
["FA558","N",35.970222999999997,"W",-82.099553]
["FA559","N",34.012630000000001,"W",-78.779777999999993]
["FA560","N",36.561357999999998,"W",-82.608283999999998]
["FA561","N",35.660559999999997,"W",-79.176798000000005]
["FA562","N",35.295997,"W",-80.860733999999994]
["FA563","N",36.584158000000002,"W",-81.307518000000002]
["FA564","N",35.440697,"W",-83.007457000000002]
["FA565","N",35.472150999999997,"W",-78.137992999999994]
["FA566","N",37.600608000000001,"W",-77.729005999999998]
["FA567","N",34.832521,"W",-81.268129999999999]
["FA568","N",35.849207,"W",-78.711025000000006]
["FA569","N",36.070196000000003,"W",-78.894096000000005]
["FA570","N",34.741937,"W",-76.802223999999995]
["FA571","N",36.054597999999999,"W",-81.881238999999994]
["FA572","N",35.671942999999999,"W",-77.626081999999997]
["FA573","N",35.365220999999998,"W",-83.261218]
["FA574","N",33.978611000000001,"W",-81.033399000000003]
["FA575","N",36.385990999999997,"W",-81.963829000000004]
["FA576","N",36.215772999999999,"W",-81.636480000000006]
["FA577","N",33.979126999999998,"W",-81.034654000000003]
["FA578","N",35.894326999999997,"W",-78.749027999999996]
["FA579","N",35.852837000000001,"W",-80.160242999999994]
["FA58","N",34.356884000000001,"W",-77.864245999999994]
["FA580","N",35.899016000000003,"W",-82.100733000000005]
["FA581","N",35.404535000000003,"W",-80.705993000000007]
["FA582","N",37.310645999999998,"W",-79.196780000000004]
["FA583","N",36.149664999999999,"W",-81.020285999999999]
["FA584","N",39.570875000000001,"W",-76.105770000000007]
["FA585","N",35.360681999999997,"W",-82.005069000000006]
["FA586","N",null,"W"]
["FA587","N",34.694555000000001,"W",-80.444868999999997]
["FA588","N",null,"W"]
["FA589","N",36.935167,"W",-77.190321999999995]
["FA590","N",36.457797999999997,"W",-81.031609000000003]
["FA591","N",34.325527000000001,"W",-77.996896000000007]
["FA592","N",35.115856000000001,"W",-80.896541999999997]
["FA593","N",35.22822,"W",-80.618033999999994]
["FA594","N",32.927438000000002,"W",-83.498493999999994]
["FA595","N",38.683095999999999,"W",-75.565813000000006]
["FA596","N",null,"W"]
["FA597","N",34.861781999999998,"W",-83.952575999999993]
["FA598","N",35.275416,"W",-81.244534999999999]
["FA599","N",39.254219999999997,"W",-78.085634999999996]
["FA6","N",34.953809999999997,"W",-79.942446000000004]
["FA60","N",35.212105000000001,"W",-79.726963999999995]
["FA600","N",33.329239999999999,"W",-82.128240000000005]
["FA601","N",36.740642999999999,"W",-78.214039]
["FA602","N",33.718860999999997,"W",-83.294279000000003]
["FA603","N",34.699564000000002,"W",-80.269891000000001]
["FA604","N",32.931431000000003,"W",-83.521416000000002]
["FA605","N",35.247407000000003,"W",-77.592849999999999]
["FA606","N",33.905092000000003,"W",-81.091558000000006]
["FA607","N",33.949860000000001,"W",-80.481436000000002]
["FA608","N",null,"W"]
["FA609","N",36.474367000000001,"W",36.474367000000001]
["FA610","N",34.369126000000001,"W",-77.853750000000005]
["FA611","N",null,"W"]
["FA612","N",null,"W"]
["FA613","N",36.573937999999998,"W",-77.294353999999998]
["FA614","N",38.211095,"W",-77.550777999999994]
["FA615","N",null,"W"]
["FA616","N",35.350309000000003,"W",-78.188156000000006]
["FA617","N",34.955119000000003,"W",-79.604387000000003]
["FA618","N",33.053103,"W",-80.467321999999996]
["FA619","N",36.426709000000002,"W",-81.773808000000002]
["FA620","N",34.326649000000003,"W",-78.776977000000002]
["FA621","N",null,"W"]
["FA622","N",43.316879,"W",-81.003114999999994]
["FA623","N",36.426709000000002,"W",-81.773808000000002]
["FA624","N",null,"W"]
["FA625","N",35.061321999999997,"W",-84.188734999999994]
["FA626","N",null,"W"]
["FA627","N",37.157887000000002,"W",-80.304383999999999]
["FA628","N",33.287612000000003,"W",-82.342860999999999]
["FA629","N",37.494267000000001,"W",-77.429885999999996]
["FA63","N",36.256433999999999,"W",-77.329464999999999]
["FA630","N",37.993868999999997,"W",-77.345821000000001]
["FA631","N",37.519176000000002,"W",-77.772062000000005]
["FA632","N",34.910781,"W",-83.743295000000003]
["FA64","N",34.699778000000002,"W",-80.334434999999999]
["FA66","N",36.586728000000001,"W",-82.277083000000005]
["FA76","N",35.967188,"W",-80.530692999999999]
["FA78","N",36.370567999999999,"W",-82.296366000000006]
["FA798"]
["FA85","N",35.768222000000002,"W",-81.661834999999996]
["FA86"]
["FA88","N",36.695328000000003,"W",-81.982737]
["FA93","N",36.496147999999998,"W",-77.107564999999994]
["FA98"]
["FA998","N",35.565213,"W",-82.578749000000002]
["FA9997"]

{"sheet":"CHEMSTONE","index":5,"n_rows":3003,"n_cols":10,"rows_kept":3003,"cut":false,"hidden":true,"merged":[]}
["Producer Name","Location","Sample Date","Sample ID","Material Description","Sampled By","Resistivity [ohm-cm]:","pH","Chloride [ppm]:","Sulfate [ppm]:"]
["Aggregates USA","Abingdon Quarry","2016-09-28",828584,"#57 Stone for Electrochemical","Church, Tracy G",8741,7.7,0,14.2]
["Aggregates USA","Elizabethton Quarry","2016-09-28",828607,"#57 Stone for Electrochemical","Church, Tracy G",15265,7.3,0,9.6999999999999993]
["Aggregates USA","Watauga Quarry","2016-09-28",828603,"#57 Stone for Electrochemical","Church, Tracy G",16139,6.7,0,6.1]
["Ararat Rock Products","Eden Quarry - Cascade, VA","2016-02-09",793258,"#78-M Stone for Electrochemical","Westmoreland, Braxton J",11488,8.6,0,9.6]
["Ararat Rock Products","Eden Quarry - Cascade, VA","2016-02-09",793259,"#57 Stone for Electrochemical","Westmoreland, Braxton J",14265,8.8000000000000007,0,10.199999999999999]
["Ararat Rock Products","Mt. Airy Quarry - Mt. Airy","2016-01-11",790443,"#57 Stone for Electrochemical","Whitley, Christopher D",14205,8.6,10,0]
["Ararat Rock Products","Mt. Airy Quarry - Mt. Airy","2016-01-11",790444,"Miscellaneous Material for Electrochemical","Whitley, Christopher D",1655,7.7,10,0]
["Ararat Rock Products","Mt. Airy Quarry - Mt. Airy","2016-03-01",795846,"#78-M Stone for Electrochemical","Whitley, Christopher D",15858,7.9,0,10.1]
["Ararat Rock Products","Mt. Airy Quarry - Mt. Airy","2017-01-31",843861,"#78-M Stone for Electrochemical","Whitley, Christopher D",11582,8.3000000000000007,0,50.8]
["Ararat Rock Products","Mt. Airy Quarry - Mt. Airy","2017-01-31",843860,"#57 Stone for Electrochemical","Whitley, Christopher D",12816,8,0,48.7]
["Ararat Rock Products","Mt. Airy Quarry - Mt. Airy","2017-01-31",843862,"Miscellaneous Material for Electrochemical","Whitley, Christopher D",9355,7.7,0,64.400000000000006]
["Boone's Concrete Supply, LLC","Woodlawn Quarry","2016-10-28",832770,"#57 Stone for Electrochemical","Ausley, Jeff",13182,9.3000000000000007,0,0.8]
["Boone's Concrete Supply, LLC","Woodlawn Quarry","2016-10-28",832771,"#78-M Stone for Electrochemical","Ausley, Jeff",11364,9.1999999999999993,0,5.3]
["Boxley Concrete Products of Va","Fieldale Quarry - Martinsville","2016-02-17",794069,"#57 Stone for Electrochemical","Westmoreland, Braxton J",15154,8.3000000000000007,5.4,12.7]
["Boxley Concrete Products of Va","Fieldale Quarry - Martinsville","2016-02-17",794068,"#78-M Stone for Electrochemical","Westmoreland, Braxton J",23105,8.9,0,6.1]
["Boxley Concrete Products of Va","Lawyers Road Quarry","2016-03-14",798420,"#78-M Stone for Electrochemical","Fosque, Robert W",17065,7.6,0,9.5]
["Buckhorn Materials","Black Creek Sand Mine","2016-03-04",797150,"Select Material, Class III, Type 3 - Chemistry Check","Jordan, Daniel H",96618,5.5,0,5.0999999999999996]
["Buckhorn Materials","Lynches River Quarry","2015-06-29",764166,"#67 Stone for Electrochemical","Jordan, Daniel H",25773,9.3000000000000007,0,200]
["Buckhorn Materials","Lynches River Quarry","2015-06-29",764178,"Miscellaneous Material for Electrochemical","Jordan, Daniel H",16875,8.4,0,200]
["Buckhorn Materials","Lynches River Quarry","2016-02-11",793641,"#67 Stone for Electrochemical","Jordan, Daniel H",30057,7.6,5.4,4.8]
["Buckhorn Materials","Lynches River Quarry","2016-02-11",793642,"#78-M Stone for Electrochemical","Jordan, Daniel H",21959,7.5,0,4.2]
["Buckhorn Materials","Lynches River Quarry","2016-02-11",793640,"#57 Stone for Electrochemical","Jordan, Daniel H",26674,7.1,0,4.7]
["Hanson Aggregates Southeast Inc.","Crabtree Quarry - Raleigh","2016-02-19",794468,"#78-M Stone for Electrochemical","Skinner, III, John L",17966,8.1,0,4.0999999999999996]
["Hanson Aggregates Southeast Inc.","Crabtree Quarry - Raleigh","2016-02-19",794467,"#57 Stone for Electrochemical","Skinner, III, John L",24396,7.9,0,3.8]
["Hanson Aggregates Southeast Inc.","Crabtree Quarry - Raleigh","2016-02-19",794472,"Screenings - Chemistry Check","Skinner, III, John L",13367,8.3000000000000007,0,8.6]
["Hanson Aggregates Southeast Inc.","Holly Springs Quarry","2016-02-26",795306,"Screenings - Chemistry Check","Skinner, III, John L",7553,7.9,0,27.8]
["Hanson Aggregates Southeast Inc.","Holly Springs Quarry","2016-02-26",795305,"#78-M Stone for Electrochemical","Skinner, III, John L",19585,8.6,0,5.3]
["Hanson Aggregates Southeast Inc.","Holly Springs Quarry","2016-02-26",795303,"#57 Stone for Electrochemical","Skinner, III, John L",24313,8.1999999999999993,0,4.0999999999999996]
["Hanson Aggregates Southeast Inc.","Jefferson Q. - Jefferson, SC","2016-02-10",793427,"Screenings - Chemistry Check","Jordan, Daniel H",10508,7.2,5.4,8.6999999999999993]
["Hanson Aggregates Southeast Inc.","Jefferson Q. - Jefferson, SC","2016-12-14",838779,"Miscellaneous Material for Electrochemical","Jordan, Daniel H",14691,8.1,0,0]
["Hanson Aggregates Southeast Inc.","Jefferson Q. - Jefferson, SC","2016-12-14",838780,"#78-M Stone for Electrochemical","Jordan, Daniel H",26709,8.3000000000000007,0,0]
["Hanson Aggregates Southeast Inc.","Jefferson Q. - Jefferson, SC","2016-12-14",838781,"#57 Stone for Electrochemical","Jordan, Daniel H",31827,8.1,0,0]
["Hanson Aggregates Southeast Inc.","Marlboro Plant","2016-02-19",794732,"#78-M Stone for Electrochemical","Jordan, Daniel H",226552,6,0,4]
["Hanson Aggregates Southeast Inc.","Marlboro Plant","2016-02-19",794733,"#67 Stone for Electrochemical","Jordan, Daniel H",186567,5.0999999999999996,0,4.5]
["Hanson Aggregates Southeast Inc.","Neverson Q. - Bailey","2016-03-15",798233,"#78-M Stone for Electrochemical","Raines, James R",23288,7.4,0,4.5999999999999996]
["Hanson Aggregates Southeast Inc.","Neverson Q. - Bailey","2016-03-15",798232,"#57 Stone for Electrochemical","Raines, James R",22080,7.7,0,5.8]
["Hanson Aggregates Southeast Inc.","Princeton Quarry","2016-03-24",799116,"#57 Stone for Electrochemical","Raines, James R",13717,7.6,0,4.0999999999999996]
["Hanson Aggregates Southeast Inc.","Princeton Quarry","2016-03-24",799117,"#78-M Stone for Electrochemical","Raines, James R",13463,7.7,0,5.7]
["Hanson Aggregates Southeast Inc.","Princeton Quarry","2016-03-24",799118,"Screenings - Chemistry Check","Raines, James R",6472,8.4,10,14.1]
["Hanson Aggregates Southeast Inc.","Raleigh Q. - Wake Forest","2016-02-12",793719,"#57 Stone for Electrochemical","Skinner, III, John L",27071,9.1999999999999993,0,4.8]
["Hanson Aggregates Southeast Inc.","Raleigh Q. - Wake Forest","2016-02-12",793720,"#78-M Stone for Electrochemical","Skinner, III, John L",25927,7.7,0,4.0999999999999996]
["Hanson Aggregates Southeast Inc.","Raleigh Q. - Wake Forest","2016-02-12",793722,"Screenings - Chemistry Check","Skinner, III, John L",17053,7.4,0,0]
["Hanson Aggregates Southeast Inc.","Rocky Mount #2 Q.","2016-04-14",802198,"#78-M Stone for Electrochemical","Raines, James R",10244,9.3000000000000007,0,62.7]
["Hanson Aggregates Southeast Inc.","Rocky Mount #2 Q.","2016-04-14",802197,"#57 Stone for Electrochemical","Raines, James R",43346,7.9,0,0]
["Hanson Aggregates Southeast Inc.","Rougemont Quarry","2016-02-16",793930,"#57 Stone for Electrochemical","Skinner, III, John L",29940,9.4,5,8.3000000000000007]
["Hanson Aggregates Southeast Inc.","Rougemont Quarry","2016-02-16",793932,"#78-M Stone for Electrochemical","Skinner, III, John L",26378,7.8,0,3.7]
["Hanson Aggregates Southeast Inc.","Sandy Flats Quarry","2016-12-14",839142,"#67 Stone for Electrochemical","Wood, D. Michael M",21013,7.6,0,1.6]
["Hanson Aggregates Southeast Inc.","Sandy Flats Quarry","2016-12-14",839144,"#78-M Stone for Electrochemical","Wood, D. Michael M",21786,7.8,0,0.9]
["Hanson Aggregates Southeast Inc.","Sandy Flats Quarry","2016-12-14",839140,"#57 Stone for Electrochemical","Wood, D. Michael M",18152,7.7,0,2]
["Harrison Construction, Co., Div. of APAC-Atlantic","Dillsboro Quarry - Dillsboro","2016-10-04",828920,"#57 Stone for Electrochemical","Kindley, Wallace Quint",10607,7.5,0,8]
["Harrison Construction, Co., Div. of APAC-Atlantic","Dillsboro Quarry - Dillsboro","2016-10-04",828923,"#78-M Stone for Electrochemical","Kindley, Wallace Quint",8787,7.5,0,8.1999999999999993]
["Harrison Construction, Co., Div. of APAC-Atlantic","Dillsboro Quarry - Dillsboro","2016-10-04",828925,"Screenings - Chemistry Check","Kindley, Wallace Quint",1382,7.3,0,33.5]
["Harrison Construction, Co., Div. of APAC-Atlantic","Hayesville Quarry - Hayesville","2016-07-15",816297,"Screenings - Chemistry Check","Ledford, Brandon S",2440,7.8,2.1,144.69999999999999]
["Harrison Construction, Co., Div. of APAC-Atlantic","Hayesville Quarry - Hayesville","2016-07-15",816298,"#78-M Stone for Electrochemical","Ledford, Brandon S",8467,8.6999999999999993,2.1,28.4]
["Harrison Construction, Co., Div. of APAC-Atlantic","Hayesville Quarry - Hayesville","2016-07-15",816317,"#57 Stone for Electrochemical","Ledford, Brandon S",17449,8.8000000000000007,2.1,28.9]
["Harrison Construction, Co., Div. of APAC-Atlantic","Waynesville Quarry - Waynesville","2015-05-19",758295,"#57 Stone for Electrochemical","Wood, D. Michael M",12604,8.1999999999999993,0,0]
["Harrison Construction, Co., Div. of APAC-Atlantic","Waynesville Quarry - Waynesville","2016-09-26",827845,"#57 Stone for Electrochemical","Kindley, Wallace Quint",10436,7.7,0,12.9]
["Harrison Construction, Co., Div. of APAC-Atlantic","Waynesville Quarry - Waynesville","2016-09-26",827849,"#78-M Stone for Electrochemical","Kindley, Wallace Quint",7825,7.6,0,15.3]
["Harrison Construction, Co., Div. of APAC-Atlantic","Waynesville Quarry - Waynesville","2016-09-26",827851,"Screenings - Chemistry Check","Kindley, Wallace Quint",2380,7.5,0,40.9]
["Hedrick industries","Grove Stone Quarry","2016-04-08",801536,"Screenings - Chemistry Check","Rhymer, Robert C",8157,7.5,0,38.799999999999997]
["Hedrick industries","Grove Stone Quarry","2016-04-08",801532,"#78-M Stone for Electrochemical","Rhymer, Robert C",6964,7.3,0,49.1]
["Hedrick industries","Grove Stone Quarry","2016-04-08",801531,"#67 Stone for Electrochemical","Rhymer, Robert C",11593,7,0,21]
["Hedrick industries","Grove Stone Quarry","2016-12-12",838364,"Yearly Quality Check for Fine Aggregate (Strength, Soundness, etc.)","Rhymer, Robert C",6575,7.3,0,22.2]
["Hedrick industries","Lake Norman Quarry","2016-12-13",838934,"#57 Stone for Electrochemical","Kindley, Wallace Quint",13631,7.9,0,7.2]
["Hedrick industries","Lake Norman Quarry","2016-12-13",838935,"#78-M Stone for Electrochemical","Kindley, Wallace Quint",10028,7.7,0,21.7]
["Hedrick industries","North Buncombe Quarry","2016-10-10",829878,"#78-M Stone for Electrochemical","Kindley, Wallace Quint",1901,3.7,13.3,95.3]
["Hedrick industries","North Buncombe Quarry","2016-10-10",829874,"#57 Stone for Electrochemical","Kindley, Wallace Quint",3131,3.8,8.9,85.4]
["Hedrick industries","North Buncombe Quarry","2016-10-10",829882,"Screenings - Chemistry Check","Kindley, Wallace Quint",867,3.4,17.7,43.7]
["Hedrick industries","South McDowell Quarry","2016-01-29",791781,"#78-M Stone for Electrochemical","Rhymer, Robert C",22994,7.6,0,7.5]
["Hedrick industries","South McDowell Quarry","2016-01-29",791780,"#57 Stone for Electrochemical","Rhymer, Robert C",26364,7.6,5,5.3]
["Hedrick industries","South McDowell Quarry","2016-01-29",792270,"Screenings - Chemistry Check","Rhymer, Robert C",9497,7,5.4,33.6]
["Hedrick industries","South McDowell Quarry","2017-01-13",841896,"#78-M Stone for Electrochemical","Rhymer, Robert C",21088,7.8,0,30.3]
["Hedrick industries","South McDowell Quarry","2017-01-13",841899,"Screenings - Chemistry Check","Rhymer, Robert C",10930,7.5,0,55.9]
["Hedrick industries","South McDowell Quarry","2017-01-13",841894,"#57 Stone for Electrochemical","Rhymer, Robert C",22026,7.9,0,29.3]
["J.T. Russell & Sons, Inc.","Troy Sales Yard","2016-05-19",807584,"#57 Stone for Electrochemical","Tucker, Rusty J",72098,7.4,0,5.3]
["LBM Industries","Whitewater Falls Quarry","2016-05-24",808244,"#57 Stone for Electrochemical","Wood, D. Michael M",23987,7.8,2.1,13.6]
["LBM Industries","Whitewater Falls Quarry","2016-05-24",808249,"#78-M Stone for Electrochemical","Wood, D. Michael M",16584,7.7,2.1,12.6]
["LBM Industries","Whitewater Falls Quarry - Sapphire","2016-05-24",808254,"Screenings - Chemistry Check","Wood, D. Michael M",14663,8.6,2.1,9.3000000000000007]
["Luck Stone Corporation","Pittsboro Quarry","2016-03-29",799662,"#78-M Stone for Electrochemical","Jackson, Brandon M",13873,7.9,0,11.3]
["Luck Stone Corporation","Pittsboro Quarry","2016-03-29",799656,"#67 Stone for Electrochemical","Jackson, Brandon M",20833,8.6,0,6.1]
["Luck Stone Corporation","Pittsboro Quarry","2016-03-29",799661,"Miscellaneous Material for Electrochemical","Jackson, Brandon M",3383,7.3,0,123]
["Luck Stone Corporation","Pittsboro Quarry","2016-03-29",799654,"#57 Stone for Electrochemical","Jackson, Brandon M",16218,7.6,0,7.7]
["Martin Marietta","American Stone Company","2016-03-02",795847,"#78-M Stone for Electrochemical","Fosque, Robert W",23496,7.7,0,4.8]
["Martin Marietta","American Stone Company","2016-03-02",795848,"#67 Stone for Electrochemical","Fosque, Robert W",25170,8.9,0,4.0999999999999996]
["Martin Marietta","American Stone Company","2016-03-02",795851,"#57 Stone for Electrochemical","Fosque, Robert W",22989,8.9,0,4]
["Martin Marietta","Arrowood Quarry - Charlotte","2015-06-26",763931,"Miscellaneous Material for Electrochemical","Adair, Mildred (Millie) L",2106,7.7,0,200]
["Martin Marietta","Arrowood Quarry - Charlotte","2015-07-23",767814,"Miscellaneous Material for Electrochemical","Adair, Mildred (Millie) L",8013,8.4,0,0]
["Martin Marietta","Arrowood Quarry - Charlotte","2016-02-24",796030,"#78-M Stone for Electrochemical","Adair, Mildred (Millie) L",19139,7.7,0,10.199999999999999]
["Martin Marietta","Arrowood Quarry - Charlotte","2016-02-24",796029,"#67 Stone for Electrochemical","Adair, Mildred (Millie) L",16639,7.6,0,11.2]
["Martin Marietta","Arrowood Quarry - Charlotte","2016-02-24",796031,"#57 Stone for Electrochemical","Adair, Mildred (Millie) L",22826,7.7,0,9.6999999999999993]
["Martin Marietta","Arrowood Quarry - Charlotte","2016-02-22",796285,"Miscellaneous Material for Electrochemical","Adair, Mildred (Millie) L",2182,7.5,0,198.3]
["Martin Marietta","Asheboro Quarry - Asheboro","2016-06-17",811640,"#57 Stone for Electrochemical","Tucker, Rusty J",19387,9,2.1,12]
["Martin Marietta","Asheboro Quarry - Asheboro","2016-06-17",811641,"#67 Stone for Electrochemical","Tucker, Rusty J",22594,9,2.1,6.6]
["Martin Marietta","Asheboro Quarry - Asheboro","2016-06-17",811642,"#78-M Stone for Electrochemical","Tucker, Rusty J",18650,8.6999999999999993,2.1,21.5]
["Martin Marietta","Bakers Quarry - Monroe","2015-06-24",763935,"Miscellaneous Material for Electrochemical","Adair, Mildred (Millie) L",11515,9,0,200]
["Martin Marietta","Belgrade Quarry - Maysville","2015-09-30",778061,"#78-M Stone for Electrochemical","Cahill, Luke R",3370,7.3,0,0]
["Martin Marietta","Benson Quarry - Benson","2016-03-16",798243,"#57 Stone for Electrochemical","Raines, James R",27917,7.7,0,0]
["Martin Marietta","Benson Quarry - Benson","2016-03-16",798244,"#78-M Stone for Electrochemical","Raines, James R",20585,8.3000000000000007,0,4.3]
["Martin Marietta","Benson Quarry - Benson","2016-03-16",798245,"Screenings - Chemistry Check","Raines, James R",10971,8,0,8.1]
["Martin Marietta","Bonds Quarry - Concord","2016-09-19",826543,"#78-M Stone for Electrochemical","Pegues, Jr., Henderson",18709,7.7,0,4.4000000000000004]
["Martin Marietta","Bonds Quarry - Concord","2016-09-19",826544,"#67 Stone for Electrochemical","Pegues, Jr., Henderson",20833,7.7,0,2.2999999999999998]
["Martin Marietta","Bonds Quarry - Concord","2016-09-19",826542,"#57 Stone for Electrochemical","Pegues, Jr., Henderson",18889,7.7,0,3.9]
["Martin Marietta","Burlington Quarry - Burlington","2016-02-29",795917,"#57 Stone for Electrochemical","Loshinskiy, Roman",18420,8.9,0,4]
["Martin Marietta","Burlington Quarry - Burlington","2016-02-29",795919,"#78-M Stone for Electrochemical","Loshinskiy, Roman",15755,8.6,0,8.5]
["Martin Marietta","Burlington Quarry - Burlington","2016-02-29",795925,"Screenings - Chemistry Check","Loshinskiy, Roman",8518,8.1999999999999993,0,29.3]
["Martin Marietta","Castle Hayne Quarry - Castle Hayne","2016-08-16",821247,"#57 Stone for Electrochemical","Cahill, Luke R",4174,8.1999999999999993,4.3,69.2]
["Martin Marietta","Castle Hayne Stone Yard","2016-08-16",821246,"#57 Stone for Electrochemical","Cahill, Luke R",20125,9.3000000000000007,0,3.8]
["Martin Marietta","Central Rock Quarry - Greensboro","2016-02-16",793947,"#57 Stone for Electrochemical","Westmoreland, Braxton J",27322,8.8000000000000007,5.4,6.3]
["Martin Marietta","Central Rock Quarry - Greensboro","2016-02-16",793945,"#78-M Stone for Electrochemical","Westmoreland, Braxton J",13635,8.4,0,10.1]
["Martin Marietta","Charlotte Quarry - Charlotte","2016-04-14",802303,"#57 Stone for Electrochemical","Adair, Mildred (Millie) L",21124,8.8000000000000007,0,6.2]
["Martin Marietta","Charlotte Quarry - Charlotte","2016-04-14",802306,"#78-M Stone for Electrochemical","Adair, Mildred (Millie) L",17123,8.4,0,10.7]
["Martin Marietta","Charlotte Quarry - Charlotte","2016-04-14",802309,"Miscellaneous Material for Electrochemical","Adair, Mildred (Millie) L",9970,7.7,0,8.6]
["Martin Marietta","Charlotte Quarry - Charlotte","2016-09-08",825039,"#67 Stone for Electrochemical","Adair, Mildred (Millie) L",21882,7.7,0,2.2999999999999998]
["Martin Marietta","Charlotte Quarry - Charlotte","2016-09-08",825038,"#57 Stone for Electrochemical","Adair, Mildred (Millie) L",17937,7.9,0,3.9]
["Martin Marietta","Charlotte Quarry - Charlotte","2016-09-08",825040,"#78-M Stone for Electrochemical","Adair, Mildred (Millie) L",15936,7.6,0,4.0999999999999996]
["Martin Marietta","Clarks Quarry - New Bern","2015-06-18",762704,"#67 Stone for Electrochemical","Maynard, William T.",2670,8,0,0]
["Martin Marietta","Clarks Quarry - New Bern","2015-07-06",765168,"#67 Stone for Electrochemical","Maynard, William T.",2415,7.5,0,200]
["Martin Marietta","Clarks Quarry - New Bern","2015-07-06",765444,"#67 Stone for Electrochemical","Maynard, William T.",2437,8.1,0,200]
["Martin Marietta","Clarks Quarry - New Bern","2015-07-06",765445,"#67 Stone for Electrochemical","Maynard, William T.",1750,7.3,0,200]
["Martin Marietta","Clarks Quarry - New Bern","2015-09-10",775400,"#67 Stone for Electrochemical","Maynard, William T.",2465,7.2,null,300]
["Martin Marietta","Clarks Quarry - New Bern","2016-08-03",819246,"#67 Stone for Electrochemical","Maynard, William T.",4431,8,0,60.6]
["Martin Marietta","Clarks Quarry - New Bern","2016-08-03",819245,"Miscellaneous Material for Electrochemical","Maynard, William T.",8163,8.4,0,31.8]
["Martin Marietta","Denver Quarry - Denver","2016-12-20",839459,"#67 Stone for Electrochemical","Brinson, Joseph",18560,7.7,0,1.5]
["Martin Marietta","Denver Quarry - Denver","2016-12-20",839457,"#57 Stone for Electrochemical","Brinson, Joseph",13631,7.8,0,5]
["Martin Marietta","Denver Quarry - Denver","2016-12-20",839461,"#78-M Stone for Electrochemical","Brinson, Joseph",10254,7.5,0,16.399999999999999]
["Martin Marietta","East Alamance Sales Yard","2016-02-08",793260,"#57 Stone for Electrochemical","Westmoreland, Braxton J",19350,7,5,11.1]
["Martin Marietta","East Alamance Sales Yard","2016-02-08",793261,"#78-M Stone for Electrochemical","Westmoreland, Braxton J",15330,8.3000000000000007,5,9.4]
["Martin Marietta","Fountain Quarry - Fountain","2015-09-28",777688,"#57 Stone for Electrochemical","Cobb, James R",15179,9,0,0]
["Martin Marietta","Fountain Quarry - Fountain","2016-02-19",794454,"Screenings - Chemistry Check","Cobb, James R",8496,8.3000000000000007,0,13.3]
["Martin Marietta","Fountain Quarry - Fountain","2016-02-19",794449,"#57 Stone for Electrochemical","Cobb, James R",25304,8.5,0,0]
["Martin Marietta","Fountain Quarry - Fountain","2016-02-19",794440,"#78-M Stone for Electrochemical","Cobb, James R",10144,8.1999999999999993,0,0]
["Martin Marietta","Franklin Co. Quarry","2016-02-12",793723,"#57 Stone for Electrochemical","Skinner, III, John L",26652,9.1999999999999993,0,4.4000000000000004]
["Martin Marietta","Franklin Co. Quarry","2016-02-12",793725,"#78-M Stone for Electrochemical","Skinner, III, John L",38926,7.7,0,4.5]
["Martin Marietta","Fuquay Quarry - Fuquay-Varina","2016-02-11",793623,"#78-M Stone for Electrochemical","Skinner, III, John L",33179,7.7,0,4.0999999999999996]
["Martin Marietta","Fuquay Quarry - Fuquay-Varina","2016-02-11",793622,"#57 Stone for Electrochemical","Skinner, III, John L",53591,7.4,0,4.0999999999999996]
["Martin Marietta","Garner Quarry - Garner","2016-02-09",793217,"#67 Stone for Electrochemical","Skinner, III, John L",33367,8.1,0,3]
["Martin Marietta","Garner Quarry - Garner","2016-02-09",793218,"#78-M Stone for Electrochemical","Skinner, III, John L",25176,8.4,0,3.5]
["Martin Marietta","Lemon Springs - Sanford","2016-02-19",794477,"#78-M Stone for Electrochemical","Jackson, Brandon M",22188,8.6999999999999993,0,0]
["Martin Marietta","Lemon Springs - Sanford","2016-02-19",794479,"Screenings - Chemistry Check","Jackson, Brandon M",10602,8.5,0,10.7]
["Martin Marietta","Lemon Springs - Sanford","2016-02-19",794474,"#67 Stone for Electrochemical","Jackson, Brandon M",25608,8.6,0,0]
["Martin Marietta","Lemon Springs - Sanford","2016-02-19",794469,"#57 Stone for Electrochemical","Jackson, Brandon M",27716,8.6999999999999993,0,4]
["Martin Marietta","Mallard Creek Quarry - Charlotte","2016-02-22",794798,"#57 Stone for Electrochemical","Pegues, Jr., Henderson",23987,9.1,0,4.5]
["Martin Marietta","Mallard Creek Quarry - Charlotte","2016-02-22",794806,"#67 Stone for Electrochemical","Pegues, Jr., Henderson",26399,9.1,0,4.0999999999999996]
["Martin Marietta","Mallard Creek Quarry - Charlotte","2016-02-22",794807,"#78-M Stone for Electrochemical","Pegues, Jr., Henderson",26274,8.9,5.4,4.0999999999999996]
["Martin Marietta","Mallard Creek Quarry - Charlotte","2016-11-01",832992,"#67 Stone for Electrochemical","Pegues, Jr., Henderson",19051,8.6999999999999993,0,0]
["Martin Marietta","Mallard Creek Quarry - Charlotte","2016-11-01",832994,"#57 Stone for Electrochemical","Pegues, Jr., Henderson",23095,9,0,0.6]
["Martin Marietta","Mallard Creek Quarry - Charlotte","2016-11-01",832990,"#78-M Stone for Electrochemical","Pegues, Jr., Henderson",23381,8.6999999999999993,0,0.8]
["Martin Marietta","Onslow Quarry - Richlands","2015-09-30",778060,"#57 Stone for Electrochemical","Cahill, Luke R",4480,6.8,0,0]
["Martin Marietta","Pomona Quarry - Greensboro","2016-02-04",792600,"#78-M Stone for Electrochemical","Westmoreland, Braxton J",23218,9.1,5,28.8]
["Martin Marietta","Pomona Quarry - Greensboro","2016-02-04",792599,"#57 Stone for Electrochemical","Westmoreland, Braxton J",14000,8.8000000000000007,0,48.5]
["Martin Marietta","Raleigh-Durham Quarry - Raleigh","2016-02-05",792800,"#57 Stone for Electrochemical","Skinner, III, John L",22894,8.9,5,28.2]
["Martin Marietta","Raleigh-Durham Quarry - Raleigh","2016-02-05",792804,"Screenings - Chemistry Check","Skinner, III, John L",10752,8.6,0,62.1]
["Martin Marietta","Raleigh-Durham Quarry - Raleigh","2016-02-05",792801,"#78-M Stone for Electrochemical","Skinner, III, John L",19080,8.6999999999999993,5,34.200000000000003]
["Martin Marietta","Reidsville Quarry - Reidsville","2016-02-09",793249,"#57 Stone for Electrochemical","Loshinskiy, Roman",21400,8.9,0,4.4000000000000004]
["Martin Marietta","Reidsville Quarry - Reidsville","2016-02-09",793250,"#78-M Stone for Electrochemical","Loshinskiy, Roman",21487,9.3000000000000007,0,4.4000000000000004]
["Martin Marietta","Reidsville Quarry - Reidsville","2016-02-09",793251,"Screenings - Chemistry Check","Loshinskiy, Roman",16518,9,5,18.899999999999999]
["Martin Marietta","Statesville Quarry - Statesville","2016-09-09",825451,"#57 Stone for Electrochemical","Whitley, Christopher D",13848,7.6,0,13]
["Martin Marietta","Statesville Quarry - Statesville","2016-09-09",825455,"#67 Stone for Electrochemical","Whitley, Christopher D",11279,7.7,0,23.9]
["Martin Marietta","Statesville Quarry - Statesville","2016-09-09",825458,"#78-M Stone for Electrochemical","Whitley, Christopher D",10212,7.4,0,26.4]
["Martin Marietta","Statesville Quarry - Statesville","2016-09-09",825461,"Miscellaneous Material for Electrochemical","Whitley, Christopher D",2408,7.3,0,192]
["Martin Marietta","Thomasville Quarry - Thomasville","2016-03-22",798932,"#57 Stone for Electrochemical","Wallace, Weston G",11218,7.9,0,20.2]
["Martin Marietta","Thomasville Quarry - Thomasville","2016-05-02",800404,"#78-M Stone for Electrochemical","Wallace, Weston G",18477,9.4,4.3,10.199999999999999]
["Martin Marietta","Woodleaf Quarry - Salisbury","2015-08-20",771927,"#78-M Stone for Electrochemical","McLain Jr, Raeford L",23186,8.9,0,0]
["Mathis Quarries, Inc.","Mathis Quarry","2016-05-24",808610,"#57 Stone for Electrochemical","Whitley, Christopher D",17176,9.1,4.3,17.3]
["Maymead Materials, Inc.","Potter's","2016-11-03",833841,"#57 Stone for Electrochemical","Church, Tracy G",15676,8.6,0,0.2]
["McCrary Stone","Low Gap Quarry - Burnsville","2016-10-27",832526,"Screenings - Chemistry Check","Kindley, Wallace Quint",2322,7.6,0,60.4]
["McCrary Stone","Low Gap Quarry - Burnsville","2016-10-27",832511,"#78-M Stone for Electrochemical","Kindley, Wallace Quint",5543,7.8,0,39.799999999999997]
["McCrary Stone","Low Gap Quarry - Burnsville","2016-10-27",832505,"#57 Stone for Electrochemical","Kindley, Wallace Quint",7651,8,0,8.1999999999999993]
["McCrary Stone","Marshall Quarry - Marshall","2016-10-17",830770,"#57 Stone for Electrochemical","Kindley, Wallace Quint",10481,8.9,0,13.7]
["McCrary Stone","Marshall Quarry - Marshall","2016-10-17",830775,"Screenings - Chemistry Check","Kindley, Wallace Quint",5718,8.1,0,36.6]
["McCrary Stone","Marshall Quarry - Marshall","2016-10-17",830773,"#78-M Stone for Electrochemical","Kindley, Wallace Quint",8170,7.9,0,12.7]
["NC Granite Corp.","Mount Airy Quarry - Mount. Airy","2016-03-08",797321,"#57 Stone for Electrochemical","Whitley, Christopher D",24913,7.8,0,6]
["NC Granite Corp.","Mount Airy Quarry - Mount. Airy","2016-03-08",797325,"#78-M Stone for Electrochemical","Whitley, Christopher D",23436,7.9,0,5.2]
["Pounding Mill Quarry","Bluefield Quarry","2016-04-05",800733,"#57 Stone for Electrochemical","Whitley, Christopher D",21432,8.4,0,4.5]
["Pounding Mill Quarry","Bluefield Quarry","2016-04-05",800739,"Miscellaneous Material for Electrochemical","Whitley, Christopher D",9766,8.6999999999999993,8.6,17.5]
["Radford Quarries Of Boone, Inc.","Bamboo Quarry","2016-02-08",793017,"#78-M Stone for Electrochemical","Church, Tracy G",20687,7.5,5,5.2]
["Radford Quarries Of Boone, Inc.","Bamboo Quarry","2016-02-08",793016,"#57 Stone for Electrochemical","Church, Tracy G",19073,7.4,0,6.7]
["Rogers Group, Inc.","Henrietta Quarry","2015-05-20",758512,"#57 Stone for Electrochemical","Towery, Robby D",26978,9.1999999999999993,0,0]
["Rogers Group, Inc.","Henrietta Quarry","2016-02-19",794432,"#57 Stone for Electrochemical","Rhymer, Robert C",24845,7.8,0,4.2]
["Rogers Group, Inc.","Henrietta Quarry","2016-02-19",794434,"#78-M Stone for Electrochemical","Rhymer, Robert C",23618,8.1999999999999993,0,4.0999999999999996]
["Rogers Group, Inc.","Henrietta Quarry","2016-02-19",794436,"Screenings - Chemistry Check","Rhymer, Robert C",7663,8,5.4,24.7]
["Rogers Group, Inc.","Henrietta Quarry","2016-08-15",821774,"#57 Stone for Electrochemical","Towery, Robby D",24832,7.8,0,3.7]
["Rogers Group, Inc.","Mitchell County Stone","2015-03-30",750748,"#57 Stone for Electrochemical","Rhymer, Robert C",52966,7.8,100,200]
["Rogers Group, Inc.","Mitchell County Stone","2015-07-22",767763,"Select Material, Class VI","Radcliff, Roger Keith",50865,7.2,0,0]
["Rogers Group, Inc.","Mitchell County Stone","2016-10-25",832457,"#78-M Stone for Electrochemical","Rhymer, Robert C",42373,8.1,0,0.1]
["Rogers Group, Inc.","Mitchell County Stone","2016-10-25",832455,"#57 Stone for Electrochemical","Rhymer, Robert C",82508,8.1,0,0.4]
["Salem Stone","Cardinal Quarry LLC - Smethport Quarry - West Jefferson","2016-08-02",819961,"#57 Stone for Electrochemical","Church, Tracy G",14002,9.1999999999999993,0,17.3]
["Salem Stone","Cardinal Quarry LLC - Smethport Quarry - West Jefferson","2016-08-02",819962,"#78-M Stone for Electrochemical","Church, Tracy G",7502,8.6999999999999993,0,40.200000000000003]
["Salem Stone","Cardinal Quarry LLC - Smethport Quarry - West Jefferson","2016-08-02",819964,"Miscellaneous Material for Electrochemical","Church, Tracy G",3880,8,0,73]
["Salem Stone","Cardinal Stone-Galax Quarry","2016-03-07",797284,"#57 Stone for Electrochemical","Whitley, Christopher D",14977,7.8,0,5.6]
["Salem Stone","Cardinal Stone-Galax Quarry","2016-03-07",797287,"#78-M Stone for Electrochemical","Whitley, Christopher D",12880,9.1999999999999993,0,5.5]
["Salem Stone","Cardinal Stone-Galax Quarry","2016-03-07",797296,"Miscellaneous Material for Electrochemical","Whitley, Christopher D",4916,9.5,0,28]
["Salem Stone","Southside Materials LLC - Shelton Quarry","2016-02-17",794123,"#57 Stone for Electrochemical","Loshinskiy, Roman",31201,8.6,0,4.8]
["Salem Stone","Southside Materials LLC - Shelton Quarry","2016-02-17",794125,"Screenings - Chemistry Check","Loshinskiy, Roman",23469,8.3000000000000007,0,0]
["Salem Stone","Southside Materials LLC - Shelton Quarry","2016-02-17",794124,"#78-M Stone for Electrochemical","Loshinskiy, Roman",48780,7.3,0,5]
["SC Rock","Goretown Mine","2016-02-03",792514,"Screenings - Chemistry Check","Walker, Steven E",6510,8.1999999999999993,0,37.9]
["Sloan Construction Co.","Blacksburg, SC","2016-11-22",836475,"#57 Stone for Electrochemical","Brinson, Joseph",79114,7.7,0,1.8]
["Sloan Construction Co.","Blacksburg, SC","2016-11-22",836476,"#67 Stone for Electrochemical","Brinson, Joseph",68027,7.4,0,0]
["Sloan Construction Co.","Blacksburg, SC","2016-11-22",836477,"Miscellaneous Material for Electrochemical","Brinson, Joseph",53937,6.9,0,0]
["Sloan Construction Co.","Blacksburg, SC","2016-11-22",836479,"Screenings - Chemistry Check","Brinson, Joseph",19342,5.4,0,8.6999999999999993]
["Standard Conc. Prod., Inc.","Standard Conc. Prod., Inc. - Savannah Plant","2015-05-06",756002,"#67 Stone for Electrochemical","Brule, Jeffrey S",18769,7.6,0,0]
["Standard Conc. Prod., Inc.","Standard Conc. Prod., Inc. - Savannah Plant","2015-07-13",766130,"#67 Stone for Electrochemical","Brule, Jeffrey S",20044,9,0,0]
["The Sunrock Group","Butner Quarry","2016-02-08",793014,"#78-M Stone for Electrochemical","Skinner, III, John L",13416,9.6,0,0]
["The Sunrock Group","Butner Quarry","2016-02-08",793015,"#57 Stone for Electrochemical","Skinner, III, John L",19697,9.1999999999999993,0,0]
["The Sunrock Group","Kittrell Quarry","2016-02-04",792553,"#57 Stone for Electrochemical","Skinner, III, John L",20044,8.6,5,33.1]
["The Sunrock Group","Kittrell Quarry","2016-02-04",792563,"Screenings - Chemistry Check","Skinner, III, John L",9872,7.9,5,67.7]
["The Sunrock Group","Kittrell Quarry","2016-02-04",792558,"#78-M Stone for Electrochemical","Skinner, III, John L",18392,8.6,5,36]
["Thompson Contractors","Miller Creek Q. - Rutherfordton","2016-08-18",821705,"#57 Stone for Electrochemical","Rhymer, Robert C",20678,9.1,0,2.8]
["Thompson Contractors","Miller Creek Q. - Rutherfordton","2016-10-14",830322,"#78-M Stone for Electrochemical","Rhymer, Robert C",22109,8.4,0,0.9]
["Vulcan Materials Co.","115 Quarry - N. Wilkesboro","2016-07-29",819485,"#57 Stone for Electrochemical","Whitley, Christopher D",14470,9.1999999999999993,0,15.9]
["Vulcan Materials Co.","115 Quarry - N. Wilkesboro","2016-07-29",819580,"#78-M Stone for Electrochemical","Whitley, Christopher D",10981,9.1999999999999993,0,24.7]
["Vulcan Materials Co.","115 Quarry - N. Wilkesboro","2016-07-29",819513,"#67 Stone for Electrochemical","Whitley, Christopher D",7746,8.6999999999999993,0,40.9]
["Vulcan Materials Co.","Boone Quarry - Boone","2016-11-03",833828,"#78-M Stone for Electrochemical","Church, Tracy G",35881,7.7,0,1.8]
["Vulcan Materials Co.","Boone Quarry - Boone","2016-11-03",833824,"#57 Stone for Electrochemical","Church, Tracy G",50251,8.3000000000000007,0,0]
["Vulcan Materials Co.","Clear Creek Q. - Charlotte","2016-02-22",794810,"#78-M Stone for Electrochemical","Pegues, Jr., Henderson",21487,9.1,0,6.2]
["Vulcan Materials Co.","Clear Creek Q. - Charlotte","2016-02-22",794809,"#67 Stone for Electrochemical","Pegues, Jr., Henderson",27533,8.8000000000000007,0,4.5999999999999996]
["Vulcan Materials Co.","Clear Creek Q. - Charlotte","2017-02-01",843616,"#78-M Stone for Electrochemical","Pegues, Jr., Henderson",21749,8,0,28.9]
["Vulcan Materials Co.","Clear Creek Q. - Charlotte","2017-02-01",843624,"#67 Stone for Electrochemical","Pegues, Jr., Henderson",25272,8,0,24.7]
["Vulcan Materials Co.","Clear Creek Q. - Charlotte","2017-02-01",843620,"#57 Stone for Electrochemical","Pegues, Jr., Henderson",26954,8.4,0,23.3]
["Vulcan Materials Co.","Enka Quarry","2016-10-10",829644,"#57 Stone for Electrochemical","Rhymer, Robert C",13104,6.7,0,24.7]
["Vulcan Materials Co.","Enka Quarry","2016-10-10",829646,"#78-M Stone for Electrochemical","Rhymer, Robert C",9479,5.2,0,8.6]
["Vulcan Materials Co.","Greystone Quarry - Henderson","2016-02-10",793395,"#78-M Stone for Electrochemical","Skinner, III, John L",23719,8.6999999999999993,0,0.8]
["Vulcan Materials Co.","Greystone Quarry - Henderson","2016-02-10",793394,"#57 Stone for Electrochemical","Skinner, III, John L",24225,8.9,0,0]
["Vulcan Materials Co.","Havre De Grace Q. - Maryland","2016-10-26",832514,"#67 Stone for Electrochemical","Bonds, Maria M",15838,8.3000000000000007,0,3.7]
["Vulcan Materials Co.","Havre De Grace Q. - Maryland","2016-10-26",832499,"#78-M Stone for Electrochemical","Bonds, Maria M",6605,7.9,17.7,7.6]
["Vulcan Materials Co.","Havre De Grace Q. - Maryland","2016-10-26",832493,"Screenings - Chemistry Check","Bonds, Maria M",2755,7.9,17.7,70.5]
["Vulcan Materials Co.","Jack Q. - Petersburg, VA","2016-10-26",832488,"#67 Stone for Electrochemical","Bonds, Maria M",15921,9.5,0,2.1]
["Vulcan Materials Co.","Jack Q. - Petersburg, VA","2016-10-26",832483,"#78-M Stone for Electrochemical","Bonds, Maria M",19763,9,0,1.2]
["Vulcan Materials Co.","Jack Q. - Petersburg, VA","2016-10-26",832475,"Screenings - Chemistry Check","Bonds, Maria M",7880,9,0,12.3]
["Vulcan Materials Co.","Lenior Quarry","2016-06-24",815305,"#57 Stone for Electrochemical","Church, Tracy G",18751,9.1999999999999993,2.1,15]
["Vulcan Materials Co.","Lenior Quarry","2016-06-24",815307,"#78-M Stone for Electrochemical","Church, Tracy G",17443,9.1999999999999993,2.1,15.3]
["Vulcan Materials Co.","Lenior Quarry","2016-06-24",815310,"Miscellaneous Material for Electrochemical","Church, Tracy G",11291,8.5,2.1,25]
["Vulcan Materials Co.","Morganton Quarry","2016-04-21",803453,"#67 Stone for Electrochemical","Ausley, Jeff",22386,7.6,0,6.6]
["Vulcan Materials Co.","Morganton Quarry","2016-04-21",803463,"Screenings - Chemistry Check","Ausley, Jeff",10686,8.5,0,0]
["Vulcan Materials Co.","Morganton Quarry","2016-04-21",803457,"#78-M Stone for Electrochemical","Ausley, Jeff",13410,8.6,0,16.7]
["Vulcan Materials Co.","Morganton Quarry","2016-12-06",838536,"Screenings - Chemistry Check","Ausley, Jeff",7402,7.7,0,26.3]
["Vulcan Materials Co.","North Q. - Winston Salem","2016-03-23",798936,"#57 Stone for Electrochemical","Wallace, Weston G",29586,7.8,0,113.8]
["Vulcan Materials Co.","North Q. - Winston Salem","2016-03-23",798939,"#78-M Stone for Electrochemical","Wallace, Weston G",20812,7.5,0,7.7]
["Vulcan Materials Co.","Penrose Q. - Pisgah Forest","2016-06-14",811081,"#57 Stone for Electrochemical","Wood, D. Michael M",24213,9.1999999999999993,2.1,0.8]
["Vulcan Materials Co.","Penrose Q. - Pisgah Forest","2016-06-14",811085,"#78-M Stone for Electrochemical","Wood, D. Michael M",23354,9,2.1,0.5]
["Vulcan Materials Co.","Penrose Q. - Pisgah Forest","2016-06-14",811091,"Screenings - Chemistry Check","Wood, D. Michael M",14872,8.8000000000000007,2.1,13.2]
["Vulcan Materials Co.","Pineville Quarry","2016-02-24",796026,"#78-M Stone for Electrochemical","Adair, Mildred (Millie) L",12945,7.5,5.4,15.5]
["Vulcan Materials Co.","Pineville Quarry","2016-02-24",796025,"#67 Stone for Electrochemical","Adair, Mildred (Millie) L",19395,7.7,0,8.3000000000000007]
["Vulcan Materials Co.","Pineville Quarry","2016-02-24",796027,"Miscellaneous Material for Electrochemical","Adair, Mildred (Millie) L",5187,7.7,0,76.5]
["Vulcan Materials Co.","Pineville Quarry","2016-10-06",829482,"#57 Stone for Electrochemical","Adair, Mildred (Millie) L",10259,7.4,4.4000000000000004,14.2]
["Vulcan Materials Co.","Pineville Quarry","2016-10-06",829481,"#67 Stone for Electrochemical","Adair, Mildred (Millie) L",9940,7.6,0,19.7]
["Vulcan Materials Co.","Pineville Quarry","2016-10-06",829483,"#78-M Stone for Electrochemical","Adair, Mildred (Millie) L",9099,7.6,4.4000000000000004,20]
["Vulcan Materials Co.","Pineville Quarry","2016-10-06",832586,"Screenings - Chemistry Check","Adair, Mildred (Millie) L",1872,7.6,0,93.3]
["Vulcan Materials Co.","Puddledock Q. - Prince George, VA","2016-10-26",832529,"#78-M Stone for Electrochemical","Bonds, Maria M",43668,7.3,0,3.4]
["Vulcan Materials Co.","Puddledock Q. - Prince George, VA","2016-10-26",832533,"#57 Stone for Electrochemical","Bonds, Maria M",36088,5,0,3.3]
["Vulcan Materials Co.","Rockingham Quarry","2016-06-09",810584,"#78-M Stone for Electrochemical","Tucker, Rusty J",12031,9.4,2.1,12.7]
["Vulcan Materials Co.","Rockingham Quarry","2016-06-09",810585,"#67 Stone for Electrochemical","Tucker, Rusty J",16748,9.3000000000000007,2.1,10.199999999999999]
["Vulcan Materials Co.","Rockingham Quarry","2016-06-09",810587,"#57 Stone for Electrochemical","Tucker, Rusty J",18142,9.3000000000000007,2.1,11.2]
["Vulcan Materials Co.","Skippers Q. - Skippers, VA","2016-02-10",793423,"#67 Stone for Electrochemical","Thomas, Grady Q",24384,8.9,0,0]
["Vulcan Materials Co.","Skippers Q. - Skippers, VA","2016-02-10",793425,"Screenings - Chemistry Check","Thomas, Grady Q",7440,8.9,10,37.700000000000003]
["Vulcan Materials Co.","Skippers Q. - Skippers, VA","2016-02-10",793424,"#78-M Stone for Electrochemical","Thomas, Grady Q",9311,9.6999999999999993,10,6.5]
["Vulcan Materials Co.","Skippers Q. - Skippers, VA","2017-02-07",844774,"Screenings - Chemistry Check","Thomas, Grady Q",5382,7.9,22.1,18]
["Vulcan Materials Co.","Skippers Q. - Skippers, VA","2017-02-07",844601,"#67 Stone for Electrochemical","Thomas, Grady Q",12830,8.8000000000000007,13.3,48.7]
["Vulcan Materials Co.","Skippers Q. - Skippers, VA","2017-02-07",844605,"#78-M Stone for Electrochemical","Thomas, Grady Q",11986,8.3000000000000007,8.9,51]
["Vulcan Materials Co.","Smith Grove Q. - Mocksville","2016-04-26",803857,"#57 Stone for Electrochemical","Wallace, Weston G",22007,8.1,0,7.1]
["Vulcan Materials Co.","Smith Grove Q. - Mocksville","2016-04-26",803858,"#78-M Stone for Electrochemical","Wallace, Weston G",20838,8.5,0,11.7]
["Vulcan Materials Co.","Spruce Pine Q. - Bakersville","2015-07-22",767762,"Select Material, Class VI","Radcliff, Roger Keith",25374,8.1999999999999993,0,0]
["Vulcan Materials Co.","Spruce Pine Q. - Bakersville","2016-10-14",830562,"#78-M Stone for Electrochemical","Ausley, Jeff",16706,8.8000000000000007,0,4.8]
["Vulcan Materials Co.","Spruce Pine Q. - Bakersville","2016-10-14",830560,"#57 Stone for Electrochemical","Ausley, Jeff",19387,6.7,0,4.8]
["Vulcan Materials Co.","Spruce Pine Q. - Bakersville","2016-12-06",838537,"Screenings - Chemistry Check","Ausley, Jeff",4955,7,0,48]
["Vulcan Materials Co.","Stokesdale Quarry","2016-03-03",796398,"#67 Stone for Electrochemical","Fosque, Robert W",24600,9,0,5.0999999999999996]
["Vulcan Materials Co.","Stokesdale Quarry","2016-03-03",796410,"Screenings - Chemistry Check","Fosque, Robert W",24661,8.5,0,4.8]
["Vulcan Materials Co.","Stokesdale Quarry","2016-03-03",796401,"#78-M Stone for Electrochemical","Fosque, Robert W",23635,8.4,0,6]
["Vulcan Materials Co.","Stokesdale Quarry","2016-03-03",796400,"#57 Stone for Electrochemical","Fosque, Robert W",28769,8.8000000000000007,0,4.5]
["Wake Stone Corp.","Knightdale","2016-02-09",793147,"#78-M Stone for Electrochemical","Skinner, III, John L",26738,8.6,0,3.4]
["Wake Stone Corp.","Knightdale","2016-02-09",793146,"#57 Stone for Electrochemical","Skinner, III, John L",23463,8.9,0,0.9]
["Wake Stone Corp.","Nash County","2016-03-11",797387,"#78-M Stone for Electrochemical","Raines, James R",18450,7.6,0,8.5]
["Wake Stone Corp.","Nash County","2016-03-11",797386,"#57 Stone for Electrochemical","Raines, James R",24746,8,0,4.5]
["Wake Stone Corp.","Triangle Q. - Cary","2016-02-12",793927,"#78-M Stone for Electrochemical","Skinner, III, John L",21538,9.1,0,4.4000000000000004]
["Wake Stone Corp.","Triangle Q. - Cary","2016-02-12",793925,"#57 Stone for Electrochemical","Skinner, III, John L",24631,7.7,5,4]
[null,null,"2015-09-21",776486,"#57 Stone for Electrochemical","Wagoner, Roy M",20725,7.9,0,300]
[null,null,"2016-02-19",794308,"#67 Stone for Electrochemical","Rhymer, Robert C",21584,8.8000000000000007,0,7]
[null,null,"2016-07-27",818283,"#67 Stone for Electrochemical","Maynard, William T.",17483,9.3000000000000007,2.1,19.3]
[null,null,"2016-12-13",838640,"Screenings - Chemistry Check","Rhymer, Robert C",1763,4.9000000000000004,0,93.9]
[null,null,"2016-12-12",838362,"Screenings - Chemistry Check","Rhymer, Robert C",11157,7.1,0,22.6]
[null,null,"2016-12-13",838641,"Screenings - Chemistry Check","Rhymer, Robert C",197161,6.8,0,1.6]
[]
[]
[]
[]
[]
[]
[]
[]
[]
[]
[]
[]
[]
[]
[]
[]
[]
[]
[]
[]
[]
[]
[]
[]
[]
[]
[]
[]
[]
[]
[]
[]
[]
[]
[]
[]
[]
[]
[]
[]
[]
[]
[]
[]
[]
[]
[]
[]
[]
[]
[]
[]
[]
[]
[]
[]
[]
[]
[]
[]
[]
[]
[]
[]
[]
[]
[]
[]
[]
[]
[]
[]
[]
[]
[]
[]
[]
[]
[]
[]
[]
[]
[]
[]
[]
[]
[]
[]
[]
[]
[]
[]
[]
[]
[]
[]
[]
[]
[]
[]
[]
[]
[]
[]
[]
[]
[]
[]
[]
[]
[]
[]
[]
[]
[]
[]
[]
[]
[]
[]
[]
[]
[]
[]
[]
[]
[]
[]
[]
[]
[]
[]
[]
[]
[]
[]
[]
[]
[]
[]
[]
[]
[]
[]
[]
[]
[]
[]
[]
[]
[]
[]
[]
[]
[]
[]
[]
[]
[]
[]
[]
[]
[]
[]
[]
[]
[]
[]
[]
[]
[]
[]
[]
[]
[]
[]
[]
[]
[]
[]
[]
[]
[]
[]
[]
[]
[]
[]
[]
[]
[]
[]
[]
[]
[]
[]
[]
[]
[]
[]
[]
[]
[]
[]
[]
[]
[]
[]
[]
[]
[]
[]
[]
[]
[]
[]
[]
[]
[]
[]
[]
[]
[]
[]
[]
[]
[]
[]
[]
[]
[]
[]
[]
[]
[]
[]
[]
[]
[]
[]
[]
[]
[]
[]
[]
[]
[]
[]
[]
[]
[]
[]
[]
[]
[]
[]
[]
[]
[]
[]
[]
[]
[]
[]
[]
[]
[]
[]
[]
[]
[]
[]
[]
[]
[]
[]
[]
[]
[]
[]
[]
[]
[]
[]
[]
[]
[]
[]
[]
[]
[]
[]
[]
[]
[]
[]
[]
[]
[]
[]
[]
[]
[]
[]
[]
[]
[]
[]
[]
[]
[]
[]
[]
[]
[]
[]
[]
[]
[]
[]
[]
[]
[]
[]
[]
[]
[]
[]
[]
[]
[]
[]
[]
[]
[]
[]
[]
[]
[]
[]
[]
[]
[]
[]
[]
[]
[]
[]
[]
[]
[]
[]
[]
[]
[]
[]
[]
[]
[]
[]
[]
[]
[]
[]
[]
[]
[]
[]
[]
[]
[]
[]
[]
[]
[]
[]
[]
[]
[]
[]
[]
[]
[]
[]
[]
[]
[]
[]
[]
[]
[]
[]
[]
[]
[]
[]
[]
[]
[]
[]
[]
[]
[]
[]
[]
[]
[]
[]
[]
[]
[]
[]
[]
[]
[]
[]
[]
[]
[]
[]
[]
[]
[]
[]
[]
[]
[]
[]
[]
[]
[]
[]
[]
[]
[]
[]
[]
[]
[]
[]
[]
[]
[]
[]
[]
[]
[]
[]
[]
[]
[]
[]
[]
[]
[]
[]
[]
[]
[]
[]
[]
[]
[]
[]
[]
[]
[]
[]
[]
[]
[]
[]
[]
[]
[]
[]
[]
[]
[]
[]
[]
[]
[]
[]
[]
[]
[]
[]
[]
[]
[]
[]
[]
[]
[]
[]
[]
[]
[]
[]
[]
[]
[]
[]
[]
[]
[]
[]
[]
[]
[]
[]
[]
[]
[]
[]
[]
[]
[]
[]
[]
[]
[]
[]
[]
[]
[]
[]
[]
[]
[]
[]
[]
[]
[]
[]
[]
[]
[]
[]
[]
[]
[]
[]
[]
[]
[]
[]
[]
[]
[]
[]
[]
[]
[]
[]
[]
[]
[]
[]
[]
[]
[]
[]
[]
[]
[]
[]
[]
[]
[]
[]
[]
[]
[]
[]
[]
[]
[]
[]
[]
[]
[]
[]
[]
[]
[]
[]
[]
[]
[]
[]
[]
[]
[]
[]
[]
[]
[]
[]
[]
[]
[]
[]
[]
[]
[]
[]
[]
[]
[]
[]
[]
[]
[]
[]
[]
[]
[]
[]
[]
[]
[]
[]
[]
[]
[]
[]
[]
[]
[]
[]
[]
[]
[]
[]
[]
[]
[]
[]
[]
[]
[]
[]
[]
[]
[]
[]
[]
[]
[]
[]
[]
[]
[]
[]
[]
[]
[]
[]
[]
[]
[]
[]
[]
[]
[]
[]
[]
[]
[]
[]
[]
[]
[]
[]
[]
[]
[]
[]
[]
[]
[]
[]
[]
[]
[]
[]
[]
[]
[]
[]
[]
[]
[]
[]
[]
[]
[]
[]
[]
[]
[]
[]
[]
[]
[]
[]
[]
[]
[]
[]
[]
[]
[]
[]
[]
[]
[]
[]
[]
[]
[]
[]
[]
[]
[]
[]
[]
[]
[]
[]
[]
[]
[]
[]
[]
[]
[]
[]
[]
[]
[]
[]
[]
[]
[]
[]
[]
[]
[]
[]
[]
[]
[]
[]
[]
[]
[]
[]
[]
[]
[]
[]
[]
[]
[]
[]
[]
[]
[]
[]
[]
[]
[]
[]
[]
[]
[]
[]
[]
[]
[]
[]
[]
[]
[]
[]
[]
[]
[]
[]
[]
[]
[]
[]
[]
[]
[]
[]
[]
[]
[]
[]
[]
[]
[]
[]
[]
[]
[]
[]
[]
[]
[]
[]
[]
[]
[]
[]
[]
[]
[]
[]
[]
[]
[]
[]
[]
[]
[]
[]
[]
[]
[]
[]
[]
[]
[]
[]
[]
[]
[]
[]
[]
[]
[]
[]
[]
[]
[]
[]
[]
[]
[]
[]
[]
[]
[]
[]
[]
[]
[]
[]
[]
[]
[]
[]
[]
[]
[]
[]
[]
[]
[]
[]
[]
[]
[]
[]
[]
[]
[]
[]
[]
[]
[]
[]
[]
[]
[]
[]
[]
[]
[]
[]
[]
[]
[]
[]
[]
[]
[]
[]
[]
[]
[]
[]
[]
[]
[]
[]
[]
[]
[]
[]
[]
[]
[]
[]
[]
[]
[]
[]
[]
[]
[]
[]
[]
[]
[]
[]
[]
[]
[]
[]
[]
[]
[]
[]
[]
[]
[]
[]
[]
[]
[]
[]
[]
[]
[]
[]
[]
[]
[]
[]
[]
[]
[]
[]
[]
[]
[]
[]
[]
[]
[]
[]
[]
[]
[]
[]
[]
[]
[]
[]
[]
[]
[]
[]
[]
[]
[]
[]
[]
[]
[]
[]
[]
[]
[]
[]
[]
[]
[]
[]
[]
[]
[]
[]
[]
[]
[]
[]
[]
[]
[]
[]
[]
[]
[]
[]
[]
[]
[]
[]
[]
[]
[]
[]
[]
[]
[]
[]
[]
[]
[]
[]
[]
[]
[]
[]
[]
[]
[]
[]
[]
[]
[]
[]
[]
[]
[]
[]
[]
[]
[]
[]
[]
[]
[]
[]
[]
[]
[]
[]
[]
[]
[]
[]
[]
[]
[]
[]
[]
[]
[]
[]
[]
[]
[]
[]
[]
[]
[]
[]
[]
[]
[]
[]
[]
[]
[]
[]
[]
[]
[]
[]
[]
[]
[]
[]
[]
[]
[]
[]
[]
[]
[]
[]
[]
[]
[]
[]
[]
[]
[]
[]
[]
[]
[]
[]
[]
[]
[]
[]
[]
[]
[]
[]
[]
[]
[]
[]
[]
[]
[]
[]
[]
[]
[]
[]
[]
[]
[]
[]
[]
[]
[]
[]
[]
[]
[]
[]
[]
[]
[]
[]
[]
[]
[]
[]
[]
[]
[]
[]
[]
[]
[]
[]
[]
[]
[]
[]
[]
[]
[]
[]
[]
[]
[]
[]
[]
[]
[]
[]
[]
[]
[]
[]
[]
[]
[]
[]
[]
[]
[]
[]
[]
[]
[]
[]
[]
[]
[]
[]
[]
[]
[]
[]
[]
[]
[]
[]
[]
[]
[]
[]
[]
[]
[]
[]
[]
[]
[]
[]
[]
[]
[]
[]
[]
[]
[]
[]
[]
[]
[]
[]
[]
[]
[]
[]
[]
[]
[]
[]
[]
[]
[]
[]
[]
[]
[]
[]
[]
[]
[]
[]
[]
[]
[]
[]
[]
[]
[]
[]
[]
[]
[]
[]
[]
[]
[]
[]
[]
[]
[]
[]
[]
[]
[]
[]
[]
[]
[]
[]
[]
[]
[]
[]
[]
[]
[]
[]
[]
[]
[]
[]
[]
[]
[]
[]
[]
[]
[]
[]
[]
[]
[]
[]
[]
[]
[]
[]
[]
[]
[]
[]
[]
[]
[]
[]
[]
[]
[]
[]
[]
[]
[]
[]
[]
[]
[]
[]
[]
[]
[]
[]
[]
[]
[]
[]
[]
[]
[]
[]
[]
[]
[]
[]
[]
[]
[]
[]
[]
[]
[]
[]
[]
[]
[]
[]
[]
[]
[]
[]
[]
[]
[]
[]
[]
[]
[]
[]
[]
[]
[]
[]
[]
[]
[]
[]
[]
[]
[]
[]
[]
[]
[]
[]
[]
[]
[]
[]
[]
[]
[]
[]
[]
[]
[]
[]
[]
[]
[]
[]
[]
[]
[]
[]
[]
[]
[]
[]
[]
[]
[]
[]
[]
[]
[]
[]
[]
[]
[]
[]
[]
[]
[]
[]
[]
[]
[]
[]
[]
[]
[]
[]
[]
[]
[]
[]
[]
[]
[]
[]
[]
[]
[]
[]
[]
[]
[]
[]
[]
[]
[]
[]
[]
[]
[]
[]
[]
[]
[]
[]
[]
[]
[]
[]
[]
[]
[]
[]
[]
[]
[]
[]
[]
[]
[]
[]
[]
[]
[]
[]
[]
[]
[]
[]
[]
[]
[]
[]
[]
[]
[]
[]
[]
[]
[]
[]
[]
[]
[]
[]
[]
[]
[]
[]
[]
[]
[]
[]
[]
[]
[]
[]
[]
[]
[]
[]
[]
[]
[]
[]
[]
[]
[]
[]
[]
[]
[]
[]
[]
[]
[]
[]
[]
[]
[]
[]
[]
[]
[]
[]
[]
[]
[]
[]
[]
[]
[]
[]
[]
[]
[]
[]
[]
[]
[]
[]
[]
[]
[]
[]
[]
[]
[]
[]
[]
[]
[]
[]
[]
[]
[]
[]
[]
[]
[]
[]
[]
[]
[]
[]
[]
[]
[]
[]
[]
[]
[]
[]
[]
[]
[]
[]
[]
[]
[]
[]
[]
[]
[]
[]
[]
[]
[]
[]
[]
[]
[]
[]
[]
[]
[]
[]
[]
[]
[]
[]
[]
[]
[]
[]
[]
[]
[]
[]
[]
[]
[]
[]
[]
[]
[]
[]
[]
[]
[]
[]
[]
[]
[]
[]
[]
[]
[]
[]
[]
[]
[]
[]
[]
[]
[]
[]
[]
[]
[]
[]
[]
[]
[]
[]
[]
[]
[]
[]
[]
[]
[]
[]
[]
[]
[]
[]
[]
[]
[]
[]
[]
[]
[]
[]
[]
[]
[]
[]
[]
[]
[]
[]
[]
[]
[]
[]
[]
[]
[]
[]
[]
[]
[]
[]
[]
[]
[]
[]
[]
[]
[]
[]
[]
[]
[]
[]
[]
[]
[]
[]
[]
[]
[]
[]
[]
[]
[]
[]
[]
[]
[]
[]
[]
[]
[]
[]
[]
[]
[]
[]
[]
[]
[]
[]
[]
[]
[]
[]
[]
[]
[]
[]
[]
[]
[]
[]
[]
[]
[]
[]
[]
[]
[]
[]
[]
[]
[]
[]
[]
[]
[]
[]
[]
[]
[]
[]
[]
[]
[]
[]
[]
[]
[]
[]
[]
[]
[]
[]
[]
[]
[]
[]
[]
[]
[]
[]
[]
[]
[]
[]
[]
[]
[]
[]
[]
[]
[]
[]
[]
[]
[]
[]
[]
[]
[]
[]
[]
[]
[]
[]
[]
[]
[]
[]
[]
[]
[]
[]
[]
[]
[]
[]
[]
[]
[]
[]
[]
[]
[]
[]
[]
[]
[]
[]
[]
[]
[]
[]
[]
[]
[]
[]
[]
[]
[]
[]
[]
[]
[]
[]
[]
[]
[]
[]
[]
[]
[]
[]
[]
[]
[]
[]
[]
[]
[]
[]
[]
[]
[]
[]
[]
[]
[]
[]
[]
[]
[]
[]
[]
[]
[]
[]
[]
[]
[]
[]
[]
[]
[]
[]
[]
[]
[]
[]
[]
[]
[]
[]
[]
[]
[]
[]
[]
[]
[]
[]
[]
[]
[]
[]
[]
[]
[]
[]
[]
[]
[]
[]
[]
[]
[]
[]
[]
[]
[]
[]
[]
[]
[]
[]
[]
[]
[]
[]
[]
[]
[]
[]
[]
[]
[]
[]
[]
[]
[]
[]
[]
[]
[]
[]
[]
[]
[]
[]
[]
[]
[]
[]
[]
[]
[]
[]
[]
[]
[]
[]
[]
[]
[]
[]
[]
[]
[]
[]
[]
[]
[]
[]
[]
[]
[]
[]
[]
[]
[]
[]
[]
[]
[]
[]
[]
[]
[]
[]
[]
[]
[]
[]
[]
[]
[]
[]
[]
[]
[]
[]
[]
[]
[]
[]
[]
[]
[]
[]
[]
[]
[]
[]
[]
[]
[]
[]
[]
[]
[]
[]
[]
[]
[]
[]
[]
[]
[]
[]
[]
[]
[]
[]
[]
[]
[]
[]
[]
[]
[]
[]
[]
[]
[]
[]
[]
[]
[]
[]
[]
[]
[]
[]
[]
[]
[]
[]
[]
[]
[]
[]
[]
[]
[]
[]
[]
[]
[]
[]
[]
[]
[]
[]
[]
[]
[]
[]
[]
[]
[]
[]
[]
[]
[]
[]
[]
[]
[]
[]
[]
[]
[]
[]
[]
[]
[]
[]
[]
[]
[]
[]
[]
[]
[]
[]
[]
[]
[]
[]
[]
[]
[]
[]
[]
[]
[]
[]
[]
[]
[]
[]
[]
[]
[]
[]
[]
[]
[]
[]
[]
[]
[]
[]
[]
[]
[]
[]
[]
[]
[]
[]
[]
[]
[]
[]
[]
[]
[]
[]
[]
[]
[]
[]
[]
[]
[]
[]
[]
[]
[]
[]
[]
[]
[]
[]
[]
[]
[]
[]
[]
[]
[]
[]
[]
[]
[]
[]
[]
[]
[]
[]
[]
[]
[]
[]
[]
[]
[]
[]
[]
[]
[]
[]
[]
[]
[]
[]
[]
[]
[]
[]
[]
[]
[]
[]
[]
[]
[]
[]
[]
[]
[]
[]
[]
[]
[]
[]
[]
[]
[]
[]
[]
[]
[]
[]
[]
[]
[]
[]
[]
[]
[]
[]
[]
[]
[]
[]
[]
[]
[]
[]
[]
[]
[]
[]
[]
[]
[]
[]
[]
[]
[]
[]
[]
[]
[]
[]
[]
[]
[]
[]
[]
[]
[]
[]
[]
[]
[]
[]
[]
[]
[]
[]
[]
[]
[]
[]
[]
[]
[]
[]
[]
[]
[]
[]
[]
[]
[]
[]
[]
[]
[]
[]
[]
[]
[]
[]
[]
[]
[]
[]
[]
[]
[]
[]
[]
[]
[]
[]
[]
[]
[]
[]
[]
[]
[]
[]
[]
[]
[]
[]
[]
[]
[]
[]
[]
[]
[]
[]
[]
[]
[]
[]
[]
[]
[]
[]
[]
[]
[]
[]
[]
[]
[]
[]
[]
[]
[]
[]
[]
[]
[]
[]
[]
[]
[]
[]
[]
[]
[]
[]
[]
[]
[]
[]
[]
[]
[]
[]
[]
[]
[]
[]
[]
[]
[]
[]
[]
[]
[]
[]
[]
[]
[]
[]
[]
[]
[]
[]
[]
[]
[]
[]
[]
[]
[]
[]
[]
[]
[]
[]
[]
[]
[]
[]
[]
[]
[]
[]
[]
[]
[]
[]
[]
[]
[]
[]
[]
[]
[]
[]
[]
[]
[]
[]
[]
[]
[]
[]
[]
[]
[]
[]
[]
[]
[]
[]
[]
[]
[]
[]
[]
[]
[]
[]
[]
[]
[]
[]
[]
[]
[]
[]
[]
[]
[]
[]
[]
[]
[]
[]
[]
[]
[]
[]
[]
[]
[]
[]
[]
[]
[]
[]
[]
[]
[]
[]
[]
[]
[]
[]
[]
[]
[]
[]
[]
[]
[]
[]
[]
[]
[]
[]
[]
[]
[]
[]
[]
[]
[]
[]
[]
[]
[]
[]
[]
[]
[]
[]
[]
[]
[]
[]
[]
[]
[]
[]
[]
[]
[]
[]
[]
[]
[]
[]
[]
[]
[]
[]
[]
[]
[]
[]
[]
[]
[]
[]
[]
[]
[]
[]
[]
[]
[]
[]
[]
[]
[]
[]
[]
[]
[]
[]
[]
[]
[]
[]
[]
[]
[]
[]
[]
[]
[]
[]
[]
[]
[]
[]
[]
[]
[]
[]
[]
[]
[]
[]
[]
[]
[]
[]
[]
[]
[]
[]
[]
[]
[]
[]
[]
[]
[]
[]
[]
[]
[]
[]
[]
[]
[]
[]
[]
[]
[]
[]
[]
[]
[]
[]
[]
[]
[]
[]
[]
[]
[]
[]
[]
[]
[]
[]
[]
[]
[]
[]
[]
[]
[]
[]
[]
[]
[]
[]
[]
[]
[]
[]
[]
[]
[]
[]
[]
[]
[]
[]
[]
[]
[]
[]
[]
[]
[]
[]
[]
[]
[]
[]
[]
[]
[]
[]
[]
[]
[]
[]
[]
[]
[]
[]
[]
[]
[]
[]
[]
[]
[]
[]
[]
[]
[]
[]
[]
[]
[]
[]
[]
[]
[]
[]
[]
[]
[]
[]
[]
[]
[]
[]
[]
[]
[]
[]
[]
[]
[]
[]
[]
[]
[]
[]
[]
[]
[]
[]
[null,null,"3801-05-26"]

{"sheet":"CHEMSAND","index":6,"n_rows":68,"n_cols":10,"rows_kept":68,"cut":false,"hidden":true,"merged":[]}
["Producer Name","Location","Sample Date","Sample ID","Material Description","Sampled By","Resistivity [ohm-cm]:","pH","Chloride [ppm]:","Sulfate [ppm]:"]
["American Materials Co., LLC","Bailey Mine","2015-05-04",756586,"Sand, 2S - Chemistry Check","Russell, Jonathan T",79491,6.8,0,0]
["American Materials Co., LLC","Bailey Mine","2015-05-05",756587,"Sand, 2S - Chemistry Check","Russell, Jonathan T",81967,5.0999999999999996,0,0]
["American Materials Co., LLC","Bailey Mine","2015-06-17",763246,"Sand, 2S - Chemistry Check","Russell, Jonathan T",49432,6,0,0]
["American Materials Co., LLC","Bailey Mine","2015-07-16",766765,"Sand, 2S - Chemistry Check","Russell, Jonathan T",52521,5.8,0,200]
["American Materials Co., LLC","Bailey Mine","2015-08-24",773443,"Sand, 2S - Chemistry Check","Russell, Jonathan T",69013,6.2,0,0]
["American Materials Co., LLC","Bailey Mine","2015-08-26",773446,"Sand, 2S - Chemistry Check","Russell, Jonathan T",60132,5.7,0,0]
["American Materials Co., LLC","Bailey Mine","2015-08-27",773447,"Sand, 2S - Chemistry Check","Russell, Jonathan T",60350,5.4,0,0]
["American Materials Co., LLC","Dupree Mine","2016-03-29",799594,"Sand, 2S - Chemistry Check","Cobb, James R",21245,4.8,0,16.3]
["American Materials Co., LLC","Wade Pit","2016-05-10",805958,"Sand, 2S - Chemistry Check","Murphy, Billy J",91075,5.8,0,7.3]
["APAC-Atlantic - Thompson-Arthur","Candor Pit","2016-02-19",794457,"Sand, 2S - Chemistry Check","Jackson, Brandon M",126183,6.7,0,5]
["B.E. Singleton & Sons, Inc.","Talley-Whichard Pitt","2016-06-13",810903,"Sand, 2S - Chemistry Check","Cobb, James R",109613,6.8,2.1,15.1]
["Bent River Materials","Bent River Pit","2016-06-08",810508,"Sand, 2S - Chemistry Check","Thomas, Grady Q",45393,6.4,2.1,14.8]
["Best Sand & Gravel, Inc.","Brooks Pit","2016-04-07",801024,"Sand, 2S - Chemistry Check","Raines, James R",16537,7.3,0,0]
["Boxley Concrete Products of Va","Fieldale Quarry - Martinsville","2016-02-17",794066,"Sand, 2MS - Chemistry Check","Westmoreland, Braxton J",6061,7.7,0,57.1]
["Buckhorn Materials","Black Creek Sand Mine","2016-03-22",798885,"Sand, 2MS","Jordan, Daniel H",127113,7.4,0,11.2]
["Buckhorn Materials","Lynches River Quarry","2016-02-11",793639,"Sand, 2MS - Chemistry Check","Jordan, Daniel H",23154,7.3,0,9.1999999999999993]
["Carolina Sand","Burke County Pit","2016-12-14",839021,"Sand, 2S - Chemistry Check","Ausley, Jeff",35486,6.7,0,4.5999999999999996]
["Commercial Ready Mix Products","Newsome Pit #2","2016-06-10",810907,"Sand, 2S - Chemistry Check","Thomas, Grady Q",47103,5.0999999999999996,2.1,16.100000000000001]
["Dawson Contracting Inc","Ashley Heights Sand","2016-02-03",792505,"Sand, 2S - Chemistry Check","Jordan, Daniel H",90498,6.5,0,6.9]
["G.S. Materials","Blue Water Sand & Gravel - Mill Creek Pit","2016-04-15",803132,"Sand, 2S - Chemistry Check","Raines, James R",46729,4.9000000000000004,0,8]
["G.S. Materials","Emery Pit","2016-04-15",802369,"Sand, 2S - Chemistry Check","Jackson, Brandon M",73529,6.8,0,4.2]
["G.S. Materials","Hall Pit - Lemon Springs","2016-03-08",796684,"Sand, 2S - Chemistry Check","Murphy, Billy J",117385,5.4,0,6.1]
["Hanson Aggregates Southeast Inc.","Brewer Pit (Pageland #1)","2016-02-10",793426,"Sand, 2MS - Chemistry Check","Jordan, Daniel H",63052,7.3,0,9.5]
["Hanson Aggregates Southeast Inc.","Marlboro Plant - Bennettsville","2016-02-19",794731,"Sand, 2S - Chemistry Check","Jordan, Daniel H",109565,4.8,0,4.2]
["Hanson Aggregates Southeast Inc.","Neverson Q. - Bailey","2016-03-15",798235,"Sand, 2MS - Chemistry Check","Raines, James R",25867,7.9,0,4.5]
["Hanson Aggregates Southeast Inc.","Rocky Mount #2 Q.","2016-04-14",802199,"Sand, 2MS - Chemistry Check","Raines, James R",19135,8.4,0,38.799999999999997]
["Hanson Aggregates Southeast Inc.","Rougemont Quarry","2016-02-16",793937,"Sand, 2MS - Chemistry Check","Skinner, III, John L",19128,8.3000000000000007,0,9.8000000000000007]
["Hanson Aggregates Southeast Inc.","Sandy Flats Quarry","2016-12-14",839146,"Sand, 2MS - Chemistry Check","Wood, D. Michael M",14616,7.8,0,5.6]
["Hedrick industries","Lake Norman Quarry","2016-12-13",838936,"Sand, 2MS - Chemistry Check","Kindley, Wallace Quint",10284,8.5,0,3.8]
["Hedrick industries","Leasees of B.V. Hedrick Gravel & Sand Co.","2016-03-24",799231,"Sand, 2S - Chemistry Check","Jackson, Brandon M",185254,7.2,0,6.2]
["Hedrick industries","Piedmont/Pageland SC Pit #3","2016-03-18",798283,"Sand, 2MS","Jordan, Daniel H",25530,6.8,0,12.8]
["LBM Industries","Whitewater Falls Quarry - Sapphire","2016-05-24",808253,"Sand, 2MS - Chemistry Check","Wood, D. Michael M",12303,7.9,2.1,24.8]
["MAR MAC Sand and Gravel, LLC","MAR MAC Sand and Gravel","2016-04-15",803130,"Sand, 2S - Chemistry Check","Raines, James R",1812,3.1,8.6,146]
["Martin Marietta","Arrowood Quarry - Charlotte","2016-12-06",837865,"Sand, 2MS - Chemistry Check","Adair, Mildred (Millie) L",3339,7.3,8.9,8.5]
["Martin Marietta","Bonds Quarry - Concord","2016-09-19",826548,"Sand, 2MS - Chemistry Check","Pegues, Jr., Henderson",3953,7.3,0,103.2]
["Martin Marietta","Charlotte Quarry - Charlotte","2016-09-08",825585,"Sand, 2MS - Chemistry Check","Adair, Mildred (Millie) L",6112,7.5,0,50.7]
["Martin Marietta","Clarks Quarry - New Bern","2016-08-03",819242,"Sand, 2MS - Chemistry Check","Maynard, William T.",932,7.4,0,612]
["Martin Marietta","Denver Quarry - Denver","2016-12-20",839463,"Sand, 2MS - Chemistry Check","Brinson, Joseph",2731,7.7,0,74]
["Martin Marietta","Denver Quarry - Denver","2017-02-06",844563,"Sand, 2MS - Chemistry Check","Brinson, Joseph",6693,7.3,0,92]
["Martin Marietta","Franklin Co. Quarry","2016-02-12",793726,"Sand, 2MS - Chemistry Check","Skinner, III, John L",14188,7.8,0,10.8]
["Martin Marietta","Garner Quarry - Garner","2016-02-09",793219,"Sand, 2MS - Chemistry Check","Skinner, III, John L",18765,8.1999999999999993,5,2.4]
["Martin Marietta","Loamy Sand and Gravel","2016-02-05",793009,"Sand, 2S - Chemistry Check","Jordan, Daniel H",94967,5.0999999999999996,5,2.1]
["Martin Marietta","Mallard Creek Quarry - Charlotte","2016-02-22",794786,"Sand, 2MS - Chemistry Check","Pegues, Jr., Henderson",18875,8.8000000000000007,0,4.2]
["Martin Marietta","Mallard Creek Quarry - Charlotte","2016-11-01",832986,"Sand, 2MS - Chemistry Check","Pegues, Jr., Henderson",12887,9.1,0,3.5]
["Martin Marietta","Matthews Quarry - Matthews","2015-11-12",783957,"Sand, 2MS - Chemistry Check","Adair, Mildred (Millie) L",3383,7.6,5,300]
["Martin Marietta","Pomona Quarry - Greensboro","2016-02-04",792603,"Sand, 2MS - Chemistry Check","Westmoreland, Braxton J",24498,9.1,0,27.3]
["Matthews Sand and Gravel","Matthews 3 Pit","2016-04-05",801023,"Sand, 2S - Chemistry Check","Raines, James R",71531,7.3,0,0]
["Mid-East Services, Inc.","Howell Woods Pit","2016-04-05",801022,"Sand, 2S - Chemistry Check","Raines, James R",87108,7.4,0,5.2]
["Neuse Sand And Gravel","Tilghman Pit","2016-02-11",793688,"Sand, 2S - Chemistry Check","Cobb, James R",19829,4.4000000000000004,0,14.3]
["Oldcastle Stone Products - Bonsal Mining","Lilesville Pit","2016-03-23",799217,"Sand, 2S","Jackson, Brandon M",139121,6.8,0,6.1]
["Pea Creek Mines","Pea Creek Mines","2016-02-09",793199,"Sand, 2S - Chemistry Check","Cobb, James R",11682,3.9,0,18.5]
["PGS Aggregates, LLC","Great Pit","2016-04-18",803141,"Sand, 2S - Chemistry Check","Raines, James R",49727,5.0999999999999996,0,7.1]
["Stony Creek Sand and Gravel, LLC","Stony Creek Sand and Gravel","2016-04-22",803774,"Sand, 2S - Chemistry Check","Raines, James R",8210,4.0999999999999996,4.3,31.3]
["The Sunrock Group","Butner Quarry","2016-02-08",793012,"Sand, 2MS - Chemistry Check","Skinner, III, John L",7930,10,0,9]
["Thomas Cement Inc.","Simpson Mine","2016-02-05",793008,"Sand, 2S - Chemistry Check","Jordan, Daniel H",68540,5.0999999999999996,5,1.7]
["Vulcan Materials Co.","Greystone Quarry - Henderson","2016-02-10",793398,"Sand, 2MS - Chemistry Check","Skinner, III, John L",14501,8.5,0,10.9]
["Vulcan Materials Co.","North Q. - Winston Salem","2016-03-23",798945,"Sand, 2MS - Chemistry Check","Wallace, Weston G",24278,8,0,7.1]
["Vulcan Materials Co.","Puddledock Q. - Prince George, VA","2016-10-26",832522,"Sand, 2S - Chemistry Check","Bonds, Maria M",48146,4.7,0,0]
["Vulcan Materials Co.","Rockingham Quarry","2016-06-09",810588,"Sand, 2MS - Chemistry Check","Tucker, Rusty J",9407,8.9,2.1,16.7]
["Vulcan Materials Co.","Smith Grove Q. - Mocksville","2016-04-26",803859,"Sand, 2MS - Chemistry Check","Wallace, Weston G",6254,6.2,0,49]
["Vulcan Materials Co.","Spruce Pine Q. - Bakersville","2015-08-11",770808,"Sand, 2MS - Chemistry Check","Rhymer, Robert C",931966,7.2,0,300]
["Wade Moore Equip. Co.","Fleming Sand Pit","2016-02-04",792780,"Sand, 2S - Chemistry Check","Skinner, III, John L",92678,6.8,0,7.1]
["Wake Stone Corp.","Knightdale","2016-02-09",793144,"Sand, 2MS - Chemistry Check","Skinner, III, John L",13198,8.9,5,8.9]
["Wake Stone Corp.","Nash County","2016-03-11",797388,"Sand, 2MS - Chemistry Check","Raines, James R",8361,8.5,0,12.1]
["Weeks Sand Company","Weeks Sand #3","2016-03-08",796682,"Sand, 2S - Chemistry Check","Murphy, Billy J",62344,5.2,0,5.0999999999999996]
["Westside Minerals LLC","Dempsey Wood Pit","2016-07-27",818140,"Sand, 2S - Chemistry Check","Cobb, James R",4955,3.9,12.9,65.8]
[null,null,"2016-02-19",794310,"Sand, 2MS - Chemistry Check","Rhymer, Robert C",22207,8.1,0,8.8000000000000007]