{"text_format":"1","workbook":"xlsx","n_sheets":12,"sheets":["MAIN","Case Table","Summary Table","RATIONAL TAB TEMPLATE","TR-55 TAB TEMPLATE","USGS-5030 TAB TEMPLATE","USGS-5158 TAB TEMPLATE","USER INPUT TAB TEMPLATE","Hidden Summary","pct imp equation","PICK LISTS","Combined"],"not_rendered":{"charts":1,"images":40,"macros":1,"external_links":0,"defined_names":905,"comments":0,"pivot_tables":0},"unopened":[],"bounds":{"document_bytes":16777216,"sheet_cells":100000,"rows_first":2000,"rows_last":500,"rows_between":2000,"halvings":0,"cell_chars":16384,"cell_head_chars":4096},"cells_cut":0,"cells_raw":0,"read":"whole","date_system":"1900"}

{"sheet":"MAIN","index":0,"n_rows":37,"n_cols":20,"rows_kept":37,"cut":false,"hidden":false,"merged":[[11,0,12,1],[11,2,12,4],[11,8,12,9],[11,10,12,12],[14,8,15,9],[14,10,15,12],[14,0,15,1],[14,2,15,4],[43,19,44,24],[29,10,30,10],[29,7,30,9],[29,11,30,13],[17,0,18,1],[17,2,18,4],[23,7,24,9],[26,0,28,1],[26,2,28,4],[17,10,18,12],[20,8,21,9],[20,10,21,12],[19,16,21,18],[23,2,24,4],[26,10,27,12],[36,19,37,24],[36,0,37,5],[34,19,35,24],[23,0,24,1],[17,8,18,9],[20,0,21,1],[20,2,21,4],[26,8,27,9],[23,10,24,12],[23,16,25,18],[23,19,25,22],[31,0,33,1],[31,2,32,4]]}
[]
[]
[]
[]
[]
[]
[]
[]
[]
[]
[]
["TIP #",null,null,null,null,null,null,null,"PLAN SHEET #"]
[]
[]
["COUNTY",null,null,null,null,null,null,null,"OUTLET ANALYSIS #",null,""]
[]
[]
["DATE",null,null,null,null,null,null,null,"LATITUDE"]
[]
[]
["DESIGN FIRM",null,null,null,null,null,null,null,"LONGITUDE"]
[]
[]
["DESIGNER",null,null,null,null,null,null,"HYDROLOGY METHOD"]
[]
[]
["PROJECT DESCRIPTION",null,null,null,null,null,null,null,"ANALYSIS POINT",null,""]
[]
[]
[null,null,null,null,null,null,null,{"$f":"IF(K27=\"DOWNSTREAM PAST R/W\",\"*ANALYSIS POINT IS  \",\"\")","v":""},null,null,null,{"$f":"IF(K27=\"DOWNSTREAM PAST R/W\", \"FT. DOWNSTREAM PAST R/W\",\"\")","v":""}]
[]
["CUSTOM IDF DATA?"]
[]
[]
[]
[]
["Version 1.0",null,null,null,null,null,null,null,null,null,null,null,null,null,null,null,null,null,null,"Developed by NCDOT and Kimley-Horn Associates"]

{"sheet":"Case Table","index":1,"n_rows":1,"n_cols":2,"rows_kept":1,"cut":false,"hidden":true,"merged":[[0,1,1,20]]}
[null,"CASE TABLE"]

{"sheet":"Summary Table","index":2,"n_rows":200,"n_cols":36,"rows_kept":200,"cut":false,"hidden":true,"merged":[[185,21,185,22],[186,21,186,22],[187,21,187,22],[188,21,188,22],[189,21,189,22],[180,21,180,22],[181,21,181,22],[182,21,182,22],[183,21,183,22],[184,21,184,22],[195,21,195,22],[196,21,196,22],[197,21,197,22],[198,21,198,22],[199,21,199,22],[190,21,190,22],[191,21,191,22],[192,21,192,22],[193,21,193,22],[194,21,194,22],[165,21,165,22],[166,21,166,22],[167,21,167,22],[168,21,168,22],[169,21,169,22],[160,21,160,22],[161,21,161,22],[162,21,162,22],[163,21,163,22],[164,21,164,22],[175,21,175,22],[176,21,176,22],[177,21,177,22],[178,21,178,22],[179,21,179,22],[170,21,170,22],[171,21,171,22],[172,21,172,22],[173,21,173,22],[174,21,174,22],[145,21,145,22],[146,21,146,22],[147,21,147,22],[148,21,148,22],[149,21,149,22],[140,21,140,22],[141,21,141,22],[142,21,142,22],[143,21,143,22],[144,21,144,22],[155,21,155,22],[156,21,156,22],[157,21,157,22],[158,21,158,22],[159,21,159,22],[150,21,150,22],[151,21,151,22],[152,21,152,22],[153,21,153,22],[154,21,154,22],[125,21,125,22],[126,21,126,22],[127,21,127,22],[128,21,128,22],[129,21,129,22],[120,21,120,22],[121,21,121,22],[122,21,122,22],[123,21,123,22],[124,21,124,22],[135,21,135,22],[136,21,136,22],[137,21,137,22],[138,21,138,22],[139,21,139,22],[130,21,130,22],[131,21,131,22],[132,21,132,22],[133,21,133,22],[134,21,134,22],[105,21,105,22],[106,21,106,22],[107,21,107,22],[108,21,108,22],[109,21,109,22],[100,21,100,22],[101,21,101,22],[102,21,102,22],[103,21,103,22],[104,21,104,22],[115,21,115,22],[116,21,116,22],[117,21,117,22],[118,21,118,22],[119,21,119,22],[110,21,110,22],[111,21,111,22],[112,21,112,22],[113,21,113,22],[114,21,114,22],[85,21,85,22],[86,21,86,22],[87,21,87,22],[88,21,88,22],[89,21,89,22],[80,21,80,22],[81,21,81,22],[82,21,82,22],[83,21,83,22],[84,21,84,22],[40,21,40,22],[41,21,41,22],[42,21,42,22],[43,21,43,22],[44,21,44,22],[75,21,75,22],[76,21,76,22],[77,21,77,22],[78,21,78,22],[70,21,70,22],[71,21,71,22],[72,21,72,22],[73,21,73,22],[74,21,74,22],[65,21,65,22],[66,21,66,22],[67,21,67,22],[68,21,68,22],[69,21,69,22],[60,21,60,22],[61,21,61,22],[62,21,62,22],[63,21,63,22],[64,21,64,22],[50,21,50,22],[51,21,51,22],[52,21,52,22],[53,21,53,22],[54,21,54,22],[45,21,45,22],[46,21,46,22],[47,21,47,22],[48,21,48,22],[49,21,49,22],[191,10,191,11],[192,10,192,11],[183,10,183,11],[184,10,184,11],[185,10,185,11],[186,10,186,11],[187,10,187,11],[178,10,178,11],[55,21,55,22],[56,21,56,22],[57,21,57,22],[58,21,58,22],[59,21,59,22],[79,21,79,22],[95,21,95,22],[96,21,96,22],[97,21,97,22],[98,21,98,22],[99,21,99,22],[90,21,90,22],[91,21,91,22],[92,21,92,22],[93,21,93,22],[94,21,94,22],[198,10,198,11],[199,10,199,11],[26,21,26,22],[27,21,27,22],[28,21,28,22],[29,21,29,22],[30,21,30,22],[31,21,31,22],[32,21,32,22],[33,21,33,22],[34,21,34,22],[35,21,35,22],[36,21,36,22],[37,21,37,22],[38,21,38,22],[39,21,39,22],[193,10,193,11],[194,10,194,11],[195,10,195,11],[196,10,196,11],[197,10,197,11],[188,10,188,11],[189,10,189,11],[190,10,190,11],[168,10,168,11],[169,10,169,11],[170,10,170,11],[171,10,171,11],[172,10,172,11],[163,10,163,11],[164,10,164,11],[165,10,165,11],[166,10,166,11],[167,10,167,11],[179,10,179,11],[180,10,180,11],[181,10,181,11],[182,10,182,11],[173,10,173,11],[174,10,174,11],[175,10,175,11],[176,10,176,11],[177,10,177,11],[148,10,148,11],[149,10,149,11],[150,10,150,11],[151,10,151,11],[152,10,152,11],[143,10,143,11],[144,10,144,11],[145,10,145,11],[146,10,146,11],[147,10,147,11],[158,10,158,11],[159,10,159,11],[160,10,160,11],[161,10,161,11],[162,10,162,11],[153,10,153,11],[154,10,154,11],[155,10,155,11],[156,10,156,11],[157,10,157,11],[128,10,128,11],[129,10,129,11],[130,10,130,11],[131,10,131,11],[132,10,132,11],[123,10,123,11],[124,10,124,11],[125,10,125,11],[126,10,126,11],[127,10,127,11],[138,10,138,11],[139,10,139,11],[140,10,140,11],[141,10,141,11],[142,10,142,11],[133,10,133,11],[134,10,134,11],[135,10,135,11],[136,10,136,11],[137,10,137,11],[108,10,108,11],[109,10,109,11],[110,10,110,11],[111,10,111,11],[112,10,112,11],[103,10,103,11],[104,10,104,11],[105,10,105,11],[106,10,106,11],[107,10,107,11],[118,10,118,11],[119,10,119,11],[120,10,120,11],[121,10,121,11],[122,10,122,11],[113,10,113,11],[114,10,114,11],[115,10,115,11],[116,10,116,11],[117,10,117,11],[102,10,102,11],[93,10,93,11],[94,10,94,11],[95,10,95,11],[96,10,96,11],[97,10,97,11],[88,10,88,11],[89,10,89,11],[90,10,90,11],[91,10,91,11],[92,10,92,11],[63,10,63,11],[64,10,64,11],[65,10,65,11],[66,10,66,11],[67,10,67,11],[98,10,98,11],[99,10,99,11],[100,10,100,11],[101,10,101,11],[83,10,83,11],[84,10,84,11],[85,10,85,11],[86,10,86,11],[87,10,87,11],[73,10,73,11],[74,10,74,11],[75,10,75,11],[76,10,76,11],[77,10,77,11],[68,10,68,11],[69,10,69,11],[70,10,70,11],[71,10,71,11],[72,10,72,11],[35,10,35,11],[36,10,36,11],[37,10,37,11],[191,0,191,1],[192,0,192,1],[193,0,193,1],[194,0,194,1],[195,0,195,1],[186,0,186,1],[187,0,187,1],[188,0,188,1],[189,0,189,1],[190,0,190,1],[181,0,181,1],[58,10,58,11],[59,10,59,11],[60,10,60,11],[61,10,61,11],[62,10,62,11],[53,10,53,11],[54,10,54,11],[55,10,55,11],[56,10,56,11],[57,10,57,11],[26,10,26,11],[27,10,27,11],[28,10,28,11],[29,10,29,11],[30,10,30,11],[31,10,31,11],[32,10,32,11],[33,10,33,11],[34,10,34,11],[38,10,38,11],[39,10,39,11],[40,10,40,11],[41,10,41,11],[42,10,42,11],[196,0,196,1],[197,0,197,1],[198,0,198,1],[199,0,199,1],[48,10,48,11],[49,10,49,11],[50,10,50,11],[51,10,51,11],[52,10,52,11],[43,10,43,11],[44,10,44,11],[45,10,45,11],[46,10,46,11],[47,10,47,11],[78,10,78,11],[79,10,79,11],[80,10,80,11],[81,10,81,11],[82,10,82,11],[171,0,171,1],[172,0,172,1],[173,0,173,1],[174,0,174,1],[175,0,175,1],[166,0,166,1],[167,0,167,1],[168,0,168,1],[169,0,169,1],[170,0,170,1],[182,0,182,1],[183,0,183,1],[184,0,184,1],[185,0,185,1],[176,0,176,1],[177,0,177,1],[178,0,178,1],[179,0,179,1],[180,0,180,1],[151,0,151,1],[152,0,152,1],[153,0,153,1],[154,0,154,1],[155,0,155,1],[146,0,146,1],[147,0,147,1],[148,0,148,1],[149,0,149,1],[150,0,150,1],[161,0,161,1],[162,0,162,1],[163,0,163,1],[164,0,164,1],[165,0,165,1],[156,0,156,1],[157,0,157,1],[158,0,158,1],[159,0,159,1],[160,0,160,1],[131,0,131,1],[132,0,132,1],[133,0,133,1],[134,0,134,1],[135,0,135,1],[126,0,126,1],[127,0,127,1],[128,0,128,1],[129,0,129,1],[130,0,130,1],[141,0,141,1],[142,0,142,1],[143,0,143,1],[144,0,144,1],[145,0,145,1],[136,0,136,1],[137,0,137,1],[138,0,138,1],[139,0,139,1],[140,0,140,1],[111,0,111,1],[112,0,112,1],[113,0,113,1],[114,0,114,1],[115,0,115,1],[106,0,106,1],[107,0,107,1],[108,0,108,1],[109,0,109,1],[110,0,110,1],[121,0,121,1],[122,0,122,1],[123,0,123,1],[124,0,124,1],[125,0,125,1],[116,0,116,1],[117,0,117,1],[118,0,118,1],[119,0,119,1],[120,0,120,1],[91,0,91,1],[92,0,92,1],[93,0,93,1],[94,0,94,1],[95,0,95,1],[86,0,86,1],[87,0,87,1],[88,0,88,1],[89,0,89,1],[90,0,90,1],[101,0,101,1],[102,0,102,1],[103,0,103,1],[104,0,104,1],[105,0,105,1],[96,0,96,1],[97,0,97,1],[98,0,98,1],[99,0,99,1],[100,0,100,1],[71,0,71,1],[72,0,72,1],[73,0,73,1],[74,0,74,1],[75,0,75,1],[66,0,66,1],[67,0,67,1],[68,0,68,1],[69,0,69,1],[70,0,70,1],[81,0,81,1],[82,0,82,1],[83,0,83,1],[84,0,84,1],[85,0,85,1],[76,0,76,1],[77,0,77,1],[78,0,78,1],[79,0,79,1],[80,0,80,1],[51,0,51,1],[52,0,52,1],[53,0,53,1],[54,0,54,1],[55,0,55,1],[46,0,46,1],[47,0,47,1],[48,0,48,1],[49,0,49,1],[50,0,50,1],[61,0,61,1],[62,0,62,1],[63,0,63,1],[64,0,64,1],[65,0,65,1],[56,0,56,1],[57,0,57,1],[58,0,58,1],[59,0,59,1],[60,0,60,1],[43,0,43,1],[44,0,44,1],[45,0,45,1],[36,0,36,1],[37,0,37,1],[38,0,38,1],[39,0,39,1],[40,0,40,1],[31,0,31,1],[32,0,32,1],[33,0,33,1],[34,0,34,1],[35,0,35,1],[25,0,25,1],[14,0,14,1],[15,0,15,1],[16,0,16,1],[17,0,17,1],[18,0,18,1],[19,0,19,1],[41,0,41,1],[42,0,42,1],[26,0,26,1],[27,0,27,1],[28,0,28,1],[29,0,29,1],[30,0,30,1],[20,0,20,1],[21,0,21,1],[22,0,22,1],[23,0,23,1],[24,0,24,1],[25,10,25,11],[16,10,16,11],[17,10,17,11],[18,10,18,11],[19,10,19,11],[20,10,20,11],[21,10,21,11],[14,10,14,11],[13,21,13,22],[25,21,25,22],[14,21,14,22],[15,21,15,22],[16,21,16,22],[17,21,17,22],[18,21,18,22],[19,21,19,22],[20,21,20,22],[21,21,21,22],[22,21,22,22],[23,21,23,22],[24,21,24,22],[24,10,24,11],[15,10,15,11],[7,0,7,1],[7,10,7,11],[5,6,5,15],[5,17,5,27],[7,21,7,22],[5,0,5,4],[5,29,5,35],[22,10,22,11],[23,10,23,11],[13,0,13,1],[8,0,8,1],[9,0,9,1],[10,0,10,1],[11,0,11,1],[12,0,12,1],[12,10,12,11],[13,10,13,11],[9,10,9,11],[0,33,0,35],[1,33,1,35],[1,10,2,23],[8,21,8,22],[9,21,9,22],[10,21,10,22],[11,21,11,22],[12,21,12,22],[8,10,8,11],[10,10,10,11],[11,10,11,11]]}
["TIP Project:",{"$f":"TIP_number_MAIN_tab","v":0},null,null,null,null,null,null,null,null,null,null,null,null,null,null,null,null,null,null,null,null,null,null,null,null,null,null,null,null,null,null,"Date:","00:00:00"]
["County:",null,null,null,null,null,null,null,null,null,"SUMMARY TABLE",null,null,null,null,null,null,null,null,null,null,null,null,null,null,null,null,null,null,null,null,null,"  Design Firm:",{"$f":"design_firm_MAIN_tab","v":0}]
[]
[{"$f":"MAIN!A37","v":"Version 1.0"}]
[]
["OUTLET INFORMATION",null,null,null,null,null,"PRE-CONSTRUCTION SUMMARY",null,null,null,null,null,null,null,null,null,null,"POST-CONSTRUCTION SUMMARY",null,null,null,null,null,null,null,null,null,null,null,"OVERALL SUMMARY"]
[]
["OUTLET",null,"LOCATION","MAPS LINK","HYD. METHOD",null,"DRAINAGE AREA","T.O.C (MIN)","C VAL. OR CURVE #","% IMP. TOTAL","D/S GEOMETRY",null,"Q10 (CFS)","D10 (FT)","V10 (FT/S)","ROUGH-NESS VAL.",null,"DRAINAGE AREA","T.O.C (MIN.)","C VAL.","% IMP. TOTAL","D/S GEOMETRY",null,"LINER TYPE","ROUGH-NESS VAL.","Q10 (CFS)","D10 (FT)","V10 (FT/S)",null,"Q10 % CHNG.","D10 % CHNG.","V10 % CHNG.","TOTAL AREA CHNG.","IMP AREA CHNG.","% IMP CHNG.","CASE TYPE\n"]
[{"$f":"'Hidden Summary'!A2","v":"PSH 4 OUTLET 2"},null,{"$f":"'Hidden Summary'!D2","v":"INSIDE R/W"},"Click",{"$f":"IF('Hidden Summary'!G2=\"Rational Method\",\"Rational\",IF('Hidden Summary'!G2=\"TR-55 Method\",\"TR-55\",IF('Hidden Summary'!G2=\"USGS-5030 Method\",\"USGS-5030\",IF('Hidden Summary'!G2=\"USGS-5158 Method\",\"USGS-5158\",IF('Hidden Summary'!G2=\"User Input Method\",\"User Input\",\"\")))))","v":"Rational"},null,{"$f":"'Hidden Summary'!I2","v":29.92},{"$f":"'Hidden Summary'!K2","v":10},{"$f":"'Hidden Summary'!M2","v":0.37393048128342199},{"$f":"'Hidden Summary'!Z2","v":0.24944903074866309},{"$f":"'Hidden Summary'!O2","v":"Trapezoidal"},null,{"$f":"'Hidden Summary'!Q2","v":57.506319999999981},{"$f":"'Hidden Summary'!U2","v":1.7318962141558072},{"$f":"'Hidden Summary'!S2","v":6.077142386843625},{"$f":"'Hidden Summary'!X2","v":3.4000000000000002E-2},null,{"$f":"'Hidden Summary'!J2","v":20.745000000000001},{"$f":"'Hidden Summary'!L2","v":10},{"$f":"'Hidden Summary'!N2","v":0.43473608098336902},{"$f":"'Hidden Summary'!AA2","v":0.28706067968185101},{"$f":"'Hidden Summary'!P2","v":"Triangular"},null,{"$f":"'Hidden Summary'!W2","v":"Select Liner Type Above To Generate List"},{"$f":"'Hidden Summary'!Y2","v":3.5000000000000003E-2},{"$f":"'Hidden Summary'!R2","v":46.355603999999992},{"$f":"'Hidden Summary'!V2","v":1.8788982800302585},{"$f":"'Hidden Summary'!T2","v":6.5654702128768294},null,{"$f":"(Z9/M9)-1","v":-0.19390418305327117},{"$f":"(AA9/N9)-1","v":8.4879258163922833E-2},{"$f":"(AB9/O9)-1","v":8.0354843600568326E-2},{"$f":"R9-G9","v":-9.1750000000000007},{"$f":"(U9*R9)-(J9*G9)","v":-1.5084412000000009},{"$f":"U9-J9","v":3.7611648933187913E-2},{"$f":"'Hidden Summary'!AB2","v":0}]
[{"$f":"'Hidden Summary'!A3","v":"PSH 78 OUTLET 9"},null,{"$f":"'Hidden Summary'!D3","v":"AT R/W"},"Click",{"$f":"IF('Hidden Summary'!G3=\"Rational Method\",\"Rational\",IF('Hidden Summary'!G3=\"TR-55 Method\",\"TR-55\",IF('Hidden Summary'!G3=\"USGS-5030 Method\",\"USGS-5030\",IF('Hidden Summary'!G3=\"USGS-5158 Method\",\"USGS-5158\",IF('Hidden Summary'!G3=\"User Input Method\",\"User Input\",\"\")))))","v":"TR-55"},null,{"$f":"'Hidden Summary'!I3","v":0},{"$f":"'Hidden Summary'!K3","v":0},{"$f":"'Hidden Summary'!M3","v":0},{"$f":"'Hidden Summary'!Z3","v":0},{"$f":"'Hidden Summary'!O3","v":0},null,{"$f":"'Hidden Summary'!Q3","v":0},{"$f":"'Hidden Summary'!U3","v":0},{"$f":"'Hidden Summary'!S3","v":0},{"$f":"'Hidden Summary'!X3","v":0},null,{"$f":"'Hidden Summary'!J3","v":0},{"$f":"'Hidden Summary'!L3","v":0},{"$f":"'Hidden Summary'!N3","v":0},{"$f":"'Hidden Summary'!AA3","v":0},{"$f":"'Hidden Summary'!P3","v":0},null,{"$f":"'Hidden Summary'!W3","v":"Select Liner Type Above To Generate List"},{"$f":"'Hidden Summary'!Y3","v":0},{"$f":"'Hidden Summary'!R3","v":0},{"$f":"'Hidden Summary'!V3","v":0},{"$f":"'Hidden Summary'!T3","v":0},null,{"$f":"(Z10/M10)-1","v":{"$error":"#DIV/0!"}},{"$f":"(AA10/N10)-1","v":{"$error":"#DIV/0!"}},{"$f":"(AB10/O10)-1","v":{"$error":"#DIV/0!"}},{"$f":"R10-G10","v":0},{"$f":"(U10*R10)-(J10*G10)","v":0},{"$f":"U10-J10","v":0},{"$f":"'Hidden Summary'!AB3","v":0}]
[{"$f":"'Hidden Summary'!A4","v":0},null,{"$f":"'Hidden Summary'!D4","v":0},"Click",{"$f":"IF('Hidden Summary'!G4=\"Rational Method\",\"Rational\",IF('Hidden Summary'!G4=\"TR-55 Method\",\"TR-55\",IF('Hidden Summary'!G4=\"USGS-5030 Method\",\"USGS-5030\",IF('Hidden Summary'!G4=\"USGS-5158 Method\",\"USGS-5158\",IF('Hidden Summary'!G4=\"User Input Method\",\"User Input\",\"\")))))","v":""},null,{"$f":"'Hidden Summary'!I4","v":0},{"$f":"'Hidden Summary'!K4","v":0},{"$f":"'Hidden Summary'!M4","v":0},{"$f":"'Hidden Summary'!Z4","v":0},{"$f":"'Hidden Summary'!O4","v":0},null,{"$f":"'Hidden Summary'!Q4","v":0},{"$f":"'Hidden Summary'!U4","v":0},{"$f":"'Hidden Summary'!S4","v":0},{"$f":"'Hidden Summary'!X4","v":0},null,{"$f":"'Hidden Summary'!J4","v":0},{"$f":"'Hidden Summary'!L4","v":0},{"$f":"'Hidden Summary'!N4","v":0},{"$f":"'Hidden Summary'!AA4","v":0},{"$f":"'Hidden Summary'!P4","v":0},null,{"$f":"'Hidden Summary'!W4","v":0},{"$f":"'Hidden Summary'!Y4","v":0},{"$f":"'Hidden Summary'!R4","v":0},{"$f":"'Hidden Summary'!V4","v":0},{"$f":"'Hidden Summary'!T4","v":0},null,{"$error":"#DIV/0!"},{"$error":"#DIV/0!"},{"$error":"#DIV/0!"},0,0,0,{"$f":"'Hidden Summary'!AB4","v":0}]
[{"$f":"'Hidden Summary'!A5","v":0},null,{"$f":"'Hidden Summary'!D5","v":0},"Click",{"$f":"IF('Hidden Summary'!G5=\"Rational Method\",\"Rational\",IF('Hidden Summary'!G5=\"TR-55 Method\",\"TR-55\",IF('Hidden Summary'!G5=\"USGS-5030 Method\",\"USGS-5030\",IF('Hidden Summary'!G5=\"USGS-5158 Method\",\"USGS-5158\",IF('Hidden Summary'!G5=\"User Input Method\",\"User Input\",\"\")))))","v":""},null,{"$f":"'Hidden Summary'!I5","v":0},{"$f":"'Hidden Summary'!K5","v":0},{"$f":"'Hidden Summary'!M5","v":0},{"$f":"'Hidden Summary'!Z5","v":0},{"$f":"'Hidden Summary'!O5","v":0},null,{"$f":"'Hidden Summary'!Q5","v":0},{"$f":"'Hidden Summary'!U5","v":0},{"$f":"'Hidden Summary'!S5","v":0},{"$f":"'Hidden Summary'!X5","v":0},null,{"$f":"'Hidden Summary'!J5","v":0},{"$f":"'Hidden Summary'!L5","v":0},{"$f":"'Hidden Summary'!N5","v":0},{"$f":"'Hidden Summary'!AA5","v":0},{"$f":"'Hidden Summary'!P5","v":0},null,{"$f":"'Hidden Summary'!W5","v":0},{"$f":"'Hidden Summary'!Y5","v":0},{"$f":"'Hidden Summary'!R5","v":0},{"$f":"'Hidden Summary'!V5","v":0},{"$f":"'Hidden Summary'!T5","v":0},null,{"$error":"#DIV/0!"},{"$error":"#DIV/0!"},{"$error":"#DIV/0!"},0,0,0,{"$f":"'Hidden Summary'!AB5","v":0}]
[{"$f":"'Hidden Summary'!A6","v":0},null,{"$f":"'Hidden Summary'!D6","v":0},"Click",{"$f":"IF('Hidden Summary'!G6=\"Rational Method\",\"Rational\",IF('Hidden Summary'!G6=\"TR-55 Method\",\"TR-55\",IF('Hidden Summary'!G6=\"USGS-5030 Method\",\"USGS-5030\",IF('Hidden Summary'!G6=\"USGS-5158 Method\",\"USGS-5158\",IF('Hidden Summary'!G6=\"User Input Method\",\"User Input\",\"\")))))","v":""},null,{"$f":"'Hidden Summary'!I6","v":0},{"$f":"'Hidden Summary'!K6","v":0},{"$f":"'Hidden Summary'!M6","v":0},{"$f":"'Hidden Summary'!Z6","v":0},{"$f":"'Hidden Summary'!O6","v":0},null,{"$f":"'Hidden Summary'!Q6","v":0},{"$f":"'Hidden Summary'!U6","v":0},{"$f":"'Hidden Summary'!S6","v":0},{"$f":"'Hidden Summary'!X6","v":0},null,{"$f":"'Hidden Summary'!J6","v":0},{"$f":"'Hidden Summary'!L6","v":0},{"$f":"'Hidden Summary'!N6","v":0},{"$f":"'Hidden Summary'!AA6","v":0},{"$f":"'Hidden Summary'!P6","v":0},null,{"$f":"'Hidden Summary'!W6","v":0},{"$f":"'Hidden Summary'!Y6","v":0},{"$f":"'Hidden Summary'!R6","v":0},{"$f":"'Hidden Summary'!V6","v":0},{"$f":"'Hidden Summary'!T6","v":0},null,{"$error":"#DIV/0!"},{"$error":"#DIV/0!"},{"$error":"#DIV/0!"},0,0,0,{"$f":"'Hidden Summary'!AB6","v":0}]
[{"$f":"'Hidden Summary'!A7","v":0},null,{"$f":"'Hidden Summary'!D7","v":0},null,{"$f":"IF('Hidden Summary'!G7=\"Rational Method\",\"Rational\",IF('Hidden Summary'!G7=\"TR-55 Method\",\"TR-55\",IF('Hidden Summary'!G7=\"USGS-5030 Method\",\"USGS-5030\",IF('Hidden Summary'!G7=\"USGS-5158 Method\",\"USGS-5158\",IF('Hidden Summary'!G7=\"User Input Method\",\"User Input\",\"\")))))","v":""},null,{"$f":"'Hidden Summary'!I7","v":0},{"$f":"'Hidden Summary'!K7","v":0},{"$f":"'Hidden Summary'!M7","v":0},{"$f":"'Hidden Summary'!Z7","v":0},{"$f":"'Hidden Summary'!O7","v":0},null,{"$f":"'Hidden Summary'!Q7","v":0},{"$f":"'Hidden Summary'!U7","v":0},{"$f":"'Hidden Summary'!S7","v":0},{"$f":"'Hidden Summary'!X7","v":0},null,{"$f":"'Hidden Summary'!J7","v":0},{"$f":"'Hidden Summary'!L7","v":0},{"$f":"'Hidden Summary'!N7","v":0},{"$f":"'Hidden Summary'!AA7","v":0},{"$f":"'Hidden Summary'!P7","v":0},null,{"$f":"'Hidden Summary'!W7","v":0},{"$f":"'Hidden Summary'!Y7","v":0},{"$f":"'Hidden Summary'!R7","v":0},{"$f":"'Hidden Summary'!V7","v":0},{"$f":"'Hidden Summary'!T7","v":0},null,{"$error":"#DIV/0!"},{"$error":"#DIV/0!"},{"$error":"#DIV/0!"},0,0,0,{"$f":"'Hidden Summary'!AB7","v":0}]
[{"$f":"'Hidden Summary'!A8","v":0},null,{"$f":"'Hidden Summary'!D8","v":0},null,{"$f":"IF('Hidden Summary'!G8=\"Rational Method\",\"Rational\",IF('Hidden Summary'!G8=\"TR-55 Method\",\"TR-55\",IF('Hidden Summary'!G8=\"USGS-5030 Method\",\"USGS-5030\",IF('Hidden Summary'!G8=\"USGS-5158 Method\",\"USGS-5158\",IF('Hidden Summary'!G8=\"User Input Method\",\"User Input\",\"\")))))","v":""},null,{"$f":"'Hidden Summary'!I8","v":0},{"$f":"'Hidden Summary'!K8","v":0},{"$f":"'Hidden Summary'!M8","v":0},{"$f":"'Hidden Summary'!Z8","v":0},{"$f":"'Hidden Summary'!O8","v":0},null,{"$f":"'Hidden Summary'!Q8","v":0},{"$f":"'Hidden Summary'!U8","v":0},{"$f":"'Hidden Summary'!S8","v":0},{"$f":"'Hidden Summary'!X8","v":0},null,{"$f":"'Hidden Summary'!J8","v":0},{"$f":"'Hidden Summary'!L8","v":0},{"$f":"'Hidden Summary'!N8","v":0},{"$f":"'Hidden Summary'!AA8","v":0},{"$f":"'Hidden Summary'!P8","v":0},null,{"$f":"'Hidden Summary'!W8","v":0},{"$f":"'Hidden Summary'!Y8","v":0},{"$f":"'Hidden Summary'!R8","v":0},{"$f":"'Hidden Summary'!V8","v":0},{"$f":"'Hidden Summary'!T8","v":0},null,{"$error":"#DIV/0!"},{"$error":"#DIV/0!"},{"$error":"#DIV/0!"},0,0,0,{"$f":"'Hidden Summary'!AB8","v":0}]
[{"$f":"'Hidden Summary'!A9","v":0},null,{"$f":"'Hidden Summary'!D9","v":0},null,{"$f":"IF('Hidden Summary'!G9=\"Rational Method\",\"Rational\",IF('Hidden Summary'!G9=\"TR-55 Method\",\"TR-55\",IF('Hidden Summary'!G9=\"USGS-5030 Method\",\"USGS-5030\",IF('Hidden Summary'!G9=\"USGS-5158 Method\",\"USGS-5158\",IF('Hidden Summary'!G9=\"User Input Method\",\"User Input\",\"\")))))","v":""},null,{"$f":"'Hidden Summary'!I9","v":0},{"$f":"'Hidden Summary'!K9","v":0},{"$f":"'Hidden Summary'!M9","v":0},{"$f":"'Hidden Summary'!Z9","v":0},{"$f":"'Hidden Summary'!O9","v":0},null,{"$f":"'Hidden Summary'!Q9","v":0},{"$f":"'Hidden Summary'!U9","v":0},{"$f":"'Hidden Summary'!S9","v":0},{"$f":"'Hidden Summary'!X9","v":0},null,{"$f":"'Hidden Summary'!J9","v":0},{"$f":"'Hidden Summary'!L9","v":0},{"$f":"'Hidden Summary'!N9","v":0},{"$f":"'Hidden Summary'!AA9","v":0},{"$f":"'Hidden Summary'!P9","v":0},null,{"$f":"'Hidden Summary'!W9","v":0},{"$f":"'Hidden Summary'!Y9","v":0},{"$f":"'Hidden Summary'!R9","v":0},{"$f":"'Hidden Summary'!V9","v":0},{"$f":"'Hidden Summary'!T9","v":0},null,{"$error":"#DIV/0!"},{"$error":"#DIV/0!"},{"$error":"#DIV/0!"},0,0,0,{"$f":"'Hidden Summary'!AB9","v":0}]
[{"$f":"'Hidden Summary'!A10","v":0},null,{"$f":"'Hidden Summary'!D10","v":0},null,{"$f":"IF('Hidden Summary'!G10=\"Rational Method\",\"Rational\",IF('Hidden Summary'!G10=\"TR-55 Method\",\"TR-55\",IF('Hidden Summary'!G10=\"USGS-5030 Method\",\"USGS-5030\",IF('Hidden Summary'!G10=\"USGS-5158 Method\",\"USGS-5158\",IF('Hidden Summary'!G10=\"User Input Method\",\"User Input\",\"\")))))","v":""},null,{"$f":"'Hidden Summary'!I10","v":0},{"$f":"'Hidden Summary'!K10","v":0},{"$f":"'Hidden Summary'!M10","v":0},{"$f":"'Hidden Summary'!Z10","v":0},{"$f":"'Hidden Summary'!O10","v":0},null,{"$f":"'Hidden Summary'!Q10","v":0},{"$f":"'Hidden Summary'!U10","v":0},{"$f":"'Hidden Summary'!S10","v":0},{"$f":"'Hidden Summary'!X10","v":0},null,{"$f":"'Hidden Summary'!J10","v":0},{"$f":"'Hidden Summary'!L10","v":0},{"$f":"'Hidden Summary'!N10","v":0},{"$f":"'Hidden Summary'!AA10","v":0},{"$f":"'Hidden Summary'!P10","v":0},null,{"$f":"'Hidden Summary'!W10","v":0},{"$f":"'Hidden Summary'!Y10","v":0},{"$f":"'Hidden Summary'!R10","v":0},{"$f":"'Hidden Summary'!V10","v":0},{"$f":"'Hidden Summary'!T10","v":0},null,{"$error":"#DIV/0!"},{"$error":"#DIV/0!"},{"$error":"#DIV/0!"},0,0,0,{"$f":"'Hidden Summary'!AB10","v":0}]
[{"$f":"'Hidden Summary'!A11","v":0},null,{"$f":"'Hidden Summary'!D11","v":0},null,{"$f":"IF('Hidden Summary'!G11=\"Rational Method\",\"Rational\",IF('Hidden Summary'!G11=\"TR-55 Method\",\"TR-55\",IF('Hidden Summary'!G11=\"USGS-5030 Method\",\"USGS-5030\",IF('Hidden Summary'!G11=\"USGS-5158 Method\",\"USGS-5158\",IF('Hidden Summary'!G11=\"User Input Method\",\"User Input\",\"\")))))","v":""},null,{"$f":"'Hidden Summary'!I11","v":0},{"$f":"'Hidden Summary'!K11","v":0},{"$f":"'Hidden Summary'!M11","v":0},{"$f":"'Hidden Summary'!Z11","v":0},{"$f":"'Hidden Summary'!O11","v":0},null,{"$f":"'Hidden Summary'!Q11","v":0},{"$f":"'Hidden Summary'!U11","v":0},{"$f":"'Hidden Summary'!S11","v":0},{"$f":"'Hidden Summary'!X11","v":0},null,{"$f":"'Hidden Summary'!J11","v":0},{"$f":"'Hidden Summary'!L11","v":0},{"$f":"'Hidden Summary'!N11","v":0},{"$f":"'Hidden Summary'!AA11","v":0},{"$f":"'Hidden Summary'!P11","v":0},null,{"$f":"'Hidden Summary'!W11","v":0},{"$f":"'Hidden Summary'!Y11","v":0},{"$f":"'Hidden Summary'!R11","v":0},{"$f":"'Hidden Summary'!V11","v":0},{"$f":"'Hidden Summary'!T11","v":0},null,{"$error":"#DIV/0!"},{"$error":"#DIV/0!"},{"$error":"#DIV/0!"},0,0,0,{"$f":"'Hidden Summary'!AB11","v":0}]
[{"$f":"'Hidden Summary'!A12","v":0},null,{"$f":"'Hidden Summary'!D12","v":0},null,{"$f":"IF('Hidden Summary'!G12=\"Rational Method\",\"Rational\",IF('Hidden Summary'!G12=\"TR-55 Method\",\"TR-55\",IF('Hidden Summary'!G12=\"USGS-5030 Method\",\"USGS-5030\",IF('Hidden Summary'!G12=\"USGS-5158 Method\",\"USGS-5158\",IF('Hidden Summary'!G12=\"User Input Method\",\"User Input\",\"\")))))","v":""},null,{"$f":"'Hidden Summary'!I12","v":0},{"$f":"'Hidden Summary'!K12","v":0},{"$f":"'Hidden Summary'!M12","v":0},{"$f":"'Hidden Summary'!Z12","v":0},{"$f":"'Hidden Summary'!O12","v":0},null,{"$f":"'Hidden Summary'!Q12","v":0},{"$f":"'Hidden Summary'!U12","v":0},{"$f":"'Hidden Summary'!S12","v":0},{"$f":"'Hidden Summary'!X12","v":0},null,{"$f":"'Hidden Summary'!J12","v":0},{"$f":"'Hidden Summary'!L12","v":0},{"$f":"'Hidden Summary'!N12","v":0},{"$f":"'Hidden Summary'!AA12","v":0},{"$f":"'Hidden Summary'!P12","v":0},null,{"$f":"'Hidden Summary'!W12","v":0},{"$f":"'Hidden Summary'!Y12","v":0},{"$f":"'Hidden Summary'!R12","v":0},{"$f":"'Hidden Summary'!V12","v":0},{"$f":"'Hidden Summary'!T12","v":0},null,{"$error":"#DIV/0!"},{"$error":"#DIV/0!"},{"$error":"#DIV/0!"},0,0,0,{"$f":"'Hidden Summary'!AB12","v":0}]
[{"$f":"'Hidden Summary'!A13","v":0},null,{"$f":"'Hidden Summary'!D13","v":0},null,{"$f":"IF('Hidden Summary'!G13=\"Rational Method\",\"Rational\",IF('Hidden Summary'!G13=\"TR-55 Method\",\"TR-55\",IF('Hidden Summary'!G13=\"USGS-5030 Method\",\"USGS-5030\",IF('Hidden Summary'!G13=\"USGS-5158 Method\",\"USGS-5158\",IF('Hidden Summary'!G13=\"User Input Method\",\"User Input\",\"\")))))","v":""},null,{"$f":"'Hidden Summary'!I13","v":0},{"$f":"'Hidden Summary'!K13","v":0},{"$f":"'Hidden Summary'!M13","v":0},{"$f":"'Hidden Summary'!Z13","v":0},{"$f":"'Hidden Summary'!O13","v":0},null,{"$f":"'Hidden Summary'!Q13","v":0},{"$f":"'Hidden Summary'!U13","v":0},{"$f":"'Hidden Summary'!S13","v":0},{"$f":"'Hidden Summary'!X13","v":0},null,{"$f":"'Hidden Summary'!J13","v":0},{"$f":"'Hidden Summary'!L13","v":0},{"$f":"'Hidden Summary'!N13","v":0},{"$f":"'Hidden Summary'!AA13","v":0},{"$f":"'Hidden Summary'!P13","v":0},null,{"$f":"'Hidden Summary'!W13","v":0},{"$f":"'Hidden Summary'!Y13","v":0},{"$f":"'Hidden Summary'!R13","v":0},{"$f":"'Hidden Summary'!V13","v":0},{"$f":"'Hidden Summary'!T13","v":0},null,{"$error":"#DIV/0!"},{"$error":"#DIV/0!"},{"$error":"#DIV/0!"},0,0,0,{"$f":"'Hidden Summary'!AB13","v":0}]
[{"$f":"'Hidden Summary'!A14","v":0},null,{"$f":"'Hidden Summary'!D14","v":0},null,{"$f":"IF('Hidden Summary'!G14=\"Rational Method\",\"Rational\",IF('Hidden Summary'!G14=\"TR-55 Method\",\"TR-55\",IF('Hidden Summary'!G14=\"USGS-5030 Method\",\"USGS-5030\",IF('Hidden Summary'!G14=\"USGS-5158 Method\",\"USGS-5158\",IF('Hidden Summary'!G14=\"User Input Method\",\"User Input\",\"\")))))","v":""},null,{"$f":"'Hidden Summary'!I14","v":0},{"$f":"'Hidden Summary'!K14","v":0},{"$f":"'Hidden Summary'!M14","v":0},{"$f":"'Hidden Summary'!Z14","v":0},{"$f":"'Hidden Summary'!O14","v":0},null,{"$f":"'Hidden Summary'!Q14","v":0},{"$f":"'Hidden Summary'!U14","v":0},{"$f":"'Hidden Summary'!S14","v":0},{"$f":"'Hidden Summary'!X14","v":0},null,{"$f":"'Hidden Summary'!J14","v":0},{"$f":"'Hidden Summary'!L14","v":0},{"$f":"'Hidden Summary'!N14","v":0},{"$f":"'Hidden Summary'!AA14","v":0},{"$f":"'Hidden Summary'!P14","v":0},null,{"$f":"'Hidden Summary'!W14","v":0},{"$f":"'Hidden Summary'!Y14","v":0},{"$f":"'Hidden Summary'!R14","v":0},{"$f":"'Hidden Summary'!V14","v":0},{"$f":"'Hidden Summary'!T14","v":0},null,{"$error":"#DIV/0!"},{"$error":"#DIV/0!"},{"$error":"#DIV/0!"},0,0,0,{"$f":"'Hidden Summary'!AB14","v":0}]
[{"$f":"'Hidden Summary'!A15","v":0},null,{"$f":"'Hidden Summary'!D15","v":0},null,{"$f":"IF('Hidden Summary'!G15=\"Rational Method\",\"Rational\",IF('Hidden Summary'!G15=\"TR-55 Method\",\"TR-55\",IF('Hidden Summary'!G15=\"USGS-5030 Method\",\"USGS-5030\",IF('Hidden Summary'!G15=\"USGS-5158 Method\",\"USGS-5158\",IF('Hidden Summary'!G15=\"User Input Method\",\"User Input\",\"\")))))","v":""},null,{"$f":"'Hidden Summary'!I15","v":0},{"$f":"'Hidden Summary'!K15","v":0},{"$f":"'Hidden Summary'!M15","v":0},{"$f":"'Hidden Summary'!Z15","v":0},{"$f":"'Hidden Summary'!O15","v":0},null,{"$f":"'Hidden Summary'!Q15","v":0},{"$f":"'Hidden Summary'!U15","v":0},{"$f":"'Hidden Summary'!S15","v":0},{"$f":"'Hidden Summary'!X15","v":0},null,{"$f":"'Hidden Summary'!J15","v":0},{"$f":"'Hidden Summary'!L15","v":0},{"$f":"'Hidden Summary'!N15","v":0},{"$f":"'Hidden Summary'!AA15","v":0},{"$f":"'Hidden Summary'!P15","v":0},null,{"$f":"'Hidden Summary'!W15","v":0},{"$f":"'Hidden Summary'!Y15","v":0},{"$f":"'Hidden Summary'!R15","v":0},{"$f":"'Hidden Summary'!V15","v":0},{"$f":"'Hidden Summary'!T15","v":0},null,{"$error":"#DIV/0!"},{"$error":"#DIV/0!"},{"$error":"#DIV/0!"},0,0,0,{"$f":"'Hidden Summary'!AB15","v":0}]
[{"$f":"'Hidden Summary'!A16","v":0},null,{"$f":"'Hidden Summary'!D16","v":0},null,{"$f":"IF('Hidden Summary'!G16=\"Rational Method\",\"Rational\",IF('Hidden Summary'!G16=\"TR-55 Method\",\"TR-55\",IF('Hidden Summary'!G16=\"USGS-5030 Method\",\"USGS-5030\",IF('Hidden Summary'!G16=\"USGS-5158 Method\",\"USGS-5158\",IF('Hidden Summary'!G16=\"User Input Method\",\"User Input\",\"\")))))","v":""},null,{"$f":"'Hidden Summary'!I16","v":0},{"$f":"'Hidden Summary'!K16","v":0},{"$f":"'Hidden Summary'!M16","v":0},{"$f":"'Hidden Summary'!Z16","v":0},{"$f":"'Hidden Summary'!O16","v":0},null,{"$f":"'Hidden Summary'!Q16","v":0},{"$f":"'Hidden Summary'!U16","v":0},{"$f":"'Hidden Summary'!S16","v":0},{"$f":"'Hidden Summary'!X16","v":0},null,{"$f":"'Hidden Summary'!J16","v":0},{"$f":"'Hidden Summary'!L16","v":0},{"$f":"'Hidden Summary'!N16","v":0},{"$f":"'Hidden Summary'!AA16","v":0},{"$f":"'Hidden Summary'!P16","v":0},null,{"$f":"'Hidden Summary'!W16","v":0},{"$f":"'Hidden Summary'!Y16","v":0},{"$f":"'Hidden Summary'!R16","v":0},{"$f":"'Hidden Summary'!V16","v":0},{"$f":"'Hidden Summary'!T16","v":0},null,{"$error":"#DIV/0!"},{"$error":"#DIV/0!"},{"$error":"#DIV/0!"},0,0,0,{"$f":"'Hidden Summary'!AB16","v":0}]
[{"$f":"'Hidden Summary'!A17","v":0},null,{"$f":"'Hidden Summary'!D17","v":0},null,{"$f":"IF('Hidden Summary'!G17=\"Rational Method\",\"Rational\",IF('Hidden Summary'!G17=\"TR-55 Method\",\"TR-55\",IF('Hidden Summary'!G17=\"USGS-5030 Method\",\"USGS-5030\",IF('Hidden Summary'!G17=\"USGS-5158 Method\",\"USGS-5158\",IF('Hidden Summary'!G17=\"User Input Method\",\"User Input\",\"\")))))","v":""},null,{"$f":"'Hidden Summary'!I17","v":0},{"$f":"'Hidden Summary'!K17","v":0},{"$f":"'Hidden Summary'!M17","v":0},{"$f":"'Hidden Summary'!Z17","v":0},{"$f":"'Hidden Summary'!O17","v":0},null,{"$f":"'Hidden Summary'!Q17","v":0},{"$f":"'Hidden Summary'!U17","v":0},{"$f":"'Hidden Summary'!S17","v":0},{"$f":"'Hidden Summary'!X17","v":0},null,{"$f":"'Hidden Summary'!J17","v":0},{"$f":"'Hidden Summary'!L17","v":0},{"$f":"'Hidden Summary'!N17","v":0},{"$f":"'Hidden Summary'!AA17","v":0},{"$f":"'Hidden Summary'!P17","v":0},null,{"$f":"'Hidden Summary'!W17","v":0},{"$f":"'Hidden Summary'!Y17","v":0},{"$f":"'Hidden Summary'!R17","v":0},{"$f":"'Hidden Summary'!V17","v":0},{"$f":"'Hidden Summary'!T17","v":0},null,{"$error":"#DIV/0!"},{"$error":"#DIV/0!"},{"$error":"#DIV/0!"},0,0,0,{"$f":"'Hidden Summary'!AB17","v":0}]
[{"$f":"'Hidden Summary'!A18","v":0},null,{"$f":"'Hidden Summary'!D18","v":0},null,{"$f":"IF('Hidden Summary'!G18=\"Rational Method\",\"Rational\",IF('Hidden Summary'!G18=\"TR-55 Method\",\"TR-55\",IF('Hidden Summary'!G18=\"USGS-5030 Method\",\"USGS-5030\",IF('Hidden Summary'!G18=\"USGS-5158 Method\",\"USGS-5158\",IF('Hidden Summary'!G18=\"User Input Method\",\"User Input\",\"\")))))","v":""},null,{"$f":"'Hidden Summary'!I18","v":0},{"$f":"'Hidden Summary'!K18","v":0},{"$f":"'Hidden Summary'!M18","v":0},{"$f":"'Hidden Summary'!Z18","v":0},{"$f":"'Hidden Summary'!O18","v":0},null,{"$f":"'Hidden Summary'!Q18","v":0},{"$f":"'Hidden Summary'!U18","v":0},{"$f":"'Hidden Summary'!S18","v":0},{"$f":"'Hidden Summary'!X18","v":0},null,{"$f":"'Hidden Summary'!J18","v":0},{"$f":"'Hidden Summary'!L18","v":0},{"$f":"'Hidden Summary'!N18","v":0},{"$f":"'Hidden Summary'!AA18","v":0},{"$f":"'Hidden Summary'!P18","v":0},null,{"$f":"'Hidden Summary'!W18","v":0},{"$f":"'Hidden Summary'!Y18","v":0},{"$f":"'Hidden Summary'!R18","v":0},{"$f":"'Hidden Summary'!V18","v":0},{"$f":"'Hidden Summary'!T18","v":0},null,{"$error":"#DIV/0!"},{"$error":"#DIV/0!"},{"$error":"#DIV/0!"},0,0,0,{"$f":"'Hidden Summary'!AB18","v":0}]
[{"$f":"'Hidden Summary'!A19","v":0},null,{"$f":"'Hidden Summary'!D19","v":0},null,{"$f":"IF('Hidden Summary'!G19=\"Rational Method\",\"Rational\",IF('Hidden Summary'!G19=\"TR-55 Method\",\"TR-55\",IF('Hidden Summary'!G19=\"USGS-5030 Method\",\"USGS-5030\",IF('Hidden Summary'!G19=\"USGS-5158 Method\",\"USGS-5158\",IF('Hidden Summary'!G19=\"User Input Method\",\"User Input\",\"\")))))","v":""},null,{"$f":"'Hidden Summary'!I19","v":0},{"$f":"'Hidden Summary'!K19","v":0},{"$f":"'Hidden Summary'!M19","v":0},{"$f":"'Hidden Summary'!Z19","v":0},{"$f":"'Hidden Summary'!O19","v":0},null,{"$f":"'Hidden Summary'!Q19","v":0},{"$f":"'Hidden Summary'!U19","v":0},{"$f":"'Hidden Summary'!S19","v":0},{"$f":"'Hidden Summary'!X19","v":0},null,{"$f":"'Hidden Summary'!J19","v":0},{"$f":"'Hidden Summary'!L19","v":0},{"$f":"'Hidden Summary'!N19","v":0},{"$f":"'Hidden Summary'!AA19","v":0},{"$f":"'Hidden Summary'!P19","v":0},null,{"$f":"'Hidden Summary'!W19","v":0},{"$f":"'Hidden Summary'!Y19","v":0},{"$f":"'Hidden Summary'!R19","v":0},{"$f":"'Hidden Summary'!V19","v":0},{"$f":"'Hidden Summary'!T19","v":0},null,{"$error":"#DIV/0!"},{"$error":"#DIV/0!"},{"$error":"#DIV/0!"},0,0,0,{"$f":"'Hidden Summary'!AB19","v":0}]
[{"$f":"'Hidden Summary'!A20","v":0},null,{"$f":"'Hidden Summary'!D20","v":0},null,{"$f":"IF('Hidden Summary'!G20=\"Rational Method\",\"Rational\",IF('Hidden Summary'!G20=\"TR-55 Method\",\"TR-55\",IF('Hidden Summary'!G20=\"USGS-5030 Method\",\"USGS-5030\",IF('Hidden Summary'!G20=\"USGS-5158 Method\",\"USGS-5158\",IF('Hidden Summary'!G20=\"User Input Method\",\"User Input\",\"\")))))","v":""},null,{"$f":"'Hidden Summary'!I20","v":0},{"$f":"'Hidden Summary'!K20","v":0},{"$f":"'Hidden Summary'!M20","v":0},{"$f":"'Hidden Summary'!Z20","v":0},{"$f":"'Hidden Summary'!O20","v":0},null,{"$f":"'Hidden Summary'!Q20","v":0},{"$f":"'Hidden Summary'!U20","v":0},{"$f":"'Hidden Summary'!S20","v":0},{"$f":"'Hidden Summary'!X20","v":0},null,{"$f":"'Hidden Summary'!J20","v":0},{"$f":"'Hidden Summary'!L20","v":0},{"$f":"'Hidden Summary'!N20","v":0},{"$f":"'Hidden Summary'!AA20","v":0},{"$f":"'Hidden Summary'!P20","v":0},null,{"$f":"'Hidden Summary'!W20","v":0},{"$f":"'Hidden Summary'!Y20","v":0},{"$f":"'Hidden Summary'!R20","v":0},{"$f":"'Hidden Summary'!V20","v":0},{"$f":"'Hidden Summary'!T20","v":0},null,{"$error":"#DIV/0!"},{"$error":"#DIV/0!"},{"$error":"#DIV/0!"},0,0,0,{"$f":"'Hidden Summary'!AB20","v":0}]
[{"$f":"'Hidden Summary'!A21","v":0},null,{"$f":"'Hidden Summary'!D21","v":0},null,{"$f":"IF('Hidden Summary'!G21=\"Rational Method\",\"Rational\",IF('Hidden Summary'!G21=\"TR-55 Method\",\"TR-55\",IF('Hidden Summary'!G21=\"USGS-5030 Method\",\"USGS-5030\",IF('Hidden Summary'!G21=\"USGS-5158 Method\",\"USGS-5158\",IF('Hidden Summary'!G21=\"User Input Method\",\"User Input\",\"\")))))","v":""},null,{"$f":"'Hidden Summary'!I21","v":0},{"$f":"'Hidden Summary'!K21","v":0},{"$f":"'Hidden Summary'!M21","v":0},{"$f":"'Hidden Summary'!Z21","v":0},{"$f":"'Hidden Summary'!O21","v":0},null,{"$f":"'Hidden Summary'!Q21","v":0},{"$f":"'Hidden Summary'!U21","v":0},{"$f":"'Hidden Summary'!S21","v":0},{"$f":"'Hidden Summary'!X21","v":0},null,{"$f":"'Hidden Summary'!J21","v":0},{"$f":"'Hidden Summary'!L21","v":0},{"$f":"'Hidden Summary'!N21","v":0},{"$f":"'Hidden Summary'!AA21","v":0},{"$f":"'Hidden Summary'!P21","v":0},null,{"$f":"'Hidden Summary'!W21","v":0},{"$f":"'Hidden Summary'!Y21","v":0},{"$f":"'Hidden Summary'!R21","v":0},{"$f":"'Hidden Summary'!V21","v":0},{"$f":"'Hidden Summary'!T21","v":0},null,{"$error":"#DIV/0!"},{"$error":"#DIV/0!"},{"$error":"#DIV/0!"},0,0,0,{"$f":"'Hidden Summary'!AB21","v":0}]
[{"$f":"'Hidden Summary'!A22","v":0},null,{"$f":"'Hidden Summary'!D22","v":0},null,{"$f":"IF('Hidden Summary'!G22=\"Rational Method\",\"Rational\",IF('Hidden Summary'!G22=\"TR-55 Method\",\"TR-55\",IF('Hidden Summary'!G22=\"USGS-5030 Method\",\"USGS-5030\",IF('Hidden Summary'!G22=\"USGS-5158 Method\",\"USGS-5158\",IF('Hidden Summary'!G22=\"User Input Method\",\"User Input\",\"\")))))","v":""},null,{"$f":"'Hidden Summary'!I22","v":0},{"$f":"'Hidden Summary'!K22","v":0},{"$f":"'Hidden Summary'!M22","v":0},{"$f":"'Hidden Summary'!Z22","v":0},{"$f":"'Hidden Summary'!O22","v":0},null,{"$f":"'Hidden Summary'!Q22","v":0},{"$f":"'Hidden Summary'!U22","v":0},{"$f":"'Hidden Summary'!S22","v":0},{"$f":"'Hidden Summary'!X22","v":0},null,{"$f":"'Hidden Summary'!J22","v":0},{"$f":"'Hidden Summary'!L22","v":0},{"$f":"'Hidden Summary'!N22","v":0},{"$f":"'Hidden Summary'!AA22","v":0},{"$f":"'Hidden Summary'!P22","v":0},null,{"$f":"'Hidden Summary'!W22","v":0},{"$f":"'Hidden Summary'!Y22","v":0},{"$f":"'Hidden Summary'!R22","v":0},{"$f":"'Hidden Summary'!V22","v":0},{"$f":"'Hidden Summary'!T22","v":0},null,{"$error":"#DIV/0!"},{"$error":"#DIV/0!"},{"$error":"#DIV/0!"},0,0,0,{"$f":"'Hidden Summary'!AB22","v":0}]
[{"$f":"'Hidden Summary'!A23","v":0},null,{"$f":"'Hidden Summary'!D23","v":0},null,{"$f":"IF('Hidden Summary'!G23=\"Rational Method\",\"Rational\",IF('Hidden Summary'!G23=\"TR-55 Method\",\"TR-55\",IF('Hidden Summary'!G23=\"USGS-5030 Method\",\"USGS-5030\",IF('Hidden Summary'!G23=\"USGS-5158 Method\",\"USGS-5158\",IF('Hidden Summary'!G23=\"User Input Method\",\"User Input\",\"\")))))","v":""},null,{"$f":"'Hidden Summary'!I23","v":0},{"$f":"'Hidden Summary'!K23","v":0},{"$f":"'Hidden Summary'!M23","v":0},{"$f":"'Hidden Summary'!Z23","v":0},{"$f":"'Hidden Summary'!O23","v":0},null,{"$f":"'Hidden Summary'!Q23","v":0},{"$f":"'Hidden Summary'!U23","v":0},{"$f":"'Hidden Summary'!S23","v":0},{"$f":"'Hidden Summary'!X23","v":0},null,{"$f":"'Hidden Summary'!J23","v":0},{"$f":"'Hidden Summary'!L23","v":0},{"$f":"'Hidden Summary'!N23","v":0},{"$f":"'Hidden Summary'!AA23","v":0},{"$f":"'Hidden Summary'!P23","v":0},null,{"$f":"'Hidden Summary'!W23","v":0},{"$f":"'Hidden Summary'!Y23","v":0},{"$f":"'Hidden Summary'!R23","v":0},{"$f":"'Hidden Summary'!V23","v":0},{"$f":"'Hidden Summary'!T23","v":0},null,{"$error":"#DIV/0!"},{"$error":"#DIV/0!"},{"$error":"#DIV/0!"},0,0,0,{"$f":"'Hidden Summary'!AB23","v":0}]
[{"$f":"'Hidden Summary'!A24","v":0},null,{"$f":"'Hidden Summary'!D24","v":0},null,{"$f":"IF('Hidden Summary'!G24=\"Rational Method\",\"Rational\",IF('Hidden Summary'!G24=\"TR-55 Method\",\"TR-55\",IF('Hidden Summary'!G24=\"USGS-5030 Method\",\"USGS-5030\",IF('Hidden Summary'!G24=\"USGS-5158 Method\",\"USGS-5158\",IF('Hidden Summary'!G24=\"User Input Method\",\"User Input\",\"\")))))","v":""},null,{"$f":"'Hidden Summary'!I24","v":0},{"$f":"'Hidden Summary'!K24","v":0},{"$f":"'Hidden Summary'!M24","v":0},{"$f":"'Hidden Summary'!Z24","v":0},{"$f":"'Hidden Summary'!O24","v":0},null,{"$f":"'Hidden Summary'!Q24","v":0},{"$f":"'Hidden Summary'!U24","v":0},{"$f":"'Hidden Summary'!S24","v":0},{"$f":"'Hidden Summary'!X24","v":0},null,{"$f":"'Hidden Summary'!J24","v":0},{"$f":"'Hidden Summary'!L24","v":0},{"$f":"'Hidden Summary'!N24","v":0},{"$f":"'Hidden Summary'!AA24","v":0},{"$f":"'Hidden Summary'!P24","v":0},null,{"$f":"'Hidden Summary'!W24","v":0},{"$f":"'Hidden Summary'!Y24","v":0},{"$f":"'Hidden Summary'!R24","v":0},{"$f":"'Hidden Summary'!V24","v":0},{"$f":"'Hidden Summary'!T24","v":0},null,{"$error":"#DIV/0!"},{"$error":"#DIV/0!"},{"$error":"#DIV/0!"},0,0,0,{"$f":"'Hidden Summary'!AB24","v":0}]
[{"$f":"'Hidden Summary'!A25","v":0},null,{"$f":"'Hidden Summary'!D25","v":0},null,{"$f":"IF('Hidden Summary'!G25=\"Rational Method\",\"Rational\",IF('Hidden Summary'!G25=\"TR-55 Method\",\"TR-55\",IF('Hidden Summary'!G25=\"USGS-5030 Method\",\"USGS-5030\",IF('Hidden Summary'!G25=\"USGS-5158 Method\",\"USGS-5158\",IF('Hidden Summary'!G25=\"User Input Method\",\"User Input\",\"\")))))","v":""},null,{"$f":"'Hidden Summary'!I25","v":0},{"$f":"'Hidden Summary'!K25","v":0},{"$f":"'Hidden Summary'!M25","v":0},{"$f":"'Hidden Summary'!Z25","v":0},{"$f":"'Hidden Summary'!O25","v":0},null,{"$f":"'Hidden Summary'!Q25","v":0},{"$f":"'Hidden Summary'!U25","v":0},{"$f":"'Hidden Summary'!S25","v":0},{"$f":"'Hidden Summary'!X25","v":0},null,{"$f":"'Hidden Summary'!J25","v":0},{"$f":"'Hidden Summary'!L25","v":0},{"$f":"'Hidden Summary'!N25","v":0},{"$f":"'Hidden Summary'!AA25","v":0},{"$f":"'Hidden Summary'!P25","v":0},null,{"$f":"'Hidden Summary'!W25","v":0},{"$f":"'Hidden Summary'!Y25","v":0},{"$f":"'Hidden Summary'!R25","v":0},{"$f":"'Hidden Summary'!V25","v":0},{"$f":"'Hidden Summary'!T25","v":0},null,{"$error":"#DIV/0!"},{"$error":"#DIV/0!"},{"$error":"#DIV/0!"},0,0,0,{"$f":"'Hidden Summary'!AB25","v":0}]
[{"$f":"'Hidden Summary'!A26","v":0},null,{"$f":"'Hidden Summary'!D26","v":0},null,{"$f":"IF('Hidden Summary'!G26=\"Rational Method\",\"Rational\",IF('Hidden Summary'!G26=\"TR-55 Method\",\"TR-55\",IF('Hidden Summary'!G26=\"USGS-5030 Method\",\"USGS-5030\",IF('Hidden Summary'!G26=\"USGS-5158 Method\",\"USGS-5158\",IF('Hidden Summary'!G26=\"User Input Method\",\"User Input\",\"\")))))","v":""},null,{"$f":"'Hidden Summary'!I26","v":0},{"$f":"'Hidden Summary'!K26","v":0},{"$f":"'Hidden Summary'!M26","v":0},{"$f":"'Hidden Summary'!Z26","v":0},{"$f":"'Hidden Summary'!O26","v":0},null,{"$f":"'Hidden Summary'!Q26","v":0},{"$f":"'Hidden Summary'!U26","v":0},{"$f":"'Hidden Summary'!S26","v":0},{"$f":"'Hidden Summary'!X26","v":0},null,{"$f":"'Hidden Summary'!J26","v":0},{"$f":"'Hidden Summary'!L26","v":0},{"$f":"'Hidden Summary'!N26","v":0},{"$f":"'Hidden Summary'!AA26","v":0},{"$f":"'Hidden Summary'!P26","v":0},null,{"$f":"'Hidden Summary'!W26","v":0},{"$f":"'Hidden Summary'!Y26","v":0},{"$f":"'Hidden Summary'!R26","v":0},{"$f":"'Hidden Summary'!V26","v":0},{"$f":"'Hidden Summary'!T26","v":0},null,{"$error":"#DIV/0!"},{"$error":"#DIV/0!"},{"$error":"#DIV/0!"},0,0,0,{"$f":"'Hidden Summary'!AB26","v":0}]
[{"$f":"'Hidden Summary'!A27","v":0},null,{"$f":"'Hidden Summary'!D27","v":0},null,{"$f":"IF('Hidden Summary'!G27=\"Rational Method\",\"Rational\",IF('Hidden Summary'!G27=\"TR-55 Method\",\"TR-55\",IF('Hidden Summary'!G27=\"USGS-5030 Method\",\"USGS-5030\",IF('Hidden Summary'!G27=\"USGS-5158 Method\",\"USGS-5158\",IF('Hidden Summary'!G27=\"User Input Method\",\"User Input\",\"\")))))","v":""},null,{"$f":"'Hidden Summary'!I27","v":0},{"$f":"'Hidden Summary'!K27","v":0},{"$f":"'Hidden Summary'!M27","v":0},{"$f":"'Hidden Summary'!Z27","v":0},{"$f":"'Hidden Summary'!O27","v":0},null,{"$f":"'Hidden Summary'!Q27","v":0},{"$f":"'Hidden Summary'!U27","v":0},{"$f":"'Hidden Summary'!S27","v":0},{"$f":"'Hidden Summary'!X27","v":0},null,{"$f":"'Hidden Summary'!J27","v":0},{"$f":"'Hidden Summary'!L27","v":0},{"$f":"'Hidden Summary'!N27","v":0},{"$f":"'Hidden Summary'!AA27","v":0},{"$f":"'Hidden Summary'!P27","v":0},null,{"$f":"'Hidden Summary'!W27","v":0},{"$f":"'Hidden Summary'!Y27","v":0},{"$f":"'Hidden Summary'!R27","v":0},{"$f":"'Hidden Summary'!V27","v":0},{"$f":"'Hidden Summary'!T27","v":0},null,{"$error":"#DIV/0!"},{"$error":"#DIV/0!"},{"$error":"#DIV/0!"},0,0,0,{"$f":"'Hidden Summary'!AB27","v":0}]
[{"$f":"'Hidden Summary'!A28","v":0},null,{"$f":"'Hidden Summary'!D28","v":0},null,{"$f":"IF('Hidden Summary'!G28=\"Rational Method\",\"Rational\",IF('Hidden Summary'!G28=\"TR-55 Method\",\"TR-55\",IF('Hidden Summary'!G28=\"USGS-5030 Method\",\"USGS-5030\",IF('Hidden Summary'!G28=\"USGS-5158 Method\",\"USGS-5158\",IF('Hidden Summary'!G28=\"User Input Method\",\"User Input\",\"\")))))","v":""},null,{"$f":"'Hidden Summary'!I28","v":0},{"$f":"'Hidden Summary'!K28","v":0},{"$f":"'Hidden Summary'!M28","v":0},{"$f":"'Hidden Summary'!Z28","v":0},{"$f":"'Hidden Summary'!O28","v":0},null,{"$f":"'Hidden Summary'!Q28","v":0},{"$f":"'Hidden Summary'!U28","v":0},{"$f":"'Hidden Summary'!S28","v":0},{"$f":"'Hidden Summary'!X28","v":0},null,{"$f":"'Hidden Summary'!J28","v":0},{"$f":"'Hidden Summary'!L28","v":0},{"$f":"'Hidden Summary'!N28","v":0},{"$f":"'Hidden Summary'!AA28","v":0},{"$f":"'Hidden Summary'!P28","v":0},null,{"$f":"'Hidden Summary'!W28","v":0},{"$f":"'Hidden Summary'!Y28","v":0},{"$f":"'Hidden Summary'!R28","v":0},{"$f":"'Hidden Summary'!V28","v":0},{"$f":"'Hidden Summary'!T28","v":0},null,{"$error":"#DIV/0!"},{"$error":"#DIV/0!"},{"$error":"#DIV/0!"},0,0,0,{"$f":"'Hidden Summary'!AB28","v":0}]
[{"$f":"'Hidden Summary'!A29","v":0},null,{"$f":"'Hidden Summary'!D29","v":0},null,{"$f":"IF('Hidden Summary'!G29=\"Rational Method\",\"Rational\",IF('Hidden Summary'!G29=\"TR-55 Method\",\"TR-55\",IF('Hidden Summary'!G29=\"USGS-5030 Method\",\"USGS-5030\",IF('Hidden Summary'!G29=\"USGS-5158 Method\",\"USGS-5158\",IF('Hidden Summary'!G29=\"User Input Method\",\"User Input\",\"\")))))","v":""},null,{"$f":"'Hidden Summary'!I29","v":0},{"$f":"'Hidden Summary'!K29","v":0},{"$f":"'Hidden Summary'!M29","v":0},{"$f":"'Hidden Summary'!Z29","v":0},{"$f":"'Hidden Summary'!O29","v":0},null,{"$f":"'Hidden Summary'!Q29","v":0},{"$f":"'Hidden Summary'!U29","v":0},{"$f":"'Hidden Summary'!S29","v":0},{"$f":"'Hidden Summary'!X29","v":0},null,{"$f":"'Hidden Summary'!J29","v":0},{"$f":"'Hidden Summary'!L29","v":0},{"$f":"'Hidden Summary'!N29","v":0},{"$f":"'Hidden Summary'!AA29","v":0},{"$f":"'Hidden Summary'!P29","v":0},null,{"$f":"'Hidden Summary'!W29","v":0},{"$f":"'Hidden Summary'!Y29","v":0},{"$f":"'Hidden Summary'!R29","v":0},{"$f":"'Hidden Summary'!V29","v":0},{"$f":"'Hidden Summary'!T29","v":0},null,{"$error":"#DIV/0!"},{"$error":"#DIV/0!"},{"$error":"#DIV/0!"},0,0,0,{"$f":"'Hidden Summary'!AB29","v":0}]
[{"$f":"'Hidden Summary'!A30","v":0},null,{"$f":"'Hidden Summary'!D30","v":0},null,{"$f":"IF('Hidden Summary'!G30=\"Rational Method\",\"Rational\",IF('Hidden Summary'!G30=\"TR-55 Method\",\"TR-55\",IF('Hidden Summary'!G30=\"USGS-5030 Method\",\"USGS-5030\",IF('Hidden Summary'!G30=\"USGS-5158 Method\",\"USGS-5158\",IF('Hidden Summary'!G30=\"User Input Method\",\"User Input\",\"\")))))","v":""},null,{"$f":"'Hidden Summary'!I30","v":0},{"$f":"'Hidden Summary'!K30","v":0},{"$f":"'Hidden Summary'!M30","v":0},{"$f":"'Hidden Summary'!Z30","v":0},{"$f":"'Hidden Summary'!O30","v":0},null,{"$f":"'Hidden Summary'!Q30","v":0},{"$f":"'Hidden Summary'!U30","v":0},{"$f":"'Hidden Summary'!S30","v":0},{"$f":"'Hidden Summary'!X30","v":0},null,{"$f":"'Hidden Summary'!J30","v":0},{"$f":"'Hidden Summary'!L30","v":0},{"$f":"'Hidden Summary'!N30","v":0},{"$f":"'Hidden Summary'!AA30","v":0},{"$f":"'Hidden Summary'!P30","v":0},null,{"$f":"'Hidden Summary'!W30","v":0},{"$f":"'Hidden Summary'!Y30","v":0},{"$f":"'Hidden Summary'!R30","v":0},{"$f":"'Hidden Summary'!V30","v":0},{"$f":"'Hidden Summary'!T30","v":0},null,{"$error":"#DIV/0!"},{"$error":"#DIV/0!"},{"$error":"#DIV/0!"},0,0,0,{"$f":"'Hidden Summary'!AB30","v":0}]
[{"$f":"'Hidden Summary'!A31","v":0},null,{"$f":"'Hidden Summary'!D31","v":0},null,{"$f":"IF('Hidden Summary'!G31=\"Rational Method\",\"Rational\",IF('Hidden Summary'!G31=\"TR-55 Method\",\"TR-55\",IF('Hidden Summary'!G31=\"USGS-5030 Method\",\"USGS-5030\",IF('Hidden Summary'!G31=\"USGS-5158 Method\",\"USGS-5158\",IF('Hidden Summary'!G31=\"User Input Method\",\"User Input\",\"\")))))","v":""},null,{"$f":"'Hidden Summary'!I31","v":0},{"$f":"'Hidden Summary'!K31","v":0},{"$f":"'Hidden Summary'!M31","v":0},{"$f":"'Hidden Summary'!Z31","v":0},{"$f":"'Hidden Summary'!O31","v":0},null,{"$f":"'Hidden Summary'!Q31","v":0},{"$f":"'Hidden Summary'!U31","v":0},{"$f":"'Hidden Summary'!S31","v":0},{"$f":"'Hidden Summary'!X31","v":0},null,{"$f":"'Hidden Summary'!J31","v":0},{"$f":"'Hidden Summary'!L31","v":0},{"$f":"'Hidden Summary'!N31","v":0},{"$f":"'Hidden Summary'!AA31","v":0},{"$f":"'Hidden Summary'!P31","v":0},null,{"$f":"'Hidden Summary'!W31","v":0},{"$f":"'Hidden Summary'!Y31","v":0},{"$f":"'Hidden Summary'!R31","v":0},{"$f":"'Hidden Summary'!V31","v":0},{"$f":"'Hidden Summary'!T31","v":0},null,{"$error":"#DIV/0!"},{"$error":"#DIV/0!"},{"$error":"#DIV/0!"},0,0,0,{"$f":"'Hidden Summary'!AB31","v":0}]
[{"$f":"'Hidden Summary'!A32","v":0},null,{"$f":"'Hidden Summary'!D32","v":0},null,{"$f":"IF('Hidden Summary'!G32=\"Rational Method\",\"Rational\",IF('Hidden Summary'!G32=\"TR-55 Method\",\"TR-55\",IF('Hidden Summary'!G32=\"USGS-5030 Method\",\"USGS-5030\",IF('Hidden Summary'!G32=\"USGS-5158 Method\",\"USGS-5158\",IF('Hidden Summary'!G32=\"User Input Method\",\"User Input\",\"\")))))","v":""},null,{"$f":"'Hidden Summary'!I32","v":0},{"$f":"'Hidden Summary'!K32","v":0},{"$f":"'Hidden Summary'!M32","v":0},{"$f":"'Hidden Summary'!Z32","v":0},{"$f":"'Hidden Summary'!O32","v":0},null,{"$f":"'Hidden Summary'!Q32","v":0},{"$f":"'Hidden Summary'!U32","v":0},{"$f":"'Hidden Summary'!S32","v":0},{"$f":"'Hidden Summary'!X32","v":0},null,{"$f":"'Hidden Summary'!J32","v":0},{"$f":"'Hidden Summary'!L32","v":0},{"$f":"'Hidden Summary'!N32","v":0},{"$f":"'Hidden Summary'!AA32","v":0},{"$f":"'Hidden Summary'!P32","v":0},null,{"$f":"'Hidden Summary'!W32","v":0},{"$f":"'Hidden Summary'!Y32","v":0},{"$f":"'Hidden Summary'!R32","v":0},{"$f":"'Hidden Summary'!V32","v":0},{"$f":"'Hidden Summary'!T32","v":0},null,{"$error":"#DIV/0!"},{"$error":"#DIV/0!"},{"$error":"#DIV/0!"},0,0,0,{"$f":"'Hidden Summary'!AB32","v":0}]
[{"$f":"'Hidden Summary'!A33","v":0},null,{"$f":"'Hidden Summary'!D33","v":0},null,{"$f":"IF('Hidden Summary'!G33=\"Rational Method\",\"Rational\",IF('Hidden Summary'!G33=\"TR-55 Method\",\"TR-55\",IF('Hidden Summary'!G33=\"USGS-5030 Method\",\"USGS-5030\",IF('Hidden Summary'!G33=\"USGS-5158 Method\",\"USGS-5158\",IF('Hidden Summary'!G33=\"User Input Method\",\"User Input\",\"\")))))","v":""},null,{"$f":"'Hidden Summary'!I33","v":0},{"$f":"'Hidden Summary'!K33","v":0},{"$f":"'Hidden Summary'!M33","v":0},{"$f":"'Hidden Summary'!Z33","v":0},{"$f":"'Hidden Summary'!O33","v":0},null,{"$f":"'Hidden Summary'!Q33","v":0},{"$f":"'Hidden Summary'!U33","v":0},{"$f":"'Hidden Summary'!S33","v":0},{"$f":"'Hidden Summary'!X33","v":0},null,{"$f":"'Hidden Summary'!J33","v":0},{"$f":"'Hidden Summary'!L33","v":0},{"$f":"'Hidden Summary'!N33","v":0},{"$f":"'Hidden Summary'!AA33","v":0},{"$f":"'Hidden Summary'!P33","v":0},null,{"$f":"'Hidden Summary'!W33","v":0},{"$f":"'Hidden Summary'!Y33","v":0},{"$f":"'Hidden Summary'!R33","v":0},{"$f":"'Hidden Summary'!V33","v":0},{"$f":"'Hidden Summary'!T33","v":0},null,{"$error":"#DIV/0!"},{"$error":"#DIV/0!"},{"$error":"#DIV/0!"},0,0,0,{"$f":"'Hidden Summary'!AB33","v":0}]
[{"$f":"'Hidden Summary'!A34","v":0},null,{"$f":"'Hidden Summary'!D34","v":0},null,{"$f":"IF('Hidden Summary'!G34=\"Rational Method\",\"Rational\",IF('Hidden Summary'!G34=\"TR-55 Method\",\"TR-55\",IF('Hidden Summary'!G34=\"USGS-5030 Method\",\"USGS-5030\",IF('Hidden Summary'!G34=\"USGS-5158 Method\",\"USGS-5158\",IF('Hidden Summary'!G34=\"User Input Method\",\"User Input\",\"\")))))","v":""},null,{"$f":"'Hidden Summary'!I34","v":0},{"$f":"'Hidden Summary'!K34","v":0},{"$f":"'Hidden Summary'!M34","v":0},{"$f":"'Hidden Summary'!Z34","v":0},{"$f":"'Hidden Summary'!O34","v":0},null,{"$f":"'Hidden Summary'!Q34","v":0},{"$f":"'Hidden Summary'!U34","v":0},{"$f":"'Hidden Summary'!S34","v":0},{"$f":"'Hidden Summary'!X34","v":0},null,{"$f":"'Hidden Summary'!J34","v":0},{"$f":"'Hidden Summary'!L34","v":0},{"$f":"'Hidden Summary'!N34","v":0},{"$f":"'Hidden Summary'!AA34","v":0},{"$f":"'Hidden Summary'!P34","v":0},null,{"$f":"'Hidden Summary'!W34","v":0},{"$f":"'Hidden Summary'!Y34","v":0},{"$f":"'Hidden Summary'!R34","v":0},{"$f":"'Hidden Summary'!V34","v":0},{"$f":"'Hidden Summary'!T34","v":0},null,{"$error":"#DIV/0!"},{"$error":"#DIV/0!"},{"$error":"#DIV/0!"},0,0,0,{"$f":"'Hidden Summary'!AB34","v":0}]
[{"$f":"'Hidden Summary'!A35","v":0},null,{"$f":"'Hidden Summary'!D35","v":0},null,{"$f":"IF('Hidden Summary'!G35=\"Rational Method\",\"Rational\",IF('Hidden Summary'!G35=\"TR-55 Method\",\"TR-55\",IF('Hidden Summary'!G35=\"USGS-5030 Method\",\"USGS-5030\",IF('Hidden Summary'!G35=\"USGS-5158 Method\",\"USGS-5158\",IF('Hidden Summary'!G35=\"User Input Method\",\"User Input\",\"\")))))","v":""},null,{"$f":"'Hidden Summary'!I35","v":0},{"$f":"'Hidden Summary'!K35","v":0},{"$f":"'Hidden Summary'!M35","v":0},{"$f":"'Hidden Summary'!Z35","v":0},{"$f":"'Hidden Summary'!O35","v":0},null,{"$f":"'Hidden Summary'!Q35","v":0},{"$f":"'Hidden Summary'!U35","v":0},{"$f":"'Hidden Summary'!S35","v":0},{"$f":"'Hidden Summary'!X35","v":0},null,{"$f":"'Hidden Summary'!J35","v":0},{"$f":"'Hidden Summary'!L35","v":0},{"$f":"'Hidden Summary'!N35","v":0},{"$f":"'Hidden Summary'!AA35","v":0},{"$f":"'Hidden Summary'!P35","v":0},null,{"$f":"'Hidden Summary'!W35","v":0},{"$f":"'Hidden Summary'!Y35","v":0},{"$f":"'Hidden Summary'!R35","v":0},{"$f":"'Hidden Summary'!V35","v":0},{"$f":"'Hidden Summary'!T35","v":0},null,{"$error":"#DIV/0!"},{"$error":"#DIV/0!"},{"$error":"#DIV/0!"},0,0,0,{"$f":"'Hidden Summary'!AB35","v":0}]
[{"$f":"'Hidden Summary'!A36","v":0},null,{"$f":"'Hidden Summary'!D36","v":0},null,{"$f":"IF('Hidden Summary'!G36=\"Rational Method\",\"Rational\",IF('Hidden Summary'!G36=\"TR-55 Method\",\"TR-55\",IF('Hidden Summary'!G36=\"USGS-5030 Method\",\"USGS-5030\",IF('Hidden Summary'!G36=\"USGS-5158 Method\",\"USGS-5158\",IF('Hidden Summary'!G36=\"User Input Method\",\"User Input\",\"\")))))","v":""},null,{"$f":"'Hidden Summary'!I36","v":0},{"$f":"'Hidden Summary'!K36","v":0},{"$f":"'Hidden Summary'!M36","v":0},{"$f":"'Hidden Summary'!Z36","v":0},{"$f":"'Hidden Summary'!O36","v":0},null,{"$f":"'Hidden Summary'!Q36","v":0},{"$f":"'Hidden Summary'!U36","v":0},{"$f":"'Hidden Summary'!S36","v":0},{"$f":"'Hidden Summary'!X36","v":0},null,{"$f":"'Hidden Summary'!J36","v":0},{"$f":"'Hidden Summary'!L36","v":0},{"$f":"'Hidden Summary'!N36","v":0},{"$f":"'Hidden Summary'!AA36","v":0},{"$f":"'Hidden Summary'!P36","v":0},null,{"$f":"'Hidden Summary'!W36","v":0},{"$f":"'Hidden Summary'!Y36","v":0},{"$f":"'Hidden Summary'!R36","v":0},{"$f":"'Hidden Summary'!V36","v":0},{"$f":"'Hidden Summary'!T36","v":0},null,{"$error":"#DIV/0!"},{"$error":"#DIV/0!"},{"$error":"#DIV/0!"},0,0,0,{"$f":"'Hidden Summary'!AB36","v":0}]
[{"$f":"'Hidden Summary'!A37","v":0},null,{"$f":"'Hidden Summary'!D37","v":0},null,{"$f":"IF('Hidden Summary'!G37=\"Rational Method\",\"Rational\",IF('Hidden Summary'!G37=\"TR-55 Method\",\"TR-55\",IF('Hidden Summary'!G37=\"USGS-5030 Method\",\"USGS-5030\",IF('Hidden Summary'!G37=\"USGS-5158 Method\",\"USGS-5158\",IF('Hidden Summary'!G37=\"User Input Method\",\"User Input\",\"\")))))","v":""},null,{"$f":"'Hidden Summary'!I37","v":0},{"$f":"'Hidden Summary'!K37","v":0},{"$f":"'Hidden Summary'!M37","v":0},{"$f":"'Hidden Summary'!Z37","v":0},{"$f":"'Hidden Summary'!O37","v":0},null,{"$f":"'Hidden Summary'!Q37","v":0},{"$f":"'Hidden Summary'!U37","v":0},{"$f":"'Hidden Summary'!S37","v":0},{"$f":"'Hidden Summary'!X37","v":0},null,{"$f":"'Hidden Summary'!J37","v":0},{"$f":"'Hidden Summary'!L37","v":0},{"$f":"'Hidden Summary'!N37","v":0},{"$f":"'Hidden Summary'!AA37","v":0},{"$f":"'Hidden Summary'!P37","v":0},null,{"$f":"'Hidden Summary'!W37","v":0},{"$f":"'Hidden Summary'!Y37","v":0},{"$f":"'Hidden Summary'!R37","v":0},{"$f":"'Hidden Summary'!V37","v":0},{"$f":"'Hidden Summary'!T37","v":0},null,{"$error":"#DIV/0!"},{"$error":"#DIV/0!"},{"$error":"#DIV/0!"},0,0,0,{"$f":"'Hidden Summary'!AB37","v":0}]
[{"$f":"'Hidden Summary'!A38","v":0},null,{"$f":"'Hidden Summary'!D38","v":0},null,{"$f":"IF('Hidden Summary'!G38=\"Rational Method\",\"Rational\",IF('Hidden Summary'!G38=\"TR-55 Method\",\"TR-55\",IF('Hidden Summary'!G38=\"USGS-5030 Method\",\"USGS-5030\",IF('Hidden Summary'!G38=\"USGS-5158 Method\",\"USGS-5158\",IF('Hidden Summary'!G38=\"User Input Method\",\"User Input\",\"\")))))","v":""},null,{"$f":"'Hidden Summary'!I38","v":0},{"$f":"'Hidden Summary'!K38","v":0},{"$f":"'Hidden Summary'!M38","v":0},{"$f":"'Hidden Summary'!Z38","v":0},{"$f":"'Hidden Summary'!O38","v":0},null,{"$f":"'Hidden Summary'!Q38","v":0},{"$f":"'Hidden Summary'!U38","v":0},{"$f":"'Hidden Summary'!S38","v":0},{"$f":"'Hidden Summary'!X38","v":0},null,{"$f":"'Hidden Summary'!J38","v":0},{"$f":"'Hidden Summary'!L38","v":0},{"$f":"'Hidden Summary'!N38","v":0},{"$f":"'Hidden Summary'!AA38","v":0},{"$f":"'Hidden Summary'!P38","v":0},null,{"$f":"'Hidden Summary'!W38","v":0},{"$f":"'Hidden Summary'!Y38","v":0},{"$f":"'Hidden Summary'!R38","v":0},{"$f":"'Hidden Summary'!V38","v":0},{"$f":"'Hidden Summary'!T38","v":0},null,{"$error":"#DIV/0!"},{"$error":"#DIV/0!"},{"$error":"#DIV/0!"},0,0,0,{"$f":"'Hidden Summary'!AB38","v":0}]
[{"$f":"'Hidden Summary'!A39","v":0},null,{"$f":"'Hidden Summary'!D39","v":0},null,{"$f":"IF('Hidden Summary'!G39=\"Rational Method\",\"Rational\",IF('Hidden Summary'!G39=\"TR-55 Method\",\"TR-55\",IF('Hidden Summary'!G39=\"USGS-5030 Method\",\"USGS-5030\",IF('Hidden Summary'!G39=\"USGS-5158 Method\",\"USGS-5158\",IF('Hidden Summary'!G39=\"User Input Method\",\"User Input\",\"\")))))","v":""},null,{"$f":"'Hidden Summary'!I39","v":0},{"$f":"'Hidden Summary'!K39","v":0},{"$f":"'Hidden Summary'!M39","v":0},{"$f":"'Hidden Summary'!Z39","v":0},{"$f":"'Hidden Summary'!O39","v":0},null,{"$f":"'Hidden Summary'!Q39","v":0},{"$f":"'Hidden Summary'!U39","v":0},{"$f":"'Hidden Summary'!S39","v":0},{"$f":"'Hidden Summary'!X39","v":0},null,{"$f":"'Hidden Summary'!J39","v":0},{"$f":"'Hidden Summary'!L39","v":0},{"$f":"'Hidden Summary'!N39","v":0},{"$f":"'Hidden Summary'!AA39","v":0},{"$f":"'Hidden Summary'!P39","v":0},null,{"$f":"'Hidden Summary'!W39","v":0},{"$f":"'Hidden Summary'!Y39","v":0},{"$f":"'Hidden Summary'!R39","v":0},{"$f":"'Hidden Summary'!V39","v":0},{"$f":"'Hidden Summary'!T39","v":0},null,{"$error":"#DIV/0!"},{"$error":"#DIV/0!"},{"$error":"#DIV/0!"},0,0,0,{"$f":"'Hidden Summary'!AB39","v":0}]
[{"$f":"'Hidden Summary'!A40","v":0},null,{"$f":"'Hidden Summary'!D40","v":0},null,{"$f":"IF('Hidden Summary'!G40=\"Rational Method\",\"Rational\",IF('Hidden Summary'!G40=\"TR-55 Method\",\"TR-55\",IF('Hidden Summary'!G40=\"USGS-5030 Method\",\"USGS-5030\",IF('Hidden Summary'!G40=\"USGS-5158 Method\",\"USGS-5158\",IF('Hidden Summary'!G40=\"User Input Method\",\"User Input\",\"\")))))","v":""},null,{"$f":"'Hidden Summary'!I40","v":0},{"$f":"'Hidden Summary'!K40","v":0},{"$f":"'Hidden Summary'!M40","v":0},{"$f":"'Hidden Summary'!Z40","v":0},{"$f":"'Hidden Summary'!O40","v":0},null,{"$f":"'Hidden Summary'!Q40","v":0},{"$f":"'Hidden Summary'!U40","v":0},{"$f":"'Hidden Summary'!S40","v":0},{"$f":"'Hidden Summary'!X40","v":0},null,{"$f":"'Hidden Summary'!J40","v":0},{"$f":"'Hidden Summary'!L40","v":0},{"$f":"'Hidden Summary'!N40","v":0},{"$f":"'Hidden Summary'!AA40","v":0},{"$f":"'Hidden Summary'!P40","v":0},null,{"$f":"'Hidden Summary'!W40","v":0},{"$f":"'Hidden Summary'!Y40","v":0},{"$f":"'Hidden Summary'!R40","v":0},{"$f":"'Hidden Summary'!V40","v":0},{"$f":"'Hidden Summary'!T40","v":0},null,{"$error":"#DIV/0!"},{"$error":"#DIV/0!"},{"$error":"#DIV/0!"},0,0,0,{"$f":"'Hidden Summary'!AB40","v":0}]
[{"$f":"'Hidden Summary'!A41","v":0},null,{"$f":"'Hidden Summary'!D41","v":0},null,{"$f":"IF('Hidden Summary'!G41=\"Rational Method\",\"Rational\",IF('Hidden Summary'!G41=\"TR-55 Method\",\"TR-55\",IF('Hidden Summary'!G41=\"USGS-5030 Method\",\"USGS-5030\",IF('Hidden Summary'!G41=\"USGS-5158 Method\",\"USGS-5158\",IF('Hidden Summary'!G41=\"User Input Method\",\"User Input\",\"\")))))","v":""},null,{"$f":"'Hidden Summary'!I41","v":0},{"$f":"'Hidden Summary'!K41","v":0},{"$f":"'Hidden Summary'!M41","v":0},{"$f":"'Hidden Summary'!Z41","v":0},{"$f":"'Hidden Summary'!O41","v":0},null,{"$f":"'Hidden Summary'!Q41","v":0},{"$f":"'Hidden Summary'!U41","v":0},{"$f":"'Hidden Summary'!S41","v":0},{"$f":"'Hidden Summary'!X41","v":0},null,{"$f":"'Hidden Summary'!J41","v":0},{"$f":"'Hidden Summary'!L41","v":0},{"$f":"'Hidden Summary'!N41","v":0},{"$f":"'Hidden Summary'!AA41","v":0},{"$f":"'Hidden Summary'!P41","v":0},null,{"$f":"'Hidden Summary'!W41","v":0},{"$f":"'Hidden Summary'!Y41","v":0},{"$f":"'Hidden Summary'!R41","v":0},{"$f":"'Hidden Summary'!V41","v":0},{"$f":"'Hidden Summary'!T41","v":0},null,{"$error":"#DIV/0!"},{"$error":"#DIV/0!"},{"$error":"#DIV/0!"},0,0,0,{"$f":"'Hidden Summary'!AB41","v":0}]
[{"$f":"'Hidden Summary'!A42","v":0},null,{"$f":"'Hidden Summary'!D42","v":0},null,{"$f":"IF('Hidden Summary'!G42=\"Rational Method\",\"Rational\",IF('Hidden Summary'!G42=\"TR-55 Method\",\"TR-55\",IF('Hidden Summary'!G42=\"USGS-5030 Method\",\"USGS-5030\",IF('Hidden Summary'!G42=\"USGS-5158 Method\",\"USGS-5158\",IF('Hidden Summary'!G42=\"User Input Method\",\"User Input\",\"\")))))","v":""},null,{"$f":"'Hidden Summary'!I42","v":0},{"$f":"'Hidden Summary'!K42","v":0},{"$f":"'Hidden Summary'!M42","v":0},{"$f":"'Hidden Summary'!Z42","v":0},{"$f":"'Hidden Summary'!O42","v":0},null,{"$f":"'Hidden Summary'!Q42","v":0},{"$f":"'Hidden Summary'!U42","v":0},{"$f":"'Hidden Summary'!S42","v":0},{"$f":"'Hidden Summary'!X42","v":0},null,{"$f":"'Hidden Summary'!J42","v":0},{"$f":"'Hidden Summary'!L42","v":0},{"$f":"'Hidden Summary'!N42","v":0},{"$f":"'Hidden Summary'!AA42","v":0},{"$f":"'Hidden Summary'!P42","v":0},null,{"$f":"'Hidden Summary'!W42","v":0},{"$f":"'Hidden Summary'!Y42","v":0},{"$f":"'Hidden Summary'!R42","v":0},{"$f":"'Hidden Summary'!V42","v":0},{"$f":"'Hidden Summary'!T42","v":0},null,{"$error":"#DIV/0!"},{"$error":"#DIV/0!"},{"$error":"#DIV/0!"},0,0,0,{"$f":"'Hidden Summary'!AB42","v":0}]
[{"$f":"'Hidden Summary'!A43","v":0},null,{"$f":"'Hidden Summary'!D43","v":0},null,{"$f":"IF('Hidden Summary'!G43=\"Rational Method\",\"Rational\",IF('Hidden Summary'!G43=\"TR-55 Method\",\"TR-55\",IF('Hidden Summary'!G43=\"USGS-5030 Method\",\"USGS-5030\",IF('Hidden Summary'!G43=\"USGS-5158 Method\",\"USGS-5158\",IF('Hidden Summary'!G43=\"User Input Method\",\"User Input\",\"\")))))","v":""},null,{"$f":"'Hidden Summary'!I43","v":0},{"$f":"'Hidden Summary'!K43","v":0},{"$f":"'Hidden Summary'!M43","v":0},{"$f":"'Hidden Summary'!Z43","v":0},{"$f":"'Hidden Summary'!O43","v":0},null,{"$f":"'Hidden Summary'!Q43","v":0},{"$f":"'Hidden Summary'!U43","v":0},{"$f":"'Hidden Summary'!S43","v":0},{"$f":"'Hidden Summary'!X43","v":0},null,{"$f":"'Hidden Summary'!J43","v":0},{"$f":"'Hidden Summary'!L43","v":0},{"$f":"'Hidden Summary'!N43","v":0},{"$f":"'Hidden Summary'!AA43","v":0},{"$f":"'Hidden Summary'!P43","v":0},null,{"$f":"'Hidden Summary'!W43","v":0},{"$f":"'Hidden Summary'!Y43","v":0},{"$f":"'Hidden Summary'!R43","v":0},{"$f":"'Hidden Summary'!V43","v":0},{"$f":"'Hidden Summary'!T43","v":0},null,{"$error":"#DIV/0!"},{"$error":"#DIV/0!"},{"$error":"#DIV/0!"},0,0,0,{"$f":"'Hidden Summary'!AB43","v":0}]
[{"$f":"'Hidden Summary'!A44","v":0},null,{"$f":"'Hidden Summary'!D44","v":0},null,{"$f":"IF('Hidden Summary'!G44=\"Rational Method\",\"Rational\",IF('Hidden Summary'!G44=\"TR-55 Method\",\"TR-55\",IF('Hidden Summary'!G44=\"USGS-5030 Method\",\"USGS-5030\",IF('Hidden Summary'!G44=\"USGS-5158 Method\",\"USGS-5158\",IF('Hidden Summary'!G44=\"User Input Method\",\"User Input\",\"\")))))","v":""},null,{"$f":"'Hidden Summary'!I44","v":0},{"$f":"'Hidden Summary'!K44","v":0},{"$f":"'Hidden Summary'!M44","v":0},{"$f":"'Hidden Summary'!Z44","v":0},{"$f":"'Hidden Summary'!O44","v":0},null,{"$f":"'Hidden Summary'!Q44","v":0},{"$f":"'Hidden Summary'!U44","v":0},{"$f":"'Hidden Summary'!S44","v":0},{"$f":"'Hidden Summary'!X44","v":0},null,{"$f":"'Hidden Summary'!J44","v":0},{"$f":"'Hidden Summary'!L44","v":0},{"$f":"'Hidden Summary'!N44","v":0},{"$f":"'Hidden Summary'!AA44","v":0},{"$f":"'Hidden Summary'!P44","v":0},null,{"$f":"'Hidden Summary'!W44","v":0},{"$f":"'Hidden Summary'!Y44","v":0},{"$f":"'Hidden Summary'!R44","v":0},{"$f":"'Hidden Summary'!V44","v":0},{"$f":"'Hidden Summary'!T44","v":0},null,{"$error":"#DIV/0!"},{"$error":"#DIV/0!"},{"$error":"#DIV/0!"},0,0,0,{"$f":"'Hidden Summary'!AB44","v":0}]
[{"$f":"'Hidden Summary'!A45","v":0},null,{"$f":"'Hidden Summary'!D45","v":0},null,{"$f":"IF('Hidden Summary'!G45=\"Rational Method\",\"Rational\",IF('Hidden Summary'!G45=\"TR-55 Method\",\"TR-55\",IF('Hidden Summary'!G45=\"USGS-5030 Method\",\"USGS-5030\",IF('Hidden Summary'!G45=\"USGS-5158 Method\",\"USGS-5158\",IF('Hidden Summary'!G45=\"User Input Method\",\"User Input\",\"\")))))","v":""},null,{"$f":"'Hidden Summary'!I45","v":0},{"$f":"'Hidden Summary'!K45","v":0},{"$f":"'Hidden Summary'!M45","v":0},{"$f":"'Hidden Summary'!Z45","v":0},{"$f":"'Hidden Summary'!O45","v":0},null,{"$f":"'Hidden Summary'!Q45","v":0},{"$f":"'Hidden Summary'!U45","v":0},{"$f":"'Hidden Summary'!S45","v":0},{"$f":"'Hidden Summary'!X45","v":0},null,{"$f":"'Hidden Summary'!J45","v":0},{"$f":"'Hidden Summary'!L45","v":0},{"$f":"'Hidden Summary'!N45","v":0},{"$f":"'Hidden Summary'!AA45","v":0},{"$f":"'Hidden Summary'!P45","v":0},null,{"$f":"'Hidden Summary'!W45","v":0},{"$f":"'Hidden Summary'!Y45","v":0},{"$f":"'Hidden Summary'!R45","v":0},{"$f":"'Hidden Summary'!V45","v":0},{"$f":"'Hidden Summary'!T45","v":0},null,{"$error":"#DIV/0!"},{"$error":"#DIV/0!"},{"$error":"#DIV/0!"},0,0,0,{"$f":"'Hidden Summary'!AB45","v":0}]
[{"$f":"'Hidden Summary'!A46","v":0},null,{"$f":"'Hidden Summary'!D46","v":0},null,{"$f":"IF('Hidden Summary'!G46=\"Rational Method\",\"Rational\",IF('Hidden Summary'!G46=\"TR-55 Method\",\"TR-55\",IF('Hidden Summary'!G46=\"USGS-5030 Method\",\"USGS-5030\",IF('Hidden Summary'!G46=\"USGS-5158 Method\",\"USGS-5158\",IF('Hidden Summary'!G46=\"User Input Method\",\"User Input\",\"\")))))","v":""},null,{"$f":"'Hidden Summary'!I46","v":0},{"$f":"'Hidden Summary'!K46","v":0},{"$f":"'Hidden Summary'!M46","v":0},{"$f":"'Hidden Summary'!Z46","v":0},{"$f":"'Hidden Summary'!O46","v":0},null,{"$f":"'Hidden Summary'!Q46","v":0},{"$f":"'Hidden Summary'!U46","v":0},{"$f":"'Hidden Summary'!S46","v":0},{"$f":"'Hidden Summary'!X46","v":0},null,{"$f":"'Hidden Summary'!J46","v":0},{"$f":"'Hidden Summary'!L46","v":0},{"$f":"'Hidden Summary'!N46","v":0},{"$f":"'Hidden Summary'!AA46","v":0},{"$f":"'Hidden Summary'!P46","v":0},null,{"$f":"'Hidden Summary'!W46","v":0},{"$f":"'Hidden Summary'!Y46","v":0},{"$f":"'Hidden Summary'!R46","v":0},{"$f":"'Hidden Summary'!V46","v":0},{"$f":"'Hidden Summary'!T46","v":0},null,{"$error":"#DIV/0!"},{"$error":"#DIV/0!"},{"$error":"#DIV/0!"},0,0,0,{"$f":"'Hidden Summary'!AB46","v":0}]
[{"$f":"'Hidden Summary'!A47","v":0},null,{"$f":"'Hidden Summary'!D47","v":0},null,{"$f":"IF('Hidden Summary'!G47=\"Rational Method\",\"Rational\",IF('Hidden Summary'!G47=\"TR-55 Method\",\"TR-55\",IF('Hidden Summary'!G47=\"USGS-5030 Method\",\"USGS-5030\",IF('Hidden Summary'!G47=\"USGS-5158 Method\",\"USGS-5158\",IF('Hidden Summary'!G47=\"User Input Method\",\"User Input\",\"\")))))","v":""},null,{"$f":"'Hidden Summary'!I47","v":0},{"$f":"'Hidden Summary'!K47","v":0},{"$f":"'Hidden Summary'!M47","v":0},{"$f":"'Hidden Summary'!Z47","v":0},{"$f":"'Hidden Summary'!O47","v":0},null,{"$f":"'Hidden Summary'!Q47","v":0},{"$f":"'Hidden Summary'!U47","v":0},{"$f":"'Hidden Summary'!S47","v":0},{"$f":"'Hidden Summary'!X47","v":0},null,{"$f":"'Hidden Summary'!J47","v":0},{"$f":"'Hidden Summary'!L47","v":0},{"$f":"'Hidden Summary'!N47","v":0},{"$f":"'Hidden Summary'!AA47","v":0},{"$f":"'Hidden Summary'!P47","v":0},null,{"$f":"'Hidden Summary'!W47","v":0},{"$f":"'Hidden Summary'!Y47","v":0},{"$f":"'Hidden Summary'!R47","v":0},{"$f":"'Hidden Summary'!V47","v":0},{"$f":"'Hidden Summary'!T47","v":0},null,{"$error":"#DIV/0!"},{"$error":"#DIV/0!"},{"$error":"#DIV/0!"},0,0,0,{"$f":"'Hidden Summary'!AB47","v":0}]
[{"$f":"'Hidden Summary'!A48","v":0},null,{"$f":"'Hidden Summary'!D48","v":0},null,{"$f":"IF('Hidden Summary'!G48=\"Rational Method\",\"Rational\",IF('Hidden Summary'!G48=\"TR-55 Method\",\"TR-55\",IF('Hidden Summary'!G48=\"USGS-5030 Method\",\"USGS-5030\",IF('Hidden Summary'!G48=\"USGS-5158 Method\",\"USGS-5158\",IF('Hidden Summary'!G48=\"User Input Method\",\"User Input\",\"\")))))","v":""},null,{"$f":"'Hidden Summary'!I48","v":0},{"$f":"'Hidden Summary'!K48","v":0},{"$f":"'Hidden Summary'!M48","v":0},{"$f":"'Hidden Summary'!Z48","v":0},{"$f":"'Hidden Summary'!O48","v":0},null,{"$f":"'Hidden Summary'!Q48","v":0},{"$f":"'Hidden Summary'!U48","v":0},{"$f":"'Hidden Summary'!S48","v":0},{"$f":"'Hidden Summary'!X48","v":0},null,{"$f":"'Hidden Summary'!J48","v":0},{"$f":"'Hidden Summary'!L48","v":0},{"$f":"'Hidden Summary'!N48","v":0},{"$f":"'Hidden Summary'!AA48","v":0},{"$f":"'Hidden Summary'!P48","v":0},null,{"$f":"'Hidden Summary'!W48","v":0},{"$f":"'Hidden Summary'!Y48","v":0},{"$f":"'Hidden Summary'!R48","v":0},{"$f":"'Hidden Summary'!V48","v":0},{"$f":"'Hidden Summary'!T48","v":0},null,{"$error":"#DIV/0!"},{"$error":"#DIV/0!"},{"$error":"#DIV/0!"},0,0,0,{"$f":"'Hidden Summary'!AB48","v":0}]
[{"$f":"'Hidden Summary'!A49","v":0},null,{"$f":"'Hidden Summary'!D49","v":0},null,{"$f":"IF('Hidden Summary'!G49=\"Rational Method\",\"Rational\",IF('Hidden Summary'!G49=\"TR-55 Method\",\"TR-55\",IF('Hidden Summary'!G49=\"USGS-5030 Method\",\"USGS-5030\",IF('Hidden Summary'!G49=\"USGS-5158 Method\",\"USGS-5158\",IF('Hidden Summary'!G49=\"User Input Method\",\"User Input\",\"\")))))","v":""},null,{"$f":"'Hidden Summary'!I49","v":0},{"$f":"'Hidden Summary'!K49","v":0},{"$f":"'Hidden Summary'!M49","v":0},{"$f":"'Hidden Summary'!Z49","v":0},{"$f":"'Hidden Summary'!O49","v":0},null,{"$f":"'Hidden Summary'!Q49","v":0},{"$f":"'Hidden Summary'!U49","v":0},{"$f":"'Hidden Summary'!S49","v":0},{"$f":"'Hidden Summary'!X49","v":0},null,{"$f":"'Hidden Summary'!J49","v":0},{"$f":"'Hidden Summary'!L49","v":0},{"$f":"'Hidden Summary'!N49","v":0},{"$f":"'Hidden Summary'!AA49","v":0},{"$f":"'Hidden Summary'!P49","v":0},null,{"$f":"'Hidden Summary'!W49","v":0},{"$f":"'Hidden Summary'!Y49","v":0},{"$f":"'Hidden Summary'!R49","v":0},{"$f":"'Hidden Summary'!V49","v":0},{"$f":"'Hidden Summary'!T49","v":0},null,{"$error":"#DIV/0!"},{"$error":"#DIV/0!"},{"$error":"#DIV/0!"},0,0,0,{"$f":"'Hidden Summary'!AB49","v":0}]
[{"$f":"'Hidden Summary'!A50","v":0},null,{"$f":"'Hidden Summary'!D50","v":0},null,{"$f":"IF('Hidden Summary'!G50=\"Rational Method\",\"Rational\",IF('Hidden Summary'!G50=\"TR-55 Method\",\"TR-55\",IF('Hidden Summary'!G50=\"USGS-5030 Method\",\"USGS-5030\",IF('Hidden Summary'!G50=\"USGS-5158 Method\",\"USGS-5158\",IF('Hidden Summary'!G50=\"User Input Method\",\"User Input\",\"\")))))","v":""},null,{"$f":"'Hidden Summary'!I50","v":0},{"$f":"'Hidden Summary'!K50","v":0},{"$f":"'Hidden Summary'!M50","v":0},{"$f":"'Hidden Summary'!Z50","v":0},{"$f":"'Hidden Summary'!O50","v":0},null,{"$f":"'Hidden Summary'!Q50","v":0},{"$f":"'Hidden Summary'!U50","v":0},{"$f":"'Hidden Summary'!S50","v":0},{"$f":"'Hidden Summary'!X50","v":0},null,{"$f":"'Hidden Summary'!J50","v":0},{"$f":"'Hidden Summary'!L50","v":0},{"$f":"'Hidden Summary'!N50","v":0},{"$f":"'Hidden Summary'!AA50","v":0},{"$f":"'Hidden Summary'!P50","v":0},null,{"$f":"'Hidden Summary'!W50","v":0},{"$f":"'Hidden Summary'!Y50","v":0},{"$f":"'Hidden Summary'!R50","v":0},{"$f":"'Hidden Summary'!V50","v":0},{"$f":"'Hidden Summary'!T50","v":0},null,{"$error":"#DIV/0!"},{"$error":"#DIV/0!"},{"$error":"#DIV/0!"},0,0,0,{"$f":"'Hidden Summary'!AB50","v":0}]
[{"$f":"'Hidden Summary'!A51","v":0},null,{"$f":"'Hidden Summary'!D51","v":0},null,{"$f":"IF('Hidden Summary'!G51=\"Rational Method\",\"Rational\",IF('Hidden Summary'!G51=\"TR-55 Method\",\"TR-55\",IF('Hidden Summary'!G51=\"USGS-5030 Method\",\"USGS-5030\",IF('Hidden Summary'!G51=\"USGS-5158 Method\",\"USGS-5158\",IF('Hidden Summary'!G51=\"User Input Method\",\"User Input\",\"\")))))","v":""},null,{"$f":"'Hidden Summary'!I51","v":0},{"$f":"'Hidden Summary'!K51","v":0},{"$f":"'Hidden Summary'!M51","v":0},{"$f":"'Hidden Summary'!Z51","v":0},{"$f":"'Hidden Summary'!O51","v":0},null,{"$f":"'Hidden Summary'!Q51","v":0},{"$f":"'Hidden Summary'!U51","v":0},{"$f":"'Hidden Summary'!S51","v":0},{"$f":"'Hidden Summary'!X51","v":0},null,{"$f":"'Hidden Summary'!J51","v":0},{"$f":"'Hidden Summary'!L51","v":0},{"$f":"'Hidden Summary'!N51","v":0},{"$f":"'Hidden Summary'!AA51","v":0},{"$f":"'Hidden Summary'!P51","v":0},null,{"$f":"'Hidden Summary'!W51","v":0},{"$f":"'Hidden Summary'!Y51","v":0},{"$f":"'Hidden Summary'!R51","v":0},{"$f":"'Hidden Summary'!V51","v":0},{"$f":"'Hidden Summary'!T51","v":0},null,{"$error":"#DIV/0!"},{"$error":"#DIV/0!"},{"$error":"#DIV/0!"},0,0,0,{"$f":"'Hidden Summary'!AB51","v":0}]
[{"$f":"'Hidden Summary'!A52","v":0},null,{"$f":"'Hidden Summary'!D52","v":0},null,{"$f":"IF('Hidden Summary'!G52=\"Rational Method\",\"Rational\",IF('Hidden Summary'!G52=\"TR-55 Method\",\"TR-55\",IF('Hidden Summary'!G52=\"USGS-5030 Method\",\"USGS-5030\",IF('Hidden Summary'!G52=\"USGS-5158 Method\",\"USGS-5158\",IF('Hidden Summary'!G52=\"User Input Method\",\"User Input\",\"\")))))","v":""},null,{"$f":"'Hidden Summary'!I52","v":0},{"$f":"'Hidden Summary'!K52","v":0},{"$f":"'Hidden Summary'!M52","v":0},{"$f":"'Hidden Summary'!Z52","v":0},{"$f":"'Hidden Summary'!O52","v":0},null,{"$f":"'Hidden Summary'!Q52","v":0},{"$f":"'Hidden Summary'!U52","v":0},{"$f":"'Hidden Summary'!S52","v":0},{"$f":"'Hidden Summary'!X52","v":0},null,{"$f":"'Hidden Summary'!J52","v":0},{"$f":"'Hidden Summary'!L52","v":0},{"$f":"'Hidden Summary'!N52","v":0},{"$f":"'Hidden Summary'!AA52","v":0},{"$f":"'Hidden Summary'!P52","v":0},null,{"$f":"'Hidden Summary'!W52","v":0},{"$f":"'Hidden Summary'!Y52","v":0},{"$f":"'Hidden Summary'!R52","v":0},{"$f":"'Hidden Summary'!V52","v":0},{"$f":"'Hidden Summary'!T52","v":0},null,{"$error":"#DIV/0!"},{"$error":"#DIV/0!"},{"$error":"#DIV/0!"},0,0,0,{"$f":"'Hidden Summary'!AB52","v":0}]
[{"$f":"'Hidden Summary'!A53","v":0},null,{"$f":"'Hidden Summary'!D53","v":0},null,{"$f":"IF('Hidden Summary'!G53=\"Rational Method\",\"Rational\",IF('Hidden Summary'!G53=\"TR-55 Method\",\"TR-55\",IF('Hidden Summary'!G53=\"USGS-5030 Method\",\"USGS-5030\",IF('Hidden Summary'!G53=\"USGS-5158 Method\",\"USGS-5158\",IF('Hidden Summary'!G53=\"User Input Method\",\"User Input\",\"\")))))","v":""},null,{"$f":"'Hidden Summary'!I53","v":0},{"$f":"'Hidden Summary'!K53","v":0},{"$f":"'Hidden Summary'!M53","v":0},{"$f":"'Hidden Summary'!Z53","v":0},{"$f":"'Hidden Summary'!O53","v":0},null,{"$f":"'Hidden Summary'!Q53","v":0},{"$f":"'Hidden Summary'!U53","v":0},{"$f":"'Hidden Summary'!S53","v":0},{"$f":"'Hidden Summary'!X53","v":0},null,{"$f":"'Hidden Summary'!J53","v":0},{"$f":"'Hidden Summary'!L53","v":0},{"$f":"'Hidden Summary'!N53","v":0},{"$f":"'Hidden Summary'!AA53","v":0},{"$f":"'Hidden Summary'!P53","v":0},null,{"$f":"'Hidden Summary'!W53","v":0},{"$f":"'Hidden Summary'!Y53","v":0},{"$f":"'Hidden Summary'!R53","v":0},{"$f":"'Hidden Summary'!V53","v":0},{"$f":"'Hidden Summary'!T53","v":0},null,{"$error":"#DIV/0!"},{"$error":"#DIV/0!"},{"$error":"#DIV/0!"},0,0,0,{"$f":"'Hidden Summary'!AB53","v":0}]
[{"$f":"'Hidden Summary'!A54","v":0},null,{"$f":"'Hidden Summary'!D54","v":0},null,{"$f":"IF('Hidden Summary'!G54=\"Rational Method\",\"Rational\",IF('Hidden Summary'!G54=\"TR-55 Method\",\"TR-55\",IF('Hidden Summary'!G54=\"USGS-5030 Method\",\"USGS-5030\",IF('Hidden Summary'!G54=\"USGS-5158 Method\",\"USGS-5158\",IF('Hidden Summary'!G54=\"User Input Method\",\"User Input\",\"\")))))","v":""},null,{"$f":"'Hidden Summary'!I54","v":0},{"$f":"'Hidden Summary'!K54","v":0},{"$f":"'Hidden Summary'!M54","v":0},{"$f":"'Hidden Summary'!Z54","v":0},{"$f":"'Hidden Summary'!O54","v":0},null,{"$f":"'Hidden Summary'!Q54","v":0},{"$f":"'Hidden Summary'!U54","v":0},{"$f":"'Hidden Summary'!S54","v":0},{"$f":"'Hidden Summary'!X54","v":0},null,{"$f":"'Hidden Summary'!J54","v":0},{"$f":"'Hidden Summary'!L54","v":0},{"$f":"'Hidden Summary'!N54","v":0},{"$f":"'Hidden Summary'!AA54","v":0},{"$f":"'Hidden Summary'!P54","v":0},null,{"$f":"'Hidden Summary'!W54","v":0},{"$f":"'Hidden Summary'!Y54","v":0},{"$f":"'Hidden Summary'!R54","v":0},{"$f":"'Hidden Summary'!V54","v":0},{"$f":"'Hidden Summary'!T54","v":0},null,{"$error":"#DIV/0!"},{"$error":"#DIV/0!"},{"$error":"#DIV/0!"},0,0,0,{"$f":"'Hidden Summary'!AB54","v":0}]
[{"$f":"'Hidden Summary'!A55","v":0},null,{"$f":"'Hidden Summary'!D55","v":0},null,{"$f":"IF('Hidden Summary'!G55=\"Rational Method\",\"Rational\",IF('Hidden Summary'!G55=\"TR-55 Method\",\"TR-55\",IF('Hidden Summary'!G55=\"USGS-5030 Method\",\"USGS-5030\",IF('Hidden Summary'!G55=\"USGS-5158 Method\",\"USGS-5158\",IF('Hidden Summary'!G55=\"User Input Method\",\"User Input\",\"\")))))","v":""},null,{"$f":"'Hidden Summary'!I55","v":0},{"$f":"'Hidden Summary'!K55","v":0},{"$f":"'Hidden Summary'!M55","v":0},{"$f":"'Hidden Summary'!Z55","v":0},{"$f":"'Hidden Summary'!O55","v":0},null,{"$f":"'Hidden Summary'!Q55","v":0},{"$f":"'Hidden Summary'!U55","v":0},{"$f":"'Hidden Summary'!S55","v":0},{"$f":"'Hidden Summary'!X55","v":0},null,{"$f":"'Hidden Summary'!J55","v":0},{"$f":"'Hidden Summary'!L55","v":0},{"$f":"'Hidden Summary'!N55","v":0},{"$f":"'Hidden Summary'!AA55","v":0},{"$f":"'Hidden Summary'!P55","v":0},null,{"$f":"'Hidden Summary'!W55","v":0},{"$f":"'Hidden Summary'!Y55","v":0},{"$f":"'Hidden Summary'!R55","v":0},{"$f":"'Hidden Summary'!V55","v":0},{"$f":"'Hidden Summary'!T55","v":0},null,{"$error":"#DIV/0!"},{"$error":"#DIV/0!"},{"$error":"#DIV/0!"},0,0,0,{"$f":"'Hidden Summary'!AB55","v":0}]
[{"$f":"'Hidden Summary'!A56","v":0},null,{"$f":"'Hidden Summary'!D56","v":0},null,{"$f":"IF('Hidden Summary'!G56=\"Rational Method\",\"Rational\",IF('Hidden Summary'!G56=\"TR-55 Method\",\"TR-55\",IF('Hidden Summary'!G56=\"USGS-5030 Method\",\"USGS-5030\",IF('Hidden Summary'!G56=\"USGS-5158 Method\",\"USGS-5158\",IF('Hidden Summary'!G56=\"User Input Method\",\"User Input\",\"\")))))","v":""},null,{"$f":"'Hidden Summary'!I56","v":0},{"$f":"'Hidden Summary'!K56","v":0},{"$f":"'Hidden Summary'!M56","v":0},{"$f":"'Hidden Summary'!Z56","v":0},{"$f":"'Hidden Summary'!O56","v":0},null,{"$f":"'Hidden Summary'!Q56","v":0},{"$f":"'Hidden Summary'!U56","v":0},{"$f":"'Hidden Summary'!S56","v":0},{"$f":"'Hidden Summary'!X56","v":0},null,{"$f":"'Hidden Summary'!J56","v":0},{"$f":"'Hidden Summary'!L56","v":0},{"$f":"'Hidden Summary'!N56","v":0},{"$f":"'Hidden Summary'!AA56","v":0},{"$f":"'Hidden Summary'!P56","v":0},null,{"$f":"'Hidden Summary'!W56","v":0},{"$f":"'Hidden Summary'!Y56","v":0},{"$f":"'Hidden Summary'!R56","v":0},{"$f":"'Hidden Summary'!V56","v":0},{"$f":"'Hidden Summary'!T56","v":0},null,{"$error":"#DIV/0!"},{"$error":"#DIV/0!"},{"$error":"#DIV/0!"},0,0,0,{"$f":"'Hidden Summary'!AB56","v":0}]
[{"$f":"'Hidden Summary'!A57","v":0},null,{"$f":"'Hidden Summary'!D57","v":0},null,{"$f":"IF('Hidden Summary'!G57=\"Rational Method\",\"Rational\",IF('Hidden Summary'!G57=\"TR-55 Method\",\"TR-55\",IF('Hidden Summary'!G57=\"USGS-5030 Method\",\"USGS-5030\",IF('Hidden Summary'!G57=\"USGS-5158 Method\",\"USGS-5158\",IF('Hidden Summary'!G57=\"User Input Method\",\"User Input\",\"\")))))","v":""},null,{"$f":"'Hidden Summary'!I57","v":0},{"$f":"'Hidden Summary'!K57","v":0},{"$f":"'Hidden Summary'!M57","v":0},{"$f":"'Hidden Summary'!Z57","v":0},{"$f":"'Hidden Summary'!O57","v":0},null,{"$f":"'Hidden Summary'!Q57","v":0},{"$f":"'Hidden Summary'!U57","v":0},{"$f":"'Hidden Summary'!S57","v":0},{"$f":"'Hidden Summary'!X57","v":0},null,{"$f":"'Hidden Summary'!J57","v":0},{"$f":"'Hidden Summary'!L57","v":0},{"$f":"'Hidden Summary'!N57","v":0},{"$f":"'Hidden Summary'!AA57","v":0},{"$f":"'Hidden Summary'!P57","v":0},null,{"$f":"'Hidden Summary'!W57","v":0},{"$f":"'Hidden Summary'!Y57","v":0},{"$f":"'Hidden Summary'!R57","v":0},{"$f":"'Hidden Summary'!V57","v":0},{"$f":"'Hidden Summary'!T57","v":0},null,{"$error":"#DIV/0!"},{"$error":"#DIV/0!"},{"$error":"#DIV/0!"},0,0,0,{"$f":"'Hidden Summary'!AB57","v":0}]
[{"$f":"'Hidden Summary'!A58","v":0},null,{"$f":"'Hidden Summary'!D58","v":0},null,{"$f":"IF('Hidden Summary'!G58=\"Rational Method\",\"Rational\",IF('Hidden Summary'!G58=\"TR-55 Method\",\"TR-55\",IF('Hidden Summary'!G58=\"USGS-5030 Method\",\"USGS-5030\",IF('Hidden Summary'!G58=\"USGS-5158 Method\",\"USGS-5158\",IF('Hidden Summary'!G58=\"User Input Method\",\"User Input\",\"\")))))","v":""},null,{"$f":"'Hidden Summary'!I58","v":0},{"$f":"'Hidden Summary'!K58","v":0},{"$f":"'Hidden Summary'!M58","v":0},{"$f":"'Hidden Summary'!Z58","v":0},{"$f":"'Hidden Summary'!O58","v":0},null,{"$f":"'Hidden Summary'!Q58","v":0},{"$f":"'Hidden Summary'!U58","v":0},{"$f":"'Hidden Summary'!S58","v":0},{"$f":"'Hidden Summary'!X58","v":0},null,{"$f":"'Hidden Summary'!J58","v":0},{"$f":"'Hidden Summary'!L58","v":0},{"$f":"'Hidden Summary'!N58","v":0},{"$f":"'Hidden Summary'!AA58","v":0},{"$f":"'Hidden Summary'!P58","v":0},null,{"$f":"'Hidden Summary'!W58","v":0},{"$f":"'Hidden Summary'!Y58","v":0},{"$f":"'Hidden Summary'!R58","v":0},{"$f":"'Hidden Summary'!V58","v":0},{"$f":"'Hidden Summary'!T58","v":0},null,{"$error":"#DIV/0!"},{"$error":"#DIV/0!"},{"$error":"#DIV/0!"},0,0,0,{"$f":"'Hidden Summary'!AB58","v":0}]
[{"$f":"'Hidden Summary'!A59","v":0},null,{"$f":"'Hidden Summary'!D59","v":0},null,{"$f":"IF('Hidden Summary'!G59=\"Rational Method\",\"Rational\",IF('Hidden Summary'!G59=\"TR-55 Method\",\"TR-55\",IF('Hidden Summary'!G59=\"USGS-5030 Method\",\"USGS-5030\",IF('Hidden Summary'!G59=\"USGS-5158 Method\",\"USGS-5158\",IF('Hidden Summary'!G59=\"User Input Method\",\"User Input\",\"\")))))","v":""},null,{"$f":"'Hidden Summary'!I59","v":0},{"$f":"'Hidden Summary'!K59","v":0},{"$f":"'Hidden Summary'!M59","v":0},{"$f":"'Hidden Summary'!Z59","v":0},{"$f":"'Hidden Summary'!O59","v":0},null,{"$f":"'Hidden Summary'!Q59","v":0},{"$f":"'Hidden Summary'!U59","v":0},{"$f":"'Hidden Summary'!S59","v":0},{"$f":"'Hidden Summary'!X59","v":0},null,{"$f":"'Hidden Summary'!J59","v":0},{"$f":"'Hidden Summary'!L59","v":0},{"$f":"'Hidden Summary'!N59","v":0},{"$f":"'Hidden Summary'!AA59","v":0},{"$f":"'Hidden Summary'!P59","v":0},null,{"$f":"'Hidden Summary'!W59","v":0},{"$f":"'Hidden Summary'!Y59","v":0},{"$f":"'Hidden Summary'!R59","v":0},{"$f":"'Hidden Summary'!V59","v":0},{"$f":"'Hidden Summary'!T59","v":0},null,{"$error":"#DIV/0!"},{"$error":"#DIV/0!"},{"$error":"#DIV/0!"},0,0,0,{"$f":"'Hidden Summary'!AB59","v":0}]
[{"$f":"'Hidden Summary'!A60","v":0},null,{"$f":"'Hidden Summary'!D60","v":0},null,{"$f":"IF('Hidden Summary'!G60=\"Rational Method\",\"Rational\",IF('Hidden Summary'!G60=\"TR-55 Method\",\"TR-55\",IF('Hidden Summary'!G60=\"USGS-5030 Method\",\"USGS-5030\",IF('Hidden Summary'!G60=\"USGS-5158 Method\",\"USGS-5158\",IF('Hidden Summary'!G60=\"User Input Method\",\"User Input\",\"\")))))","v":""},null,{"$f":"'Hidden Summary'!I60","v":0},{"$f":"'Hidden Summary'!K60","v":0},{"$f":"'Hidden Summary'!M60","v":0},{"$f":"'Hidden Summary'!Z60","v":0},{"$f":"'Hidden Summary'!O60","v":0},null,{"$f":"'Hidden Summary'!Q60","v":0},{"$f":"'Hidden Summary'!U60","v":0},{"$f":"'Hidden Summary'!S60","v":0},{"$f":"'Hidden Summary'!X60","v":0},null,{"$f":"'Hidden Summary'!J60","v":0},{"$f":"'Hidden Summary'!L60","v":0},{"$f":"'Hidden Summary'!N60","v":0},{"$f":"'Hidden Summary'!AA60","v":0},{"$f":"'Hidden Summary'!P60","v":0},null,{"$f":"'Hidden Summary'!W60","v":0},{"$f":"'Hidden Summary'!Y60","v":0},{"$f":"'Hidden Summary'!R60","v":0},{"$f":"'Hidden Summary'!V60","v":0},{"$f":"'Hidden Summary'!T60","v":0},null,{"$error":"#DIV/0!"},{"$error":"#DIV/0!"},{"$error":"#DIV/0!"},0,0,0,{"$f":"'Hidden Summary'!AB60","v":0}]
[{"$f":"'Hidden Summary'!A61","v":0},null,{"$f":"'Hidden Summary'!D61","v":0},null,{"$f":"IF('Hidden Summary'!G61=\"Rational Method\",\"Rational\",IF('Hidden Summary'!G61=\"TR-55 Method\",\"TR-55\",IF('Hidden Summary'!G61=\"USGS-5030 Method\",\"USGS-5030\",IF('Hidden Summary'!G61=\"USGS-5158 Method\",\"USGS-5158\",IF('Hidden Summary'!G61=\"User Input Method\",\"User Input\",\"\")))))","v":""},null,{"$f":"'Hidden Summary'!I61","v":0},{"$f":"'Hidden Summary'!K61","v":0},{"$f":"'Hidden Summary'!M61","v":0},{"$f":"'Hidden Summary'!Z61","v":0},{"$f":"'Hidden Summary'!O61","v":0},null,{"$f":"'Hidden Summary'!Q61","v":0},{"$f":"'Hidden Summary'!U61","v":0},{"$f":"'Hidden Summary'!S61","v":0},{"$f":"'Hidden Summary'!X61","v":0},null,{"$f":"'Hidden Summary'!J61","v":0},{"$f":"'Hidden Summary'!L61","v":0},{"$f":"'Hidden Summary'!N61","v":0},{"$f":"'Hidden Summary'!AA61","v":0},{"$f":"'Hidden Summary'!P61","v":0},null,{"$f":"'Hidden Summary'!W61","v":0},{"$f":"'Hidden Summary'!Y61","v":0},{"$f":"'Hidden Summary'!R61","v":0},{"$f":"'Hidden Summary'!V61","v":0},{"$f":"'Hidden Summary'!T61","v":0},null,{"$error":"#DIV/0!"},{"$error":"#DIV/0!"},{"$error":"#DIV/0!"},0,0,0,{"$f":"'Hidden Summary'!AB61","v":0}]
[{"$f":"'Hidden Summary'!A62","v":0},null,{"$f":"'Hidden Summary'!D62","v":0},null,{"$f":"IF('Hidden Summary'!G62=\"Rational Method\",\"Rational\",IF('Hidden Summary'!G62=\"TR-55 Method\",\"TR-55\",IF('Hidden Summary'!G62=\"USGS-5030 Method\",\"USGS-5030\",IF('Hidden Summary'!G62=\"USGS-5158 Method\",\"USGS-5158\",IF('Hidden Summary'!G62=\"User Input Method\",\"User Input\",\"\")))))","v":""},null,{"$f":"'Hidden Summary'!I62","v":0},{"$f":"'Hidden Summary'!K62","v":0},{"$f":"'Hidden Summary'!M62","v":0},{"$f":"'Hidden Summary'!Z62","v":0},{"$f":"'Hidden Summary'!O62","v":0},null,{"$f":"'Hidden Summary'!Q62","v":0},{"$f":"'Hidden Summary'!U62","v":0},{"$f":"'Hidden Summary'!S62","v":0},{"$f":"'Hidden Summary'!X62","v":0},null,{"$f":"'Hidden Summary'!J62","v":0},{"$f":"'Hidden Summary'!L62","v":0},{"$f":"'Hidden Summary'!N62","v":0},{"$f":"'Hidden Summary'!AA62","v":0},{"$f":"'Hidden Summary'!P62","v":0},null,{"$f":"'Hidden Summary'!W62","v":0},{"$f":"'Hidden Summary'!Y62","v":0},{"$f":"'Hidden Summary'!R62","v":0},{"$f":"'Hidden Summary'!V62","v":0},{"$f":"'Hidden Summary'!T62","v":0},null,{"$error":"#DIV/0!"},{"$error":"#DIV/0!"},{"$error":"#DIV/0!"},0,0,0,{"$f":"'Hidden Summary'!AB62","v":0}]
[{"$f":"'Hidden Summary'!A63","v":0},null,{"$f":"'Hidden Summary'!D63","v":0},null,{"$f":"IF('Hidden Summary'!G63=\"Rational Method\",\"Rational\",IF('Hidden Summary'!G63=\"TR-55 Method\",\"TR-55\",IF('Hidden Summary'!G63=\"USGS-5030 Method\",\"USGS-5030\",IF('Hidden Summary'!G63=\"USGS-5158 Method\",\"USGS-5158\",IF('Hidden Summary'!G63=\"User Input Method\",\"User Input\",\"\")))))","v":""},null,{"$f":"'Hidden Summary'!I63","v":0},{"$f":"'Hidden Summary'!K63","v":0},{"$f":"'Hidden Summary'!M63","v":0},{"$f":"'Hidden Summary'!Z63","v":0},{"$f":"'Hidden Summary'!O63","v":0},null,{"$f":"'Hidden Summary'!Q63","v":0},{"$f":"'Hidden Summary'!U63","v":0},{"$f":"'Hidden Summary'!S63","v":0},{"$f":"'Hidden Summary'!X63","v":0},null,{"$f":"'Hidden Summary'!J63","v":0},{"$f":"'Hidden Summary'!L63","v":0},{"$f":"'Hidden Summary'!N63","v":0},{"$f":"'Hidden Summary'!AA63","v":0},{"$f":"'Hidden Summary'!P63","v":0},null,{"$f":"'Hidden Summary'!W63","v":0},{"$f":"'Hidden Summary'!Y63","v":0},{"$f":"'Hidden Summary'!R63","v":0},{"$f":"'Hidden Summary'!V63","v":0},{"$f":"'Hidden Summary'!T63","v":0},null,{"$error":"#DIV/0!"},{"$error":"#DIV/0!"},{"$error":"#DIV/0!"},0,0,0,{"$f":"'Hidden Summary'!AB63","v":0}]
[{"$f":"'Hidden Summary'!A64","v":0},null,{"$f":"'Hidden Summary'!D64","v":0},null,{"$f":"IF('Hidden Summary'!G64=\"Rational Method\",\"Rational\",IF('Hidden Summary'!G64=\"TR-55 Method\",\"TR-55\",IF('Hidden Summary'!G64=\"USGS-5030 Method\",\"USGS-5030\",IF('Hidden Summary'!G64=\"USGS-5158 Method\",\"USGS-5158\",IF('Hidden Summary'!G64=\"User Input Method\",\"User Input\",\"\")))))","v":""},null,{"$f":"'Hidden Summary'!I64","v":0},{"$f":"'Hidden Summary'!K64","v":0},{"$f":"'Hidden Summary'!M64","v":0},{"$f":"'Hidden Summary'!Z64","v":0},{"$f":"'Hidden Summary'!O64","v":0},null,{"$f":"'Hidden Summary'!Q64","v":0},{"$f":"'Hidden Summary'!U64","v":0},{"$f":"'Hidden Summary'!S64","v":0},{"$f":"'Hidden Summary'!X64","v":0},null,{"$f":"'Hidden Summary'!J64","v":0},{"$f":"'Hidden Summary'!L64","v":0},{"$f":"'Hidden Summary'!N64","v":0},{"$f":"'Hidden Summary'!AA64","v":0},{"$f":"'Hidden Summary'!P64","v":0},null,{"$f":"'Hidden Summary'!W64","v":0},{"$f":"'Hidden Summary'!Y64","v":0},{"$f":"'Hidden Summary'!R64","v":0},{"$f":"'Hidden Summary'!V64","v":0},{"$f":"'Hidden Summary'!T64","v":0},null,{"$error":"#DIV/0!"},{"$error":"#DIV/0!"},{"$error":"#DIV/0!"},0,0,0,{"$f":"'Hidden Summary'!AB64","v":0}]
[{"$f":"'Hidden Summary'!A65","v":0},null,{"$f":"'Hidden Summary'!D65","v":0},null,{"$f":"IF('Hidden Summary'!G65=\"Rational Method\",\"Rational\",IF('Hidden Summary'!G65=\"TR-55 Method\",\"TR-55\",IF('Hidden Summary'!G65=\"USGS-5030 Method\",\"USGS-5030\",IF('Hidden Summary'!G65=\"USGS-5158 Method\",\"USGS-5158\",IF('Hidden Summary'!G65=\"User Input Method\",\"User Input\",\"\")))))","v":""},null,{"$f":"'Hidden Summary'!I65","v":0},{"$f":"'Hidden Summary'!K65","v":0},{"$f":"'Hidden Summary'!M65","v":0},{"$f":"'Hidden Summary'!Z65","v":0},{"$f":"'Hidden Summary'!O65","v":0},null,{"$f":"'Hidden Summary'!Q65","v":0},{"$f":"'Hidden Summary'!U65","v":0},{"$f":"'Hidden Summary'!S65","v":0},{"$f":"'Hidden Summary'!X65","v":0},null,{"$f":"'Hidden Summary'!J65","v":0},{"$f":"'Hidden Summary'!L65","v":0},{"$f":"'Hidden Summary'!N65","v":0},{"$f":"'Hidden Summary'!AA65","v":0},{"$f":"'Hidden Summary'!P65","v":0},null,{"$f":"'Hidden Summary'!W65","v":0},{"$f":"'Hidden Summary'!Y65","v":0},{"$f":"'Hidden Summary'!R65","v":0},{"$f":"'Hidden Summary'!V65","v":0},{"$f":"'Hidden Summary'!T65","v":0},null,{"$error":"#DIV/0!"},{"$error":"#DIV/0!"},{"$error":"#DIV/0!"},0,0,0,{"$f":"'Hidden Summary'!AB65","v":0}]
[{"$f":"'Hidden Summary'!A66","v":0},null,{"$f":"'Hidden Summary'!D66","v":0},null,{"$f":"IF('Hidden Summary'!G66=\"Rational Method\",\"Rational\",IF('Hidden Summary'!G66=\"TR-55 Method\",\"TR-55\",IF('Hidden Summary'!G66=\"USGS-5030 Method\",\"USGS-5030\",IF('Hidden Summary'!G66=\"USGS-5158 Method\",\"USGS-5158\",IF('Hidden Summary'!G66=\"User Input Method\",\"User Input\",\"\")))))","v":""},null,{"$f":"'Hidden Summary'!I66","v":0},{"$f":"'Hidden Summary'!K66","v":0},{"$f":"'Hidden Summary'!M66","v":0},{"$f":"'Hidden Summary'!Z66","v":0},{"$f":"'Hidden Summary'!O66","v":0},null,{"$f":"'Hidden Summary'!Q66","v":0},{"$f":"'Hidden Summary'!U66","v":0},{"$f":"'Hidden Summary'!S66","v":0},{"$f":"'Hidden Summary'!X66","v":0},null,{"$f":"'Hidden Summary'!J66","v":0},{"$f":"'Hidden Summary'!L66","v":0},{"$f":"'Hidden Summary'!N66","v":0},{"$f":"'Hidden Summary'!AA66","v":0},{"$f":"'Hidden Summary'!P66","v":0},null,{"$f":"'Hidden Summary'!W66","v":0},{"$f":"'Hidden Summary'!Y66","v":0},{"$f":"'Hidden Summary'!R66","v":0},{"$f":"'Hidden Summary'!V66","v":0},{"$f":"'Hidden Summary'!T66","v":0},null,{"$error":"#DIV/0!"},{"$error":"#DIV/0!"},{"$error":"#DIV/0!"},0,0,0,{"$f":"'Hidden Summary'!AB66","v":0}]
[{"$f":"'Hidden Summary'!A67","v":0},null,{"$f":"'Hidden Summary'!D67","v":0},null,{"$f":"IF('Hidden Summary'!G67=\"Rational Method\",\"Rational\",IF('Hidden Summary'!G67=\"TR-55 Method\",\"TR-55\",IF('Hidden Summary'!G67=\"USGS-5030 Method\",\"USGS-5030\",IF('Hidden Summary'!G67=\"USGS-5158 Method\",\"USGS-5158\",IF('Hidden Summary'!G67=\"User Input Method\",\"User Input\",\"\")))))","v":""},null,{"$f":"'Hidden Summary'!I67","v":0},{"$f":"'Hidden Summary'!K67","v":0},{"$f":"'Hidden Summary'!M67","v":0},{"$f":"'Hidden Summary'!Z67","v":0},{"$f":"'Hidden Summary'!O67","v":0},null,{"$f":"'Hidden Summary'!Q67","v":0},{"$f":"'Hidden Summary'!U67","v":0},{"$f":"'Hidden Summary'!S67","v":0},{"$f":"'Hidden Summary'!X67","v":0},null,{"$f":"'Hidden Summary'!J67","v":0},{"$f":"'Hidden Summary'!L67","v":0},{"$f":"'Hidden Summary'!N67","v":0},{"$f":"'Hidden Summary'!AA67","v":0},{"$f":"'Hidden Summary'!P67","v":0},null,{"$f":"'Hidden Summary'!W67","v":0},{"$f":"'Hidden Summary'!Y67","v":0},{"$f":"'Hidden Summary'!R67","v":0},{"$f":"'Hidden Summary'!V67","v":0},{"$f":"'Hidden Summary'!T67","v":0},null,{"$f":"(Z74/M74)-1","v":{"$error":"#DIV/0!"}},{"$f":"(AA74/N74)-1","v":{"$error":"#DIV/0!"}},{"$f":"(AB74/O74)-1","v":{"$error":"#DIV/0!"}},{"$f":"R74-G74","v":0},{"$f":"(U74*R74)-(J74*G74)","v":0},{"$f":"U74-J74","v":0},{"$f":"'Hidden Summary'!AB67","v":0}]
[{"$f":"'Hidden Summary'!A68","v":0},null,{"$f":"'Hidden Summary'!D68","v":0},null,{"$f":"IF('Hidden Summary'!G68=\"Rational Method\",\"Rational\",IF('Hidden Summary'!G68=\"TR-55 Method\",\"TR-55\",IF('Hidden Summary'!G68=\"USGS-5030 Method\",\"USGS-5030\",IF('Hidden Summary'!G68=\"USGS-5158 Method\",\"USGS-5158\",IF('Hidden Summary'!G68=\"User Input Method\",\"User Input\",\"\")))))","v":""},null,{"$f":"'Hidden Summary'!I68","v":0},{"$f":"'Hidden Summary'!K68","v":0},{"$f":"'Hidden Summary'!M68","v":0},{"$f":"'Hidden Summary'!Z68","v":0},{"$f":"'Hidden Summary'!O68","v":0},null,{"$f":"'Hidden Summary'!Q68","v":0},{"$f":"'Hidden Summary'!U68","v":0},{"$f":"'Hidden Summary'!S68","v":0},{"$f":"'Hidden Summary'!X68","v":0},null,{"$f":"'Hidden Summary'!J68","v":0},{"$f":"'Hidden Summary'!L68","v":0},{"$f":"'Hidden Summary'!N68","v":0},{"$f":"'Hidden Summary'!AA68","v":0},{"$f":"'Hidden Summary'!P68","v":0},null,{"$f":"'Hidden Summary'!W68","v":0},{"$f":"'Hidden Summary'!Y68","v":0},{"$f":"'Hidden Summary'!R68","v":0},{"$f":"'Hidden Summary'!V68","v":0},{"$f":"'Hidden Summary'!T68","v":0},null,{"$error":"#DIV/0!"},{"$error":"#DIV/0!"},{"$error":"#DIV/0!"},0,0,0,{"$f":"'Hidden Summary'!AB68","v":0}]
[{"$f":"'Hidden Summary'!A69","v":0},null,{"$f":"'Hidden Summary'!D69","v":0},null,{"$f":"IF('Hidden Summary'!G69=\"Rational Method\",\"Rational\",IF('Hidden Summary'!G69=\"TR-55 Method\",\"TR-55\",IF('Hidden Summary'!G69=\"USGS-5030 Method\",\"USGS-5030\",IF('Hidden Summary'!G69=\"USGS-5158 Method\",\"USGS-5158\",IF('Hidden Summary'!G69=\"User Input Method\",\"User Input\",\"\")))))","v":""},null,{"$f":"'Hidden Summary'!I69","v":0},{"$f":"'Hidden Summary'!K69","v":0},{"$f":"'Hidden Summary'!M69","v":0},{"$f":"'Hidden Summary'!Z69","v":0},{"$f":"'Hidden Summary'!O69","v":0},null,{"$f":"'Hidden Summary'!Q69","v":0},{"$f":"'Hidden Summary'!U69","v":0},{"$f":"'Hidden Summary'!S69","v":0},{"$f":"'Hidden Summary'!X69","v":0},null,{"$f":"'Hidden Summary'!J69","v":0},{"$f":"'Hidden Summary'!L69","v":0},{"$f":"'Hidden Summary'!N69","v":0},{"$f":"'Hidden Summary'!AA69","v":0},{"$f":"'Hidden Summary'!P69","v":0},null,{"$f":"'Hidden Summary'!W69","v":0},{"$f":"'Hidden Summary'!Y69","v":0},{"$f":"'Hidden Summary'!R69","v":0},{"$f":"'Hidden Summary'!V69","v":0},{"$f":"'Hidden Summary'!T69","v":0},null,{"$error":"#DIV/0!"},{"$error":"#DIV/0!"},{"$error":"#DIV/0!"},0,0,0,{"$f":"'Hidden Summary'!AB69","v":0}]
[{"$f":"'Hidden Summary'!A70","v":0},null,{"$f":"'Hidden Summary'!D70","v":0},null,{"$f":"IF('Hidden Summary'!G70=\"Rational Method\",\"Rational\",IF('Hidden Summary'!G70=\"TR-55 Method\",\"TR-55\",IF('Hidden Summary'!G70=\"USGS-5030 Method\",\"USGS-5030\",IF('Hidden Summary'!G70=\"USGS-5158 Method\",\"USGS-5158\",IF('Hidden Summary'!G70=\"User Input Method\",\"User Input\",\"\")))))","v":""},null,{"$f":"'Hidden Summary'!I70","v":0},{"$f":"'Hidden Summary'!K70","v":0},{"$f":"'Hidden Summary'!M70","v":0},{"$f":"'Hidden Summary'!Z70","v":0},{"$f":"'Hidden Summary'!O70","v":0},null,{"$f":"'Hidden Summary'!Q70","v":0},{"$f":"'Hidden Summary'!U70","v":0},{"$f":"'Hidden Summary'!S70","v":0},{"$f":"'Hidden Summary'!X70","v":0},null,{"$f":"'Hidden Summary'!J70","v":0},{"$f":"'Hidden Summary'!L70","v":0},{"$f":"'Hidden Summary'!N70","v":0},{"$f":"'Hidden Summary'!AA70","v":0},{"$f":"'Hidden Summary'!P70","v":0},null,{"$f":"'Hidden Summary'!W70","v":0},{"$f":"'Hidden Summary'!Y70","v":0},{"$f":"'Hidden Summary'!R70","v":0},{"$f":"'Hidden Summary'!V70","v":0},{"$f":"'Hidden Summary'!T70","v":0},null,{"$error":"#DIV/0!"},{"$error":"#DIV/0!"},{"$error":"#DIV/0!"},0,0,0,{"$f":"'Hidden Summary'!AB70","v":0}]
[{"$f":"'Hidden Summary'!A71","v":0},null,{"$f":"'Hidden Summary'!D71","v":0},null,{"$f":"IF('Hidden Summary'!G71=\"Rational Method\",\"Rational\",IF('Hidden Summary'!G71=\"TR-55 Method\",\"TR-55\",IF('Hidden Summary'!G71=\"USGS-5030 Method\",\"USGS-5030\",IF('Hidden Summary'!G71=\"USGS-5158 Method\",\"USGS-5158\",IF('Hidden Summary'!G71=\"User Input Method\",\"User Input\",\"\")))))","v":""},null,{"$f":"'Hidden Summary'!I71","v":0},{"$f":"'Hidden Summary'!K71","v":0},{"$f":"'Hidden Summary'!M71","v":0},{"$f":"'Hidden Summary'!Z71","v":0},{"$f":"'Hidden Summary'!O71","v":0},null,{"$f":"'Hidden Summary'!Q71","v":0},{"$f":"'Hidden Summary'!U71","v":0},{"$f":"'Hidden Summary'!S71","v":0},{"$f":"'Hidden Summary'!X71","v":0},null,{"$f":"'Hidden Summary'!J71","v":0},{"$f":"'Hidden Summary'!L71","v":0},{"$f":"'Hidden Summary'!N71","v":0},{"$f":"'Hidden Summary'!AA71","v":0},{"$f":"'Hidden Summary'!P71","v":0},null,{"$f":"'Hidden Summary'!W71","v":0},{"$f":"'Hidden Summary'!Y71","v":0},{"$f":"'Hidden Summary'!R71","v":0},{"$f":"'Hidden Summary'!V71","v":0},{"$f":"'Hidden Summary'!T71","v":0},null,{"$error":"#DIV/0!"},{"$error":"#DIV/0!"},{"$error":"#DIV/0!"},0,0,0,{"$f":"'Hidden Summary'!AB71","v":0}]
[{"$f":"'Hidden Summary'!A72","v":0},null,{"$f":"'Hidden Summary'!D72","v":0},null,{"$f":"IF('Hidden Summary'!G72=\"Rational Method\",\"Rational\",IF('Hidden Summary'!G72=\"TR-55 Method\",\"TR-55\",IF('Hidden Summary'!G72=\"USGS-5030 Method\",\"USGS-5030\",IF('Hidden Summary'!G72=\"USGS-5158 Method\",\"USGS-5158\",IF('Hidden Summary'!G72=\"User Input Method\",\"User Input\",\"\")))))","v":""},null,{"$f":"'Hidden Summary'!I72","v":0},{"$f":"'Hidden Summary'!K72","v":0},{"$f":"'Hidden Summary'!M72","v":0},{"$f":"'Hidden Summary'!Z72","v":0},{"$f":"'Hidden Summary'!O72","v":0},null,{"$f":"'Hidden Summary'!Q72","v":0},{"$f":"'Hidden Summary'!U72","v":0},{"$f":"'Hidden Summary'!S72","v":0},{"$f":"'Hidden Summary'!X72","v":0},null,{"$f":"'Hidden Summary'!J72","v":0},{"$f":"'Hidden Summary'!L72","v":0},{"$f":"'Hidden Summary'!N72","v":0},{"$f":"'Hidden Summary'!AA72","v":0},{"$f":"'Hidden Summary'!P72","v":0},null,{"$f":"'Hidden Summary'!W72","v":0},{"$f":"'Hidden Summary'!Y72","v":0},{"$f":"'Hidden Summary'!R72","v":0},{"$f":"'Hidden Summary'!V72","v":0},{"$f":"'Hidden Summary'!T72","v":0},null,{"$error":"#DIV/0!"},{"$error":"#DIV/0!"},{"$error":"#DIV/0!"},0,0,0,{"$f":"'Hidden Summary'!AB72","v":0}]
[{"$f":"'Hidden Summary'!A73","v":0},null,{"$f":"'Hidden Summary'!D73","v":0},null,{"$f":"IF('Hidden Summary'!G73=\"Rational Method\",\"Rational\",IF('Hidden Summary'!G73=\"TR-55 Method\",\"TR-55\",IF('Hidden Summary'!G73=\"USGS-5030 Method\",\"USGS-5030\",IF('Hidden Summary'!G73=\"USGS-5158 Method\",\"USGS-5158\",IF('Hidden Summary'!G73=\"User Input Method\",\"User Input\",\"\")))))","v":""},null,{"$f":"'Hidden Summary'!I73","v":0},{"$f":"'Hidden Summary'!K73","v":0},{"$f":"'Hidden Summary'!M73","v":0},{"$f":"'Hidden Summary'!Z73","v":0},{"$f":"'Hidden Summary'!O73","v":0},null,{"$f":"'Hidden Summary'!Q73","v":0},{"$f":"'Hidden Summary'!U73","v":0},{"$f":"'Hidden Summary'!S73","v":0},{"$f":"'Hidden Summary'!X73","v":0},null,{"$f":"'Hidden Summary'!J73","v":0},{"$f":"'Hidden Summary'!L73","v":0},{"$f":"'Hidden Summary'!N73","v":0},{"$f":"'Hidden Summary'!AA73","v":0},{"$f":"'Hidden Summary'!P73","v":0},null,{"$f":"'Hidden Summary'!W73","v":0},{"$f":"'Hidden Summary'!Y73","v":0},{"$f":"'Hidden Summary'!R73","v":0},{"$f":"'Hidden Summary'!V73","v":0},{"$f":"'Hidden Summary'!T73","v":0},null,{"$error":"#DIV/0!"},{"$error":"#DIV/0!"},{"$error":"#DIV/0!"},0,0,0,{"$f":"'Hidden Summary'!AB73","v":0}]
[{"$f":"'Hidden Summary'!A74","v":0},null,{"$f":"'Hidden Summary'!D74","v":0},null,{"$f":"IF('Hidden Summary'!G74=\"Rational Method\",\"Rational\",IF('Hidden Summary'!G74=\"TR-55 Method\",\"TR-55\",IF('Hidden Summary'!G74=\"USGS-5030 Method\",\"USGS-5030\",IF('Hidden Summary'!G74=\"USGS-5158 Method\",\"USGS-5158\",IF('Hidden Summary'!G74=\"User Input Method\",\"User Input\",\"\")))))","v":""},null,{"$f":"'Hidden Summary'!I74","v":0},{"$f":"'Hidden Summary'!K74","v":0},{"$f":"'Hidden Summary'!M74","v":0},{"$f":"'Hidden Summary'!Z74","v":0},{"$f":"'Hidden Summary'!O74","v":0},null,{"$f":"'Hidden Summary'!Q74","v":0},{"$f":"'Hidden Summary'!U74","v":0},{"$f":"'Hidden Summary'!S74","v":0},{"$f":"'Hidden Summary'!X74","v":0},null,{"$f":"'Hidden Summary'!J74","v":0},{"$f":"'Hidden Summary'!L74","v":0},{"$f":"'Hidden Summary'!N74","v":0},{"$f":"'Hidden Summary'!AA74","v":0},{"$f":"'Hidden Summary'!P74","v":0},null,{"$f":"'Hidden Summary'!W74","v":0},{"$f":"'Hidden Summary'!Y74","v":0},{"$f":"'Hidden Summary'!R74","v":0},{"$f":"'Hidden Summary'!V74","v":0},{"$f":"'Hidden Summary'!T74","v":0},null,{"$error":"#DIV/0!"},{"$error":"#DIV/0!"},{"$error":"#DIV/0!"},0,0,0,{"$f":"'Hidden Summary'!AB74","v":0}]
[{"$f":"'Hidden Summary'!A75","v":0},null,{"$f":"'Hidden Summary'!D75","v":0},null,{"$f":"IF('Hidden Summary'!G75=\"Rational Method\",\"Rational\",IF('Hidden Summary'!G75=\"TR-55 Method\",\"TR-55\",IF('Hidden Summary'!G75=\"USGS-5030 Method\",\"USGS-5030\",IF('Hidden Summary'!G75=\"USGS-5158 Method\",\"USGS-5158\",IF('Hidden Summary'!G75=\"User Input Method\",\"User Input\",\"\")))))","v":""},null,{"$f":"'Hidden Summary'!I75","v":0},{"$f":"'Hidden Summary'!K75","v":0},{"$f":"'Hidden Summary'!M75","v":0},{"$f":"'Hidden Summary'!Z75","v":0},{"$f":"'Hidden Summary'!O75","v":0},null,{"$f":"'Hidden Summary'!Q75","v":0},{"$f":"'Hidden Summary'!U75","v":0},{"$f":"'Hidden Summary'!S75","v":0},{"$f":"'Hidden Summary'!X75","v":0},null,{"$f":"'Hidden Summary'!J75","v":0},{"$f":"'Hidden Summary'!L75","v":0},{"$f":"'Hidden Summary'!N75","v":0},{"$f":"'Hidden Summary'!AA75","v":0},{"$f":"'Hidden Summary'!P75","v":0},null,{"$f":"'Hidden Summary'!W75","v":0},{"$f":"'Hidden Summary'!Y75","v":0},{"$f":"'Hidden Summary'!R75","v":0},{"$f":"'Hidden Summary'!V75","v":0},{"$f":"'Hidden Summary'!T75","v":0},null,{"$error":"#DIV/0!"},{"$error":"#DIV/0!"},{"$error":"#DIV/0!"},0,0,0,{"$f":"'Hidden Summary'!AB75","v":0}]
[{"$f":"'Hidden Summary'!A76","v":0},null,{"$f":"'Hidden Summary'!D76","v":0},null,{"$f":"IF('Hidden Summary'!G76=\"Rational Method\",\"Rational\",IF('Hidden Summary'!G76=\"TR-55 Method\",\"TR-55\",IF('Hidden Summary'!G76=\"USGS-5030 Method\",\"USGS-5030\",IF('Hidden Summary'!G76=\"USGS-5158 Method\",\"USGS-5158\",IF('Hidden Summary'!G76=\"User Input Method\",\"User Input\",\"\")))))","v":""},null,{"$f":"'Hidden Summary'!I76","v":0},{"$f":"'Hidden Summary'!K76","v":0},{"$f":"'Hidden Summary'!M76","v":0},{"$f":"'Hidden Summary'!Z76","v":0},{"$f":"'Hidden Summary'!O76","v":0},null,{"$f":"'Hidden Summary'!Q76","v":0},{"$f":"'Hidden Summary'!U76","v":0},{"$f":"'Hidden Summary'!S76","v":0},{"$f":"'Hidden Summary'!X76","v":0},null,{"$f":"'Hidden Summary'!J76","v":0},{"$f":"'Hidden Summary'!L76","v":0},{"$f":"'Hidden Summary'!N76","v":0},{"$f":"'Hidden Summary'!AA76","v":0},{"$f":"'Hidden Summary'!P76","v":0},null,{"$f":"'Hidden Summary'!W76","v":0},{"$f":"'Hidden Summary'!Y76","v":0},{"$f":"'Hidden Summary'!R76","v":0},{"$f":"'Hidden Summary'!V76","v":0},{"$f":"'Hidden Summary'!T76","v":0},null,{"$error":"#DIV/0!"},{"$error":"#DIV/0!"},{"$error":"#DIV/0!"},0,0,0,{"$f":"'Hidden Summary'!AB76","v":0}]
[{"$f":"'Hidden Summary'!A77","v":0},null,{"$f":"'Hidden Summary'!D77","v":0},null,{"$f":"IF('Hidden Summary'!G77=\"Rational Method\",\"Rational\",IF('Hidden Summary'!G77=\"TR-55 Method\",\"TR-55\",IF('Hidden Summary'!G77=\"USGS-5030 Method\",\"USGS-5030\",IF('Hidden Summary'!G77=\"USGS-5158 Method\",\"USGS-5158\",IF('Hidden Summary'!G77=\"User Input Method\",\"User Input\",\"\")))))","v":""},null,{"$f":"'Hidden Summary'!I77","v":0},{"$f":"'Hidden Summary'!K77","v":0},{"$f":"'Hidden Summary'!M77","v":0},{"$f":"'Hidden Summary'!Z77","v":0},{"$f":"'Hidden Summary'!O77","v":0},null,{"$f":"'Hidden Summary'!Q77","v":0},{"$f":"'Hidden Summary'!U77","v":0},{"$f":"'Hidden Summary'!S77","v":0},{"$f":"'Hidden Summary'!X77","v":0},null,{"$f":"'Hidden Summary'!J77","v":0},{"$f":"'Hidden Summary'!L77","v":0},{"$f":"'Hidden Summary'!N77","v":0},{"$f":"'Hidden Summary'!AA77","v":0},{"$f":"'Hidden Summary'!P77","v":0},null,{"$f":"'Hidden Summary'!W77","v":0},{"$f":"'Hidden Summary'!Y77","v":0},{"$f":"'Hidden Summary'!R77","v":0},{"$f":"'Hidden Summary'!V77","v":0},{"$f":"'Hidden Summary'!T77","v":0},null,{"$error":"#DIV/0!"},{"$error":"#DIV/0!"},{"$error":"#DIV/0!"},0,0,0,{"$f":"'Hidden Summary'!AB77","v":0}]
[{"$f":"'Hidden Summary'!A78","v":0},null,{"$f":"'Hidden Summary'!D78","v":0},null,{"$f":"IF('Hidden Summary'!G78=\"Rational Method\",\"Rational\",IF('Hidden Summary'!G78=\"TR-55 Method\",\"TR-55\",IF('Hidden Summary'!G78=\"USGS-5030 Method\",\"USGS-5030\",IF('Hidden Summary'!G78=\"USGS-5158 Method\",\"USGS-5158\",IF('Hidden Summary'!G78=\"User Input Method\",\"User Input\",\"\")))))","v":""},null,{"$f":"'Hidden Summary'!I78","v":0},{"$f":"'Hidden Summary'!K78","v":0},{"$f":"'Hidden Summary'!M78","v":0},{"$f":"'Hidden Summary'!Z78","v":0},{"$f":"'Hidden Summary'!O78","v":0},null,{"$f":"'Hidden Summary'!Q78","v":0},{"$f":"'Hidden Summary'!U78","v":0},{"$f":"'Hidden Summary'!S78","v":0},{"$f":"'Hidden Summary'!X78","v":0},null,{"$f":"'Hidden Summary'!J78","v":0},{"$f":"'Hidden Summary'!L78","v":0},{"$f":"'Hidden Summary'!N78","v":0},{"$f":"'Hidden Summary'!AA78","v":0},{"$f":"'Hidden Summary'!P78","v":0},null,{"$f":"'Hidden Summary'!W78","v":0},{"$f":"'Hidden Summary'!Y78","v":0},{"$f":"'Hidden Summary'!R78","v":0},{"$f":"'Hidden Summary'!V78","v":0},{"$f":"'Hidden Summary'!T78","v":0},null,{"$error":"#DIV/0!"},{"$error":"#DIV/0!"},{"$error":"#DIV/0!"},0,0,0,{"$f":"'Hidden Summary'!AB78","v":0}]
[{"$f":"'Hidden Summary'!A79","v":0},null,{"$f":"'Hidden Summary'!D79","v":0},null,{"$f":"IF('Hidden Summary'!G79=\"Rational Method\",\"Rational\",IF('Hidden Summary'!G79=\"TR-55 Method\",\"TR-55\",IF('Hidden Summary'!G79=\"USGS-5030 Method\",\"USGS-5030\",IF('Hidden Summary'!G79=\"USGS-5158 Method\",\"USGS-5158\",IF('Hidden Summary'!G79=\"User Input Method\",\"User Input\",\"\")))))","v":""},null,{"$f":"'Hidden Summary'!I79","v":0},{"$f":"'Hidden Summary'!K79","v":0},{"$f":"'Hidden Summary'!M79","v":0},{"$f":"'Hidden Summary'!Z79","v":0},{"$f":"'Hidden Summary'!O79","v":0},null,{"$f":"'Hidden Summary'!Q79","v":0},{"$f":"'Hidden Summary'!U79","v":0},{"$f":"'Hidden Summary'!S79","v":0},{"$f":"'Hidden Summary'!X79","v":0},null,{"$f":"'Hidden Summary'!J79","v":0},{"$f":"'Hidden Summary'!L79","v":0},{"$f":"'Hidden Summary'!N79","v":0},{"$f":"'Hidden Summary'!AA79","v":0},{"$f":"'Hidden Summary'!P79","v":0},null,{"$f":"'Hidden Summary'!W79","v":0},{"$f":"'Hidden Summary'!Y79","v":0},{"$f":"'Hidden Summary'!R79","v":0},{"$f":"'Hidden Summary'!V79","v":0},{"$f":"'Hidden Summary'!T79","v":0},null,{"$error":"#DIV/0!"},{"$error":"#DIV/0!"},{"$error":"#DIV/0!"},0,0,0,{"$f":"'Hidden Summary'!AB79","v":0}]
[{"$f":"'Hidden Summary'!A80","v":0},null,{"$f":"'Hidden Summary'!D80","v":0},null,{"$f":"IF('Hidden Summary'!G80=\"Rational Method\",\"Rational\",IF('Hidden Summary'!G80=\"TR-55 Method\",\"TR-55\",IF('Hidden Summary'!G80=\"USGS-5030 Method\",\"USGS-5030\",IF('Hidden Summary'!G80=\"USGS-5158 Method\",\"USGS-5158\",IF('Hidden Summary'!G80=\"User Input Method\",\"User Input\",\"\")))))","v":""},null,{"$f":"'Hidden Summary'!I80","v":0},{"$f":"'Hidden Summary'!K80","v":0},{"$f":"'Hidden Summary'!M80","v":0},{"$f":"'Hidden Summary'!Z80","v":0},{"$f":"'Hidden Summary'!O80","v":0},null,{"$f":"'Hidden Summary'!Q80","v":0},{"$f":"'Hidden Summary'!U80","v":0},{"$f":"'Hidden Summary'!S80","v":0},{"$f":"'Hidden Summary'!X80","v":0},null,{"$f":"'Hidden Summary'!J80","v":0},{"$f":"'Hidden Summary'!L80","v":0},{"$f":"'Hidden Summary'!N80","v":0},{"$f":"'Hidden Summary'!AA80","v":0},{"$f":"'Hidden Summary'!P80","v":0},null,{"$f":"'Hidden Summary'!W80","v":0},{"$f":"'Hidden Summary'!Y80","v":0},{"$f":"'Hidden Summary'!R80","v":0},{"$f":"'Hidden Summary'!V80","v":0},{"$f":"'Hidden Summary'!T80","v":0},null,{"$error":"#DIV/0!"},{"$error":"#DIV/0!"},{"$error":"#DIV/0!"},0,0,0,{"$f":"'Hidden Summary'!AB80","v":0}]
[{"$f":"'Hidden Summary'!A81","v":0},null,{"$f":"'Hidden Summary'!D81","v":0},null,{"$f":"IF('Hidden Summary'!G81=\"Rational Method\",\"Rational\",IF('Hidden Summary'!G81=\"TR-55 Method\",\"TR-55\",IF('Hidden Summary'!G81=\"USGS-5030 Method\",\"USGS-5030\",IF('Hidden Summary'!G81=\"USGS-5158 Method\",\"USGS-5158\",IF('Hidden Summary'!G81=\"User Input Method\",\"User Input\",\"\")))))","v":""},null,{"$f":"'Hidden Summary'!I81","v":0},{"$f":"'Hidden Summary'!K81","v":0},{"$f":"'Hidden Summary'!M81","v":0},{"$f":"'Hidden Summary'!Z81","v":0},{"$f":"'Hidden Summary'!O81","v":0},null,{"$f":"'Hidden Summary'!Q81","v":0},{"$f":"'Hidden Summary'!U81","v":0},{"$f":"'Hidden Summary'!S81","v":0},{"$f":"'Hidden Summary'!X81","v":0},null,{"$f":"'Hidden Summary'!J81","v":0},{"$f":"'Hidden Summary'!L81","v":0},{"$f":"'Hidden Summary'!N81","v":0},{"$f":"'Hidden Summary'!AA81","v":0},{"$f":"'Hidden Summary'!P81","v":0},null,{"$f":"'Hidden Summary'!W81","v":0},{"$f":"'Hidden Summary'!Y81","v":0},{"$f":"'Hidden Summary'!R81","v":0},{"$f":"'Hidden Summary'!V81","v":0},{"$f":"'Hidden Summary'!T81","v":0},null,{"$error":"#DIV/0!"},{"$error":"#DIV/0!"},{"$error":"#DIV/0!"},0,0,0,{"$f":"'Hidden Summary'!AB81","v":0}]
[{"$f":"'Hidden Summary'!A82","v":0},null,{"$f":"'Hidden Summary'!D82","v":0},null,{"$f":"IF('Hidden Summary'!G82=\"Rational Method\",\"Rational\",IF('Hidden Summary'!G82=\"TR-55 Method\",\"TR-55\",IF('Hidden Summary'!G82=\"USGS-5030 Method\",\"USGS-5030\",IF('Hidden Summary'!G82=\"USGS-5158 Method\",\"USGS-5158\",IF('Hidden Summary'!G82=\"User Input Method\",\"User Input\",\"\")))))","v":""},null,{"$f":"'Hidden Summary'!I82","v":0},{"$f":"'Hidden Summary'!K82","v":0},{"$f":"'Hidden Summary'!M82","v":0},{"$f":"'Hidden Summary'!Z82","v":0},{"$f":"'Hidden Summary'!O82","v":0},null,{"$f":"'Hidden Summary'!Q82","v":0},{"$f":"'Hidden Summary'!U82","v":0},{"$f":"'Hidden Summary'!S82","v":0},{"$f":"'Hidden Summary'!X82","v":0},null,{"$f":"'Hidden Summary'!J82","v":0},{"$f":"'Hidden Summary'!L82","v":0},{"$f":"'Hidden Summary'!N82","v":0},{"$f":"'Hidden Summary'!AA82","v":0},{"$f":"'Hidden Summary'!P82","v":0},null,{"$f":"'Hidden Summary'!W82","v":0},{"$f":"'Hidden Summary'!Y82","v":0},{"$f":"'Hidden Summary'!R82","v":0},{"$f":"'Hidden Summary'!V82","v":0},{"$f":"'Hidden Summary'!T82","v":0},null,{"$error":"#DIV/0!"},{"$error":"#DIV/0!"},{"$error":"#DIV/0!"},0,0,0,{"$f":"'Hidden Summary'!AB82","v":0}]
[{"$f":"'Hidden Summary'!A83","v":0},null,{"$f":"'Hidden Summary'!D83","v":0},null,{"$f":"IF('Hidden Summary'!G83=\"Rational Method\",\"Rational\",IF('Hidden Summary'!G83=\"TR-55 Method\",\"TR-55\",IF('Hidden Summary'!G83=\"USGS-5030 Method\",\"USGS-5030\",IF('Hidden Summary'!G83=\"USGS-5158 Method\",\"USGS-5158\",IF('Hidden Summary'!G83=\"User Input Method\",\"User Input\",\"\")))))","v":""},null,{"$f":"'Hidden Summary'!I83","v":0},{"$f":"'Hidden Summary'!K83","v":0},{"$f":"'Hidden Summary'!M83","v":0},{"$f":"'Hidden Summary'!Z83","v":0},{"$f":"'Hidden Summary'!O83","v":0},null,{"$f":"'Hidden Summary'!Q83","v":0},{"$f":"'Hidden Summary'!U83","v":0},{"$f":"'Hidden Summary'!S83","v":0},{"$f":"'Hidden Summary'!X83","v":0},null,{"$f":"'Hidden Summary'!J83","v":0},{"$f":"'Hidden Summary'!L83","v":0},{"$f":"'Hidden Summary'!N83","v":0},{"$f":"'Hidden Summary'!AA83","v":0},{"$f":"'Hidden Summary'!P83","v":0},null,{"$f":"'Hidden Summary'!W83","v":0},{"$f":"'Hidden Summary'!Y83","v":0},{"$f":"'Hidden Summary'!R83","v":0},{"$f":"'Hidden Summary'!V83","v":0},{"$f":"'Hidden Summary'!T83","v":0},null,{"$error":"#DIV/0!"},{"$error":"#DIV/0!"},{"$error":"#DIV/0!"},0,0,0,{"$f":"'Hidden Summary'!AB83","v":0}]
[{"$f":"'Hidden Summary'!A84","v":0},null,{"$f":"'Hidden Summary'!D84","v":0},null,{"$f":"IF('Hidden Summary'!G84=\"Rational Method\",\"Rational\",IF('Hidden Summary'!G84=\"TR-55 Method\",\"TR-55\",IF('Hidden Summary'!G84=\"USGS-5030 Method\",\"USGS-5030\",IF('Hidden Summary'!G84=\"USGS-5158 Method\",\"USGS-5158\",IF('Hidden Summary'!G84=\"User Input Method\",\"User Input\",\"\")))))","v":""},null,{"$f":"'Hidden Summary'!I84","v":0},{"$f":"'Hidden Summary'!K84","v":0},{"$f":"'Hidden Summary'!M84","v":0},{"$f":"'Hidden Summary'!Z84","v":0},{"$f":"'Hidden Summary'!O84","v":0},null,{"$f":"'Hidden Summary'!Q84","v":0},{"$f":"'Hidden Summary'!U84","v":0},{"$f":"'Hidden Summary'!S84","v":0},{"$f":"'Hidden Summary'!X84","v":0},null,{"$f":"'Hidden Summary'!J84","v":0},{"$f":"'Hidden Summary'!L84","v":0},{"$f":"'Hidden Summary'!N84","v":0},{"$f":"'Hidden Summary'!AA84","v":0},{"$f":"'Hidden Summary'!P84","v":0},null,{"$f":"'Hidden Summary'!W84","v":0},{"$f":"'Hidden Summary'!Y84","v":0},{"$f":"'Hidden Summary'!R84","v":0},{"$f":"'Hidden Summary'!V84","v":0},{"$f":"'Hidden Summary'!T84","v":0},null,{"$error":"#DIV/0!"},{"$error":"#DIV/0!"},{"$error":"#DIV/0!"},0,0,0,{"$f":"'Hidden Summary'!AB84","v":0}]
[{"$f":"'Hidden Summary'!A85","v":0},null,{"$f":"'Hidden Summary'!D85","v":0},null,{"$f":"IF('Hidden Summary'!G85=\"Rational Method\",\"Rational\",IF('Hidden Summary'!G85=\"TR-55 Method\",\"TR-55\",IF('Hidden Summary'!G85=\"USGS-5030 Method\",\"USGS-5030\",IF('Hidden Summary'!G85=\"USGS-5158 Method\",\"USGS-5158\",IF('Hidden Summary'!G85=\"User Input Method\",\"User Input\",\"\")))))","v":""},null,{"$f":"'Hidden Summary'!I85","v":0},{"$f":"'Hidden Summary'!K85","v":0},{"$f":"'Hidden Summary'!M85","v":0},{"$f":"'Hidden Summary'!Z85","v":0},{"$f":"'Hidden Summary'!O85","v":0},null,{"$f":"'Hidden Summary'!Q85","v":0},{"$f":"'Hidden Summary'!U85","v":0},{"$f":"'Hidden Summary'!S85","v":0},{"$f":"'Hidden Summary'!X85","v":0},null,{"$f":"'Hidden Summary'!J85","v":0},{"$f":"'Hidden Summary'!L85","v":0},{"$f":"'Hidden Summary'!N85","v":0},{"$f":"'Hidden Summary'!AA85","v":0},{"$f":"'Hidden Summary'!P85","v":0},null,{"$f":"'Hidden Summary'!W85","v":0},{"$f":"'Hidden Summary'!Y85","v":0},{"$f":"'Hidden Summary'!R85","v":0},{"$f":"'Hidden Summary'!V85","v":0},{"$f":"'Hidden Summary'!T85","v":0},null,{"$error":"#DIV/0!"},{"$error":"#DIV/0!"},{"$error":"#DIV/0!"},0,0,0,{"$f":"'Hidden Summary'!AB85","v":0}]
[{"$f":"'Hidden Summary'!A86","v":0},null,{"$f":"'Hidden Summary'!D86","v":0},null,{"$f":"IF('Hidden Summary'!G86=\"Rational Method\",\"Rational\",IF('Hidden Summary'!G86=\"TR-55 Method\",\"TR-55\",IF('Hidden Summary'!G86=\"USGS-5030 Method\",\"USGS-5030\",IF('Hidden Summary'!G86=\"USGS-5158 Method\",\"USGS-5158\",IF('Hidden Summary'!G86=\"User Input Method\",\"User Input\",\"\")))))","v":""},null,{"$f":"'Hidden Summary'!I86","v":0},{"$f":"'Hidden Summary'!K86","v":0},{"$f":"'Hidden Summary'!M86","v":0},{"$f":"'Hidden Summary'!Z86","v":0},{"$f":"'Hidden Summary'!O86","v":0},null,{"$f":"'Hidden Summary'!Q86","v":0},{"$f":"'Hidden Summary'!U86","v":0},{"$f":"'Hidden Summary'!S86","v":0},{"$f":"'Hidden Summary'!X86","v":0},null,{"$f":"'Hidden Summary'!J86","v":0},{"$f":"'Hidden Summary'!L86","v":0},{"$f":"'Hidden Summary'!N86","v":0},{"$f":"'Hidden Summary'!AA86","v":0},{"$f":"'Hidden Summary'!P86","v":0},null,{"$f":"'Hidden Summary'!W86","v":0},{"$f":"'Hidden Summary'!Y86","v":0},{"$f":"'Hidden Summary'!R86","v":0},{"$f":"'Hidden Summary'!V86","v":0},{"$f":"'Hidden Summary'!T86","v":0},null,{"$error":"#DIV/0!"},{"$error":"#DIV/0!"},{"$error":"#DIV/0!"},0,0,0,{"$f":"'Hidden Summary'!AB86","v":0}]
[{"$f":"'Hidden Summary'!A87","v":0},null,{"$f":"'Hidden Summary'!D87","v":0},null,{"$f":"IF('Hidden Summary'!G87=\"Rational Method\",\"Rational\",IF('Hidden Summary'!G87=\"TR-55 Method\",\"TR-55\",IF('Hidden Summary'!G87=\"USGS-5030 Method\",\"USGS-5030\",IF('Hidden Summary'!G87=\"USGS-5158 Method\",\"USGS-5158\",IF('Hidden Summary'!G87=\"User Input Method\",\"User Input\",\"\")))))","v":""},null,{"$f":"'Hidden Summary'!I87","v":0},{"$f":"'Hidden Summary'!K87","v":0},{"$f":"'Hidden Summary'!M87","v":0},{"$f":"'Hidden Summary'!Z87","v":0},{"$f":"'Hidden Summary'!O87","v":0},null,{"$f":"'Hidden Summary'!Q87","v":0},{"$f":"'Hidden Summary'!U87","v":0},{"$f":"'Hidden Summary'!S87","v":0},{"$f":"'Hidden Summary'!X87","v":0},null,{"$f":"'Hidden Summary'!J87","v":0},{"$f":"'Hidden Summary'!L87","v":0},{"$f":"'Hidden Summary'!N87","v":0},{"$f":"'Hidden Summary'!AA87","v":0},{"$f":"'Hidden Summary'!P87","v":0},null,{"$f":"'Hidden Summary'!W87","v":0},{"$f":"'Hidden Summary'!Y87","v":0},{"$f":"'Hidden Summary'!R87","v":0},{"$f":"'Hidden Summary'!V87","v":0},{"$f":"'Hidden Summary'!T87","v":0},null,{"$error":"#DIV/0!"},{"$error":"#DIV/0!"},{"$error":"#DIV/0!"},0,0,0,{"$f":"'Hidden Summary'!AB87","v":0}]
[{"$f":"'Hidden Summary'!A88","v":0},null,{"$f":"'Hidden Summary'!D88","v":0},null,{"$f":"IF('Hidden Summary'!G88=\"Rational Method\",\"Rational\",IF('Hidden Summary'!G88=\"TR-55 Method\",\"TR-55\",IF('Hidden Summary'!G88=\"USGS-5030 Method\",\"USGS-5030\",IF('Hidden Summary'!G88=\"USGS-5158 Method\",\"USGS-5158\",IF('Hidden Summary'!G88=\"User Input Method\",\"User Input\",\"\")))))","v":""},null,{"$f":"'Hidden Summary'!I88","v":0},{"$f":"'Hidden Summary'!K88","v":0},{"$f":"'Hidden Summary'!M88","v":0},{"$f":"'Hidden Summary'!Z88","v":0},{"$f":"'Hidden Summary'!O88","v":0},null,{"$f":"'Hidden Summary'!Q88","v":0},{"$f":"'Hidden Summary'!U88","v":0},{"$f":"'Hidden Summary'!S88","v":0},{"$f":"'Hidden Summary'!X88","v":0},null,{"$f":"'Hidden Summary'!J88","v":0},{"$f":"'Hidden Summary'!L88","v":0},{"$f":"'Hidden Summary'!N88","v":0},{"$f":"'Hidden Summary'!AA88","v":0},{"$f":"'Hidden Summary'!P88","v":0},null,{"$f":"'Hidden Summary'!W88","v":0},{"$f":"'Hidden Summary'!Y88","v":0},{"$f":"'Hidden Summary'!R88","v":0},{"$f":"'Hidden Summary'!V88","v":0},{"$f":"'Hidden Summary'!T88","v":0},null,{"$error":"#DIV/0!"},{"$error":"#DIV/0!"},{"$error":"#DIV/0!"},0,0,0,{"$f":"'Hidden Summary'!AB88","v":0}]
[{"$f":"'Hidden Summary'!A89","v":0},null,{"$f":"'Hidden Summary'!D89","v":0},null,{"$f":"IF('Hidden Summary'!G89=\"Rational Method\",\"Rational\",IF('Hidden Summary'!G89=\"TR-55 Method\",\"TR-55\",IF('Hidden Summary'!G89=\"USGS-5030 Method\",\"USGS-5030\",IF('Hidden Summary'!G89=\"USGS-5158 Method\",\"USGS-5158\",IF('Hidden Summary'!G89=\"User Input Method\",\"User Input\",\"\")))))","v":""},null,{"$f":"'Hidden Summary'!I89","v":0},{"$f":"'Hidden Summary'!K89","v":0},{"$f":"'Hidden Summary'!M89","v":0},{"$f":"'Hidden Summary'!Z89","v":0},{"$f":"'Hidden Summary'!O89","v":0},null,{"$f":"'Hidden Summary'!Q89","v":0},{"$f":"'Hidden Summary'!U89","v":0},{"$f":"'Hidden Summary'!S89","v":0},{"$f":"'Hidden Summary'!X89","v":0},null,{"$f":"'Hidden Summary'!J89","v":0},{"$f":"'Hidden Summary'!L89","v":0},{"$f":"'Hidden Summary'!N89","v":0},{"$f":"'Hidden Summary'!AA89","v":0},{"$f":"'Hidden Summary'!P89","v":0},null,{"$f":"'Hidden Summary'!W89","v":0},{"$f":"'Hidden Summary'!Y89","v":0},{"$f":"'Hidden Summary'!R89","v":0},{"$f":"'Hidden Summary'!V89","v":0},{"$f":"'Hidden Summary'!T89","v":0},null,{"$error":"#DIV/0!"},{"$error":"#DIV/0!"},{"$error":"#DIV/0!"},0,0,0,{"$f":"'Hidden Summary'!AB89","v":0}]
[{"$f":"'Hidden Summary'!A90","v":0},null,{"$f":"'Hidden Summary'!D90","v":0},null,{"$f":"IF('Hidden Summary'!G90=\"Rational Method\",\"Rational\",IF('Hidden Summary'!G90=\"TR-55 Method\",\"TR-55\",IF('Hidden Summary'!G90=\"USGS-5030 Method\",\"USGS-5030\",IF('Hidden Summary'!G90=\"USGS-5158 Method\",\"USGS-5158\",IF('Hidden Summary'!G90=\"User Input Method\",\"User Input\",\"\")))))","v":""},null,{"$f":"'Hidden Summary'!I90","v":0},{"$f":"'Hidden Summary'!K90","v":0},{"$f":"'Hidden Summary'!M90","v":0},{"$f":"'Hidden Summary'!Z90","v":0},{"$f":"'Hidden Summary'!O90","v":0},null,{"$f":"'Hidden Summary'!Q90","v":0},{"$f":"'Hidden Summary'!U90","v":0},{"$f":"'Hidden Summary'!S90","v":0},{"$f":"'Hidden Summary'!X90","v":0},null,{"$f":"'Hidden Summary'!J90","v":0},{"$f":"'Hidden Summary'!L90","v":0},{"$f":"'Hidden Summary'!N90","v":0},{"$f":"'Hidden Summary'!AA90","v":0},{"$f":"'Hidden Summary'!P90","v":0},null,{"$f":"'Hidden Summary'!W90","v":0},{"$f":"'Hidden Summary'!Y90","v":0},{"$f":"'Hidden Summary'!R90","v":0},{"$f":"'Hidden Summary'!V90","v":0},{"$f":"'Hidden Summary'!T90","v":0},null,{"$error":"#DIV/0!"},{"$error":"#DIV/0!"},{"$error":"#DIV/0!"},0,0,0,{"$f":"'Hidden Summary'!AB90","v":0}]
[{"$f":"'Hidden Summary'!A91","v":0},null,{"$f":"'Hidden Summary'!D91","v":0},null,{"$f":"IF('Hidden Summary'!G91=\"Rational Method\",\"Rational\",IF('Hidden Summary'!G91=\"TR-55 Method\",\"TR-55\",IF('Hidden Summary'!G91=\"USGS-5030 Method\",\"USGS-5030\",IF('Hidden Summary'!G91=\"USGS-5158 Method\",\"USGS-5158\",IF('Hidden Summary'!G91=\"User Input Method\",\"User Input\",\"\")))))","v":""},null,{"$f":"'Hidden Summary'!I91","v":0},{"$f":"'Hidden Summary'!K91","v":0},{"$f":"'Hidden Summary'!M91","v":0},{"$f":"'Hidden Summary'!Z91","v":0},{"$f":"'Hidden Summary'!O91","v":0},null,{"$f":"'Hidden Summary'!Q91","v":0},{"$f":"'Hidden Summary'!U91","v":0},{"$f":"'Hidden Summary'!S91","v":0},{"$f":"'Hidden Summary'!X91","v":0},null,{"$f":"'Hidden Summary'!J91","v":0},{"$f":"'Hidden Summary'!L91","v":0},{"$f":"'Hidden Summary'!N91","v":0},{"$f":"'Hidden Summary'!AA91","v":0},{"$f":"'Hidden Summary'!P91","v":0},null,{"$f":"'Hidden Summary'!W91","v":0},{"$f":"'Hidden Summary'!Y91","v":0},{"$f":"'Hidden Summary'!R91","v":0},{"$f":"'Hidden Summary'!V91","v":0},{"$f":"'Hidden Summary'!T91","v":0},null,{"$error":"#DIV/0!"},{"$error":"#DIV/0!"},{"$error":"#DIV/0!"},0,0,0,{"$f":"'Hidden Summary'!AB91","v":0}]
[{"$f":"'Hidden Summary'!A92","v":0},null,{"$f":"'Hidden Summary'!D92","v":0},null,{"$f":"IF('Hidden Summary'!G92=\"Rational Method\",\"Rational\",IF('Hidden Summary'!G92=\"TR-55 Method\",\"TR-55\",IF('Hidden Summary'!G92=\"USGS-5030 Method\",\"USGS-5030\",IF('Hidden Summary'!G92=\"USGS-5158 Method\",\"USGS-5158\",IF('Hidden Summary'!G92=\"User Input Method\",\"User Input\",\"\")))))","v":""},null,{"$f":"'Hidden Summary'!I92","v":0},{"$f":"'Hidden Summary'!K92","v":0},{"$f":"'Hidden Summary'!M92","v":0},{"$f":"'Hidden Summary'!Z92","v":0},{"$f":"'Hidden Summary'!O92","v":0},null,{"$f":"'Hidden Summary'!Q92","v":0},{"$f":"'Hidden Summary'!U92","v":0},{"$f":"'Hidden Summary'!S92","v":0},{"$f":"'Hidden Summary'!X92","v":0},null,{"$f":"'Hidden Summary'!J92","v":0},{"$f":"'Hidden Summary'!L92","v":0},{"$f":"'Hidden Summary'!N92","v":0},{"$f":"'Hidden Summary'!AA92","v":0},{"$f":"'Hidden Summary'!P92","v":0},null,{"$f":"'Hidden Summary'!W92","v":0},{"$f":"'Hidden Summary'!Y92","v":0},{"$f":"'Hidden Summary'!R92","v":0},{"$f":"'Hidden Summary'!V92","v":0},{"$f":"'Hidden Summary'!T92","v":0},null,{"$error":"#DIV/0!"},{"$error":"#DIV/0!"},{"$error":"#DIV/0!"},0,0,0,{"$f":"'Hidden Summary'!AB92","v":0}]
[{"$f":"'Hidden Summary'!A93","v":0},null,{"$f":"'Hidden Summary'!D93","v":0},null,{"$f":"IF('Hidden Summary'!G93=\"Rational Method\",\"Rational\",IF('Hidden Summary'!G93=\"TR-55 Method\",\"TR-55\",IF('Hidden Summary'!G93=\"USGS-5030 Method\",\"USGS-5030\",IF('Hidden Summary'!G93=\"USGS-5158 Method\",\"USGS-5158\",IF('Hidden Summary'!G93=\"User Input Method\",\"User Input\",\"\")))))","v":""},null,{"$f":"'Hidden Summary'!I93","v":0},{"$f":"'Hidden Summary'!K93","v":0},{"$f":"'Hidden Summary'!M93","v":0},{"$f":"'Hidden Summary'!Z93","v":0},{"$f":"'Hidden Summary'!O93","v":0},null,{"$f":"'Hidden Summary'!Q93","v":0},{"$f":"'Hidden Summary'!U93","v":0},{"$f":"'Hidden Summary'!S93","v":0},{"$f":"'Hidden Summary'!X93","v":0},null,{"$f":"'Hidden Summary'!J93","v":0},{"$f":"'Hidden Summary'!L93","v":0},{"$f":"'Hidden Summary'!N93","v":0},{"$f":"'Hidden Summary'!AA93","v":0},{"$f":"'Hidden Summary'!P93","v":0},null,{"$f":"'Hidden Summary'!W93","v":0},{"$f":"'Hidden Summary'!Y93","v":0},{"$f":"'Hidden Summary'!R93","v":0},{"$f":"'Hidden Summary'!V93","v":0},{"$f":"'Hidden Summary'!T93","v":0},null,{"$error":"#DIV/0!"},{"$error":"#DIV/0!"},{"$error":"#DIV/0!"},0,0,0,{"$f":"'Hidden Summary'!AB93","v":0}]
[{"$f":"'Hidden Summary'!A94","v":0},null,{"$f":"'Hidden Summary'!D94","v":0},null,{"$f":"IF('Hidden Summary'!G94=\"Rational Method\",\"Rational\",IF('Hidden Summary'!G94=\"TR-55 Method\",\"TR-55\",IF('Hidden Summary'!G94=\"USGS-5030 Method\",\"USGS-5030\",IF('Hidden Summary'!G94=\"USGS-5158 Method\",\"USGS-5158\",IF('Hidden Summary'!G94=\"User Input Method\",\"User Input\",\"\")))))","v":""},null,{"$f":"'Hidden Summary'!I94","v":0},{"$f":"'Hidden Summary'!K94","v":0},{"$f":"'Hidden Summary'!M94","v":0},{"$f":"'Hidden Summary'!Z94","v":0},{"$f":"'Hidden Summary'!O94","v":0},null,{"$f":"'Hidden Summary'!Q94","v":0},{"$f":"'Hidden Summary'!U94","v":0},{"$f":"'Hidden Summary'!S94","v":0},{"$f":"'Hidden Summary'!X94","v":0},null,{"$f":"'Hidden Summary'!J94","v":0},{"$f":"'Hidden Summary'!L94","v":0},{"$f":"'Hidden Summary'!N94","v":0},{"$f":"'Hidden Summary'!AA94","v":0},{"$f":"'Hidden Summary'!P94","v":0},null,{"$f":"'Hidden Summary'!W94","v":0},{"$f":"'Hidden Summary'!Y94","v":0},{"$f":"'Hidden Summary'!R94","v":0},{"$f":"'Hidden Summary'!V94","v":0},{"$f":"'Hidden Summary'!T94","v":0},null,{"$error":"#DIV/0!"},{"$error":"#DIV/0!"},{"$error":"#DIV/0!"},0,0,0,{"$f":"'Hidden Summary'!AB94","v":0}]
[{"$f":"'Hidden Summary'!A95","v":0},null,{"$f":"'Hidden Summary'!D95","v":0},null,{"$f":"IF('Hidden Summary'!G95=\"Rational Method\",\"Rational\",IF('Hidden Summary'!G95=\"TR-55 Method\",\"TR-55\",IF('Hidden Summary'!G95=\"USGS-5030 Method\",\"USGS-5030\",IF('Hidden Summary'!G95=\"USGS-5158 Method\",\"USGS-5158\",IF('Hidden Summary'!G95=\"User Input Method\",\"User Input\",\"\")))))","v":""},null,{"$f":"'Hidden Summary'!I95","v":0},{"$f":"'Hidden Summary'!K95","v":0},{"$f":"'Hidden Summary'!M95","v":0},{"$f":"'Hidden Summary'!Z95","v":0},{"$f":"'Hidden Summary'!O95","v":0},null,{"$f":"'Hidden Summary'!Q95","v":0},{"$f":"'Hidden Summary'!U95","v":0},{"$f":"'Hidden Summary'!S95","v":0},{"$f":"'Hidden Summary'!X95","v":0},null,{"$f":"'Hidden Summary'!J95","v":0},{"$f":"'Hidden Summary'!L95","v":0},{"$f":"'Hidden Summary'!N95","v":0},{"$f":"'Hidden Summary'!AA95","v":0},{"$f":"'Hidden Summary'!P95","v":0},null,{"$f":"'Hidden Summary'!W95","v":0},{"$f":"'Hidden Summary'!Y95","v":0},{"$f":"'Hidden Summary'!R95","v":0},{"$f":"'Hidden Summary'!V95","v":0},{"$f":"'Hidden Summary'!T95","v":0},null,{"$error":"#DIV/0!"},{"$error":"#DIV/0!"},{"$error":"#DIV/0!"},0,0,0,{"$f":"'Hidden Summary'!AB95","v":0}]
[{"$f":"'Hidden Summary'!A96","v":0},null,{"$f":"'Hidden Summary'!D96","v":0},null,{"$f":"IF('Hidden Summary'!G96=\"Rational Method\",\"Rational\",IF('Hidden Summary'!G96=\"TR-55 Method\",\"TR-55\",IF('Hidden Summary'!G96=\"USGS-5030 Method\",\"USGS-5030\",IF('Hidden Summary'!G96=\"USGS-5158 Method\",\"USGS-5158\",IF('Hidden Summary'!G96=\"User Input Method\",\"User Input\",\"\")))))","v":""},null,{"$f":"'Hidden Summary'!I96","v":0},{"$f":"'Hidden Summary'!K96","v":0},{"$f":"'Hidden Summary'!M96","v":0},{"$f":"'Hidden Summary'!Z96","v":0},{"$f":"'Hidden Summary'!O96","v":0},null,{"$f":"'Hidden Summary'!Q96","v":0},{"$f":"'Hidden Summary'!U96","v":0},{"$f":"'Hidden Summary'!S96","v":0},{"$f":"'Hidden Summary'!X96","v":0},null,{"$f":"'Hidden Summary'!J96","v":0},{"$f":"'Hidden Summary'!L96","v":0},{"$f":"'Hidden Summary'!N96","v":0},{"$f":"'Hidden Summary'!AA96","v":0},{"$f":"'Hidden Summary'!P96","v":0},null,{"$f":"'Hidden Summary'!W96","v":0},{"$f":"'Hidden Summary'!Y96","v":0},{"$f":"'Hidden Summary'!R96","v":0},{"$f":"'Hidden Summary'!V96","v":0},{"$f":"'Hidden Summary'!T96","v":0},null,{"$error":"#DIV/0!"},{"$error":"#DIV/0!"},{"$error":"#DIV/0!"},0,0,0,{"$f":"'Hidden Summary'!AB96","v":0}]
[{"$f":"'Hidden Summary'!A97","v":0},null,{"$f":"'Hidden Summary'!D97","v":0},null,{"$f":"IF('Hidden Summary'!G97=\"Rational Method\",\"Rational\",IF('Hidden Summary'!G97=\"TR-55 Method\",\"TR-55\",IF('Hidden Summary'!G97=\"USGS-5030 Method\",\"USGS-5030\",IF('Hidden Summary'!G97=\"USGS-5158 Method\",\"USGS-5158\",IF('Hidden Summary'!G97=\"User Input Method\",\"User Input\",\"\")))))","v":""},null,{"$f":"'Hidden Summary'!I97","v":0},{"$f":"'Hidden Summary'!K97","v":0},{"$f":"'Hidden Summary'!M97","v":0},{"$f":"'Hidden Summary'!Z97","v":0},{"$f":"'Hidden Summary'!O97","v":0},null,{"$f":"'Hidden Summary'!Q97","v":0},{"$f":"'Hidden Summary'!U97","v":0},{"$f":"'Hidden Summary'!S97","v":0},{"$f":"'Hidden Summary'!X97","v":0},null,{"$f":"'Hidden Summary'!J97","v":0},{"$f":"'Hidden Summary'!L97","v":0},{"$f":"'Hidden Summary'!N97","v":0},{"$f":"'Hidden Summary'!AA97","v":0},{"$f":"'Hidden Summary'!P97","v":0},null,{"$f":"'Hidden Summary'!W97","v":0},{"$f":"'Hidden Summary'!Y97","v":0},{"$f":"'Hidden Summary'!R97","v":0},{"$f":"'Hidden Summary'!V97","v":0},{"$f":"'Hidden Summary'!T97","v":0},null,{"$error":"#DIV/0!"},{"$error":"#DIV/0!"},{"$error":"#DIV/0!"},0,0,0,{"$f":"'Hidden Summary'!AB97","v":0}]
[{"$f":"'Hidden Summary'!A98","v":0},null,{"$f":"'Hidden Summary'!D98","v":0},null,{"$f":"IF('Hidden Summary'!G98=\"Rational Method\",\"Rational\",IF('Hidden Summary'!G98=\"TR-55 Method\",\"TR-55\",IF('Hidden Summary'!G98=\"USGS-5030 Method\",\"USGS-5030\",IF('Hidden Summary'!G98=\"USGS-5158 Method\",\"USGS-5158\",IF('Hidden Summary'!G98=\"User Input Method\",\"User Input\",\"\")))))","v":""},null,{"$f":"'Hidden Summary'!I98","v":0},{"$f":"'Hidden Summary'!K98","v":0},{"$f":"'Hidden Summary'!M98","v":0},{"$f":"'Hidden Summary'!Z98","v":0},{"$f":"'Hidden Summary'!O98","v":0},null,{"$f":"'Hidden Summary'!Q98","v":0},{"$f":"'Hidden Summary'!U98","v":0},{"$f":"'Hidden Summary'!S98","v":0},{"$f":"'Hidden Summary'!X98","v":0},null,{"$f":"'Hidden Summary'!J98","v":0},{"$f":"'Hidden Summary'!L98","v":0},{"$f":"'Hidden Summary'!N98","v":0},{"$f":"'Hidden Summary'!AA98","v":0},{"$f":"'Hidden Summary'!P98","v":0},null,{"$f":"'Hidden Summary'!W98","v":0},{"$f":"'Hidden Summary'!Y98","v":0},{"$f":"'Hidden Summary'!R98","v":0},{"$f":"'Hidden Summary'!V98","v":0},{"$f":"'Hidden Summary'!T98","v":0},null,{"$error":"#DIV/0!"},{"$error":"#DIV/0!"},{"$error":"#DIV/0!"},0,0,0,{"$f":"'Hidden Summary'!AB98","v":0}]
[{"$f":"'Hidden Summary'!A99","v":0},null,{"$f":"'Hidden Summary'!D99","v":0},null,{"$f":"IF('Hidden Summary'!G99=\"Rational Method\",\"Rational\",IF('Hidden Summary'!G99=\"TR-55 Method\",\"TR-55\",IF('Hidden Summary'!G99=\"USGS-5030 Method\",\"USGS-5030\",IF('Hidden Summary'!G99=\"USGS-5158 Method\",\"USGS-5158\",IF('Hidden Summary'!G99=\"User Input Method\",\"User Input\",\"\")))))","v":""},null,{"$f":"'Hidden Summary'!I99","v":0},{"$f":"'Hidden Summary'!K99","v":0},{"$f":"'Hidden Summary'!M99","v":0},{"$f":"'Hidden Summary'!Z99","v":0},{"$f":"'Hidden Summary'!O99","v":0},null,{"$f":"'Hidden Summary'!Q99","v":0},{"$f":"'Hidden Summary'!U99","v":0},{"$f":"'Hidden Summary'!S99","v":0},{"$f":"'Hidden Summary'!X99","v":0},null,{"$f":"'Hidden Summary'!J99","v":0},{"$f":"'Hidden Summary'!L99","v":0},{"$f":"'Hidden Summary'!N99","v":0},{"$f":"'Hidden Summary'!AA99","v":0},{"$f":"'Hidden Summary'!P99","v":0},null,{"$f":"'Hidden Summary'!W99","v":0},{"$f":"'Hidden Summary'!Y99","v":0},{"$f":"'Hidden Summary'!R99","v":0},{"$f":"'Hidden Summary'!V99","v":0},{"$f":"'Hidden Summary'!T99","v":0},null,{"$error":"#DIV/0!"},{"$error":"#DIV/0!"},{"$error":"#DIV/0!"},0,0,0,{"$f":"'Hidden Summary'!AB99","v":0}]
[{"$f":"'Hidden Summary'!A100","v":0},null,{"$f":"'Hidden Summary'!D100","v":0},null,{"$f":"IF('Hidden Summary'!G100=\"Rational Method\",\"Rational\",IF('Hidden Summary'!G100=\"TR-55 Method\",\"TR-55\",IF('Hidden Summary'!G100=\"USGS-5030 Method\",\"USGS-5030\",IF('Hidden Summary'!G100=\"USGS-5158 Method\",\"USGS-5158\",IF('Hidden Summary'!G100=\"User Input Method\",\"User Input\",\"\")))))","v":""},null,{"$f":"'Hidden Summary'!I100","v":0},{"$f":"'Hidden Summary'!K100","v":0},{"$f":"'Hidden Summary'!M100","v":0},{"$f":"'Hidden Summary'!Z100","v":0},{"$f":"'Hidden Summary'!O100","v":0},null,{"$f":"'Hidden Summary'!Q100","v":0},{"$f":"'Hidden Summary'!U100","v":0},{"$f":"'Hidden Summary'!S100","v":0},{"$f":"'Hidden Summary'!X100","v":0},null,{"$f":"'Hidden Summary'!J100","v":0},{"$f":"'Hidden Summary'!L100","v":0},{"$f":"'Hidden Summary'!N100","v":0},{"$f":"'Hidden Summary'!AA100","v":0},{"$f":"'Hidden Summary'!P100","v":0},null,{"$f":"'Hidden Summary'!W100","v":0},{"$f":"'Hidden Summary'!Y100","v":0},{"$f":"'Hidden Summary'!R100","v":0},{"$f":"'Hidden Summary'!V100","v":0},{"$f":"'Hidden Summary'!T100","v":0},null,{"$error":"#DIV/0!"},{"$error":"#DIV/0!"},{"$error":"#DIV/0!"},0,0,0,{"$f":"'Hidden Summary'!AB100","v":0}]
[{"$f":"'Hidden Summary'!A101","v":0},null,{"$f":"'Hidden Summary'!D101","v":0},null,{"$f":"IF('Hidden Summary'!G101=\"Rational Method\",\"Rational\",IF('Hidden Summary'!G101=\"TR-55 Method\",\"TR-55\",IF('Hidden Summary'!G101=\"USGS-5030 Method\",\"USGS-5030\",IF('Hidden Summary'!G101=\"USGS-5158 Method\",\"USGS-5158\",IF('Hidden Summary'!G101=\"User Input Method\",\"User Input\",\"\")))))","v":""},null,{"$f":"'Hidden Summary'!I101","v":0},{"$f":"'Hidden Summary'!K101","v":0},{"$f":"'Hidden Summary'!M101","v":0},{"$f":"'Hidden Summary'!Z101","v":0},{"$f":"'Hidden Summary'!O101","v":0},null,{"$f":"'Hidden Summary'!Q101","v":0},{"$f":"'Hidden Summary'!U101","v":0},{"$f":"'Hidden Summary'!S101","v":0},{"$f":"'Hidden Summary'!X101","v":0},null,{"$f":"'Hidden Summary'!J101","v":0},{"$f":"'Hidden Summary'!L101","v":0},{"$f":"'Hidden Summary'!N101","v":0},{"$f":"'Hidden Summary'!AA101","v":0},{"$f":"'Hidden Summary'!P101","v":0},null,{"$f":"'Hidden Summary'!W101","v":0},{"$f":"'Hidden Summary'!Y101","v":0},{"$f":"'Hidden Summary'!R101","v":0},{"$f":"'Hidden Summary'!V101","v":0},{"$f":"'Hidden Summary'!T101","v":0},null,{"$error":"#DIV/0!"},{"$error":"#DIV/0!"},{"$error":"#DIV/0!"},0,0,0,{"$f":"'Hidden Summary'!AB101","v":0}]
[{"$f":"'Hidden Summary'!A102","v":0},null,{"$f":"'Hidden Summary'!D102","v":0},null,{"$f":"IF('Hidden Summary'!G102=\"Rational Method\",\"Rational\",IF('Hidden Summary'!G102=\"TR-55 Method\",\"TR-55\",IF('Hidden Summary'!G102=\"USGS-5030 Method\",\"USGS-5030\",IF('Hidden Summary'!G102=\"USGS-5158 Method\",\"USGS-5158\",IF('Hidden Summary'!G102=\"User Input Method\",\"User Input\",\"\")))))","v":""},null,{"$f":"'Hidden Summary'!I102","v":0},{"$f":"'Hidden Summary'!K102","v":0},{"$f":"'Hidden Summary'!M102","v":0},{"$f":"'Hidden Summary'!Z102","v":0},{"$f":"'Hidden Summary'!O102","v":0},null,{"$f":"'Hidden Summary'!Q102","v":0},{"$f":"'Hidden Summary'!U102","v":0},{"$f":"'Hidden Summary'!S102","v":0},{"$f":"'Hidden Summary'!X102","v":0},null,{"$f":"'Hidden Summary'!J102","v":0},{"$f":"'Hidden Summary'!L102","v":0},{"$f":"'Hidden Summary'!N102","v":0},{"$f":"'Hidden Summary'!AA102","v":0},{"$f":"'Hidden Summary'!P102","v":0},null,{"$f":"'Hidden Summary'!W102","v":0},{"$f":"'Hidden Summary'!Y102","v":0},{"$f":"'Hidden Summary'!R102","v":0},{"$f":"'Hidden Summary'!V102","v":0},{"$f":"'Hidden Summary'!T102","v":0},null,{"$error":"#DIV/0!"},{"$error":"#DIV/0!"},{"$error":"#DIV/0!"},0,0,0,{"$f":"'Hidden Summary'!AB102","v":0}]
[{"$f":"'Hidden Summary'!A103","v":0},null,{"$f":"'Hidden Summary'!D103","v":0},null,{"$f":"IF('Hidden Summary'!G103=\"Rational Method\",\"Rational\",IF('Hidden Summary'!G103=\"TR-55 Method\",\"TR-55\",IF('Hidden Summary'!G103=\"USGS-5030 Method\",\"USGS-5030\",IF('Hidden Summary'!G103=\"USGS-5158 Method\",\"USGS-5158\",IF('Hidden Summary'!G103=\"User Input Method\",\"User Input\",\"\")))))","v":""},null,{"$f":"'Hidden Summary'!I103","v":0},{"$f":"'Hidden Summary'!K103","v":0},{"$f":"'Hidden Summary'!M103","v":0},{"$f":"'Hidden Summary'!Z103","v":0},{"$f":"'Hidden Summary'!O103","v":0},null,{"$f":"'Hidden Summary'!Q103","v":0},{"$f":"'Hidden Summary'!U103","v":0},{"$f":"'Hidden Summary'!S103","v":0},{"$f":"'Hidden Summary'!X103","v":0},null,{"$f":"'Hidden Summary'!J103","v":0},{"$f":"'Hidden Summary'!L103","v":0},{"$f":"'Hidden Summary'!N103","v":0},{"$f":"'Hidden Summary'!AA103","v":0},{"$f":"'Hidden Summary'!P103","v":0},null,{"$f":"'Hidden Summary'!W103","v":0},{"$f":"'Hidden Summary'!Y103","v":0},{"$f":"'Hidden Summary'!R103","v":0},{"$f":"'Hidden Summary'!V103","v":0},{"$f":"'Hidden Summary'!T103","v":0},null,{"$error":"#DIV/0!"},{"$error":"#DIV/0!"},{"$error":"#DIV/0!"},0,0,0,{"$f":"'Hidden Summary'!AB103","v":0}]
[{"$f":"'Hidden Summary'!A104","v":0},null,{"$f":"'Hidden Summary'!D104","v":0},null,{"$f":"IF('Hidden Summary'!G104=\"Rational Method\",\"Rational\",IF('Hidden Summary'!G104=\"TR-55 Method\",\"TR-55\",IF('Hidden Summary'!G104=\"USGS-5030 Method\",\"USGS-5030\",IF('Hidden Summary'!G104=\"USGS-5158 Method\",\"USGS-5158\",IF('Hidden Summary'!G104=\"User Input Method\",\"User Input\",\"\")))))","v":""},null,{"$f":"'Hidden Summary'!I104","v":0},{"$f":"'Hidden Summary'!K104","v":0},{"$f":"'Hidden Summary'!M104","v":0},{"$f":"'Hidden Summary'!Z104","v":0},{"$f":"'Hidden Summary'!O104","v":0},null,{"$f":"'Hidden Summary'!Q104","v":0},{"$f":"'Hidden Summary'!U104","v":0},{"$f":"'Hidden Summary'!S104","v":0},{"$f":"'Hidden Summary'!X104","v":0},null,{"$f":"'Hidden Summary'!J104","v":0},{"$f":"'Hidden Summary'!L104","v":0},{"$f":"'Hidden Summary'!N104","v":0},{"$f":"'Hidden Summary'!AA104","v":0},{"$f":"'Hidden Summary'!P104","v":0},null,{"$f":"'Hidden Summary'!W104","v":0},{"$f":"'Hidden Summary'!Y104","v":0},{"$f":"'Hidden Summary'!R104","v":0},{"$f":"'Hidden Summary'!V104","v":0},{"$f":"'Hidden Summary'!T104","v":0},null,{"$error":"#DIV/0!"},{"$error":"#DIV/0!"},{"$error":"#DIV/0!"},0,0,0,{"$f":"'Hidden Summary'!AB104","v":0}]
[{"$f":"'Hidden Summary'!A105","v":0},null,{"$f":"'Hidden Summary'!D105","v":0},null,{"$f":"IF('Hidden Summary'!G105=\"Rational Method\",\"Rational\",IF('Hidden Summary'!G105=\"TR-55 Method\",\"TR-55\",IF('Hidden Summary'!G105=\"USGS-5030 Method\",\"USGS-5030\",IF('Hidden Summary'!G105=\"USGS-5158 Method\",\"USGS-5158\",IF('Hidden Summary'!G105=\"User Input Method\",\"User Input\",\"\")))))","v":""},null,{"$f":"'Hidden Summary'!I105","v":0},{"$f":"'Hidden Summary'!K105","v":0},{"$f":"'Hidden Summary'!M105","v":0},{"$f":"'Hidden Summary'!Z105","v":0},{"$f":"'Hidden Summary'!O105","v":0},null,{"$f":"'Hidden Summary'!Q105","v":0},{"$f":"'Hidden Summary'!U105","v":0},{"$f":"'Hidden Summary'!S105","v":0},{"$f":"'Hidden Summary'!X105","v":0},null,{"$f":"'Hidden Summary'!J105","v":0},{"$f":"'Hidden Summary'!L105","v":0},{"$f":"'Hidden Summary'!N105","v":0},{"$f":"'Hidden Summary'!AA105","v":0},{"$f":"'Hidden Summary'!P105","v":0},null,{"$f":"'Hidden Summary'!W105","v":0},{"$f":"'Hidden Summary'!Y105","v":0},{"$f":"'Hidden Summary'!R105","v":0},{"$f":"'Hidden Summary'!V105","v":0},{"$f":"'Hidden Summary'!T105","v":0},null,{"$error":"#DIV/0!"},{"$error":"#DIV/0!"},{"$error":"#DIV/0!"},0,0,0,{"$f":"'Hidden Summary'!AB105","v":0}]
[{"$f":"'Hidden Summary'!A106","v":0},null,{"$f":"'Hidden Summary'!D106","v":0},null,{"$f":"IF('Hidden Summary'!G106=\"Rational Method\",\"Rational\",IF('Hidden Summary'!G106=\"TR-55 Method\",\"TR-55\",IF('Hidden Summary'!G106=\"USGS-5030 Method\",\"USGS-5030\",IF('Hidden Summary'!G106=\"USGS-5158 Method\",\"USGS-5158\",IF('Hidden Summary'!G106=\"User Input Method\",\"User Input\",\"\")))))","v":""},null,{"$f":"'Hidden Summary'!I106","v":0},{"$f":"'Hidden Summary'!K106","v":0},{"$f":"'Hidden Summary'!M106","v":0},{"$f":"'Hidden Summary'!Z106","v":0},{"$f":"'Hidden Summary'!O106","v":0},null,{"$f":"'Hidden Summary'!Q106","v":0},{"$f":"'Hidden Summary'!U106","v":0},{"$f":"'Hidden Summary'!S106","v":0},{"$f":"'Hidden Summary'!X106","v":0},null,{"$f":"'Hidden Summary'!J106","v":0},{"$f":"'Hidden Summary'!L106","v":0},{"$f":"'Hidden Summary'!N106","v":0},{"$f":"'Hidden Summary'!AA106","v":0},{"$f":"'Hidden Summary'!P106","v":0},null,{"$f":"'Hidden Summary'!W106","v":0},{"$f":"'Hidden Summary'!Y106","v":0},{"$f":"'Hidden Summary'!R106","v":0},{"$f":"'Hidden Summary'!V106","v":0},{"$f":"'Hidden Summary'!T106","v":0},null,{"$error":"#DIV/0!"},{"$error":"#DIV/0!"},{"$error":"#DIV/0!"},0,0,0,{"$f":"'Hidden Summary'!AB106","v":0}]
[{"$f":"'Hidden Summary'!A107","v":0},null,{"$f":"'Hidden Summary'!D107","v":0},null,{"$f":"IF('Hidden Summary'!G107=\"Rational Method\",\"Rational\",IF('Hidden Summary'!G107=\"TR-55 Method\",\"TR-55\",IF('Hidden Summary'!G107=\"USGS-5030 Method\",\"USGS-5030\",IF('Hidden Summary'!G107=\"USGS-5158 Method\",\"USGS-5158\",IF('Hidden Summary'!G107=\"User Input Method\",\"User Input\",\"\")))))","v":""},null,{"$f":"'Hidden Summary'!I107","v":0},{"$f":"'Hidden Summary'!K107","v":0},{"$f":"'Hidden Summary'!M107","v":0},{"$f":"'Hidden Summary'!Z107","v":0},{"$f":"'Hidden Summary'!O107","v":0},null,{"$f":"'Hidden Summary'!Q107","v":0},{"$f":"'Hidden Summary'!U107","v":0},{"$f":"'Hidden Summary'!S107","v":0},{"$f":"'Hidden Summary'!X107","v":0},null,{"$f":"'Hidden Summary'!J107","v":0},{"$f":"'Hidden Summary'!L107","v":0},{"$f":"'Hidden Summary'!N107","v":0},{"$f":"'Hidden Summary'!AA107","v":0},{"$f":"'Hidden Summary'!P107","v":0},null,{"$f":"'Hidden Summary'!W107","v":0},{"$f":"'Hidden Summary'!Y107","v":0},{"$f":"'Hidden Summary'!R107","v":0},{"$f":"'Hidden Summary'!V107","v":0},{"$f":"'Hidden Summary'!T107","v":0},null,{"$error":"#DIV/0!"},{"$error":"#DIV/0!"},{"$error":"#DIV/0!"},0,0,0,{"$f":"'Hidden Summary'!AB107","v":0}]
[{"$f":"'Hidden Summary'!A108","v":0},null,{"$f":"'Hidden Summary'!D108","v":0},null,{"$f":"IF('Hidden Summary'!G108=\"Rational Method\",\"Rational\",IF('Hidden Summary'!G108=\"TR-55 Method\",\"TR-55\",IF('Hidden Summary'!G108=\"USGS-5030 Method\",\"USGS-5030\",IF('Hidden Summary'!G108=\"USGS-5158 Method\",\"USGS-5158\",IF('Hidden Summary'!G108=\"User Input Method\",\"User Input\",\"\")))))","v":""},null,{"$f":"'Hidden Summary'!I108","v":0},{"$f":"'Hidden Summary'!K108","v":0},{"$f":"'Hidden Summary'!M108","v":0},{"$f":"'Hidden Summary'!Z108","v":0},{"$f":"'Hidden Summary'!O108","v":0},null,{"$f":"'Hidden Summary'!Q108","v":0},{"$f":"'Hidden Summary'!U108","v":0},{"$f":"'Hidden Summary'!S108","v":0},{"$f":"'Hidden Summary'!X108","v":0},null,{"$f":"'Hidden Summary'!J108","v":0},{"$f":"'Hidden Summary'!L108","v":0},{"$f":"'Hidden Summary'!N108","v":0},{"$f":"'Hidden Summary'!AA108","v":0},{"$f":"'Hidden Summary'!P108","v":0},null,{"$f":"'Hidden Summary'!W108","v":0},{"$f":"'Hidden Summary'!Y108","v":0},{"$f":"'Hidden Summary'!R108","v":0},{"$f":"'Hidden Summary'!V108","v":0},{"$f":"'Hidden Summary'!T108","v":0},null,{"$error":"#DIV/0!"},{"$error":"#DIV/0!"},{"$error":"#DIV/0!"},0,0,0,{"$f":"'Hidden Summary'!AB108","v":0}]
[{"$f":"'Hidden Summary'!A109","v":0},null,{"$f":"'Hidden Summary'!D109","v":0},null,{"$f":"IF('Hidden Summary'!G109=\"Rational Method\",\"Rational\",IF('Hidden Summary'!G109=\"TR-55 Method\",\"TR-55\",IF('Hidden Summary'!G109=\"USGS-5030 Method\",\"USGS-5030\",IF('Hidden Summary'!G109=\"USGS-5158 Method\",\"USGS-5158\",IF('Hidden Summary'!G109=\"User Input Method\",\"User Input\",\"\")))))","v":""},null,{"$f":"'Hidden Summary'!I109","v":0},{"$f":"'Hidden Summary'!K109","v":0},{"$f":"'Hidden Summary'!M109","v":0},{"$f":"'Hidden Summary'!Z109","v":0},{"$f":"'Hidden Summary'!O109","v":0},null,{"$f":"'Hidden Summary'!Q109","v":0},{"$f":"'Hidden Summary'!U109","v":0},{"$f":"'Hidden Summary'!S109","v":0},{"$f":"'Hidden Summary'!X109","v":0},null,{"$f":"'Hidden Summary'!J109","v":0},{"$f":"'Hidden Summary'!L109","v":0},{"$f":"'Hidden Summary'!N109","v":0},{"$f":"'Hidden Summary'!AA109","v":0},{"$f":"'Hidden Summary'!P109","v":0},null,{"$f":"'Hidden Summary'!W109","v":0},{"$f":"'Hidden Summary'!Y109","v":0},{"$f":"'Hidden Summary'!R109","v":0},{"$f":"'Hidden Summary'!V109","v":0},{"$f":"'Hidden Summary'!T109","v":0},null,{"$error":"#DIV/0!"},{"$error":"#DIV/0!"},{"$error":"#DIV/0!"},0,0,0,{"$f":"'Hidden Summary'!AB109","v":0}]
[{"$f":"'Hidden Summary'!A110","v":0},null,{"$f":"'Hidden Summary'!D110","v":0},null,{"$f":"IF('Hidden Summary'!G110=\"Rational Method\",\"Rational\",IF('Hidden Summary'!G110=\"TR-55 Method\",\"TR-55\",IF('Hidden Summary'!G110=\"USGS-5030 Method\",\"USGS-5030\",IF('Hidden Summary'!G110=\"USGS-5158 Method\",\"USGS-5158\",IF('Hidden Summary'!G110=\"User Input Method\",\"User Input\",\"\")))))","v":""},null,{"$f":"'Hidden Summary'!I110","v":0},{"$f":"'Hidden Summary'!K110","v":0},{"$f":"'Hidden Summary'!M110","v":0},{"$f":"'Hidden Summary'!Z110","v":0},{"$f":"'Hidden Summary'!O110","v":0},null,{"$f":"'Hidden Summary'!Q110","v":0},{"$f":"'Hidden Summary'!U110","v":0},{"$f":"'Hidden Summary'!S110","v":0},{"$f":"'Hidden Summary'!X110","v":0},null,{"$f":"'Hidden Summary'!J110","v":0},{"$f":"'Hidden Summary'!L110","v":0},{"$f":"'Hidden Summary'!N110","v":0},{"$f":"'Hidden Summary'!AA110","v":0},{"$f":"'Hidden Summary'!P110","v":0},null,{"$f":"'Hidden Summary'!W110","v":0},{"$f":"'Hidden Summary'!Y110","v":0},{"$f":"'Hidden Summary'!R110","v":0},{"$f":"'Hidden Summary'!V110","v":0},{"$f":"'Hidden Summary'!T110","v":0},null,{"$error":"#DIV/0!"},{"$error":"#DIV/0!"},{"$error":"#DIV/0!"},0,0,0,{"$f":"'Hidden Summary'!AB110","v":0}]
[{"$f":"'Hidden Summary'!A111","v":0},null,{"$f":"'Hidden Summary'!D111","v":0},null,{"$f":"IF('Hidden Summary'!G111=\"Rational Method\",\"Rational\",IF('Hidden Summary'!G111=\"TR-55 Method\",\"TR-55\",IF('Hidden Summary'!G111=\"USGS-5030 Method\",\"USGS-5030\",IF('Hidden Summary'!G111=\"USGS-5158 Method\",\"USGS-5158\",IF('Hidden Summary'!G111=\"User Input Method\",\"User Input\",\"\")))))","v":""},null,{"$f":"'Hidden Summary'!I111","v":0},{"$f":"'Hidden Summary'!K111","v":0},{"$f":"'Hidden Summary'!M111","v":0},{"$f":"'Hidden Summary'!Z111","v":0},{"$f":"'Hidden Summary'!O111","v":0},null,{"$f":"'Hidden Summary'!Q111","v":0},{"$f":"'Hidden Summary'!U111","v":0},{"$f":"'Hidden Summary'!S111","v":0},{"$f":"'Hidden Summary'!X111","v":0},null,{"$f":"'Hidden Summary'!J111","v":0},{"$f":"'Hidden Summary'!L111","v":0},{"$f":"'Hidden Summary'!N111","v":0},{"$f":"'Hidden Summary'!AA111","v":0},{"$f":"'Hidden Summary'!P111","v":0},null,{"$f":"'Hidden Summary'!W111","v":0},{"$f":"'Hidden Summary'!Y111","v":0},{"$f":"'Hidden Summary'!R111","v":0},{"$f":"'Hidden Summary'!V111","v":0},{"$f":"'Hidden Summary'!T111","v":0},null,{"$error":"#DIV/0!"},{"$error":"#DIV/0!"},{"$error":"#DIV/0!"},0,0,0,{"$f":"'Hidden Summary'!AB111","v":0}]
[{"$f":"'Hidden Summary'!A112","v":0},null,{"$f":"'Hidden Summary'!D112","v":0},null,{"$f":"IF('Hidden Summary'!G112=\"Rational Method\",\"Rational\",IF('Hidden Summary'!G112=\"TR-55 Method\",\"TR-55\",IF('Hidden Summary'!G112=\"USGS-5030 Method\",\"USGS-5030\",IF('Hidden Summary'!G112=\"USGS-5158 Method\",\"USGS-5158\",IF('Hidden Summary'!G112=\"User Input Method\",\"User Input\",\"\")))))","v":""},null,{"$f":"'Hidden Summary'!I112","v":0},{"$f":"'Hidden Summary'!K112","v":0},{"$f":"'Hidden Summary'!M112","v":0},{"$f":"'Hidden Summary'!Z112","v":0},{"$f":"'Hidden Summary'!O112","v":0},null,{"$f":"'Hidden Summary'!Q112","v":0},{"$f":"'Hidden Summary'!U112","v":0},{"$f":"'Hidden Summary'!S112","v":0},{"$f":"'Hidden Summary'!X112","v":0},null,{"$f":"'Hidden Summary'!J112","v":0},{"$f":"'Hidden Summary'!L112","v":0},{"$f":"'Hidden Summary'!N112","v":0},{"$f":"'Hidden Summary'!AA112","v":0},{"$f":"'Hidden Summary'!P112","v":0},null,{"$f":"'Hidden Summary'!W112","v":0},{"$f":"'Hidden Summary'!Y112","v":0},{"$f":"'Hidden Summary'!R112","v":0},{"$f":"'Hidden Summary'!V112","v":0},{"$f":"'Hidden Summary'!T112","v":0},null,{"$error":"#DIV/0!"},{"$error":"#DIV/0!"},{"$error":"#DIV/0!"},0,0,0,{"$f":"'Hidden Summary'!AB112","v":0}]
[{"$f":"'Hidden Summary'!A113","v":0},null,{"$f":"'Hidden Summary'!D113","v":0},null,{"$f":"IF('Hidden Summary'!G113=\"Rational Method\",\"Rational\",IF('Hidden Summary'!G113=\"TR-55 Method\",\"TR-55\",IF('Hidden Summary'!G113=\"USGS-5030 Method\",\"USGS-5030\",IF('Hidden Summary'!G113=\"USGS-5158 Method\",\"USGS-5158\",IF('Hidden Summary'!G113=\"User Input Method\",\"User Input\",\"\")))))","v":""},null,{"$f":"'Hidden Summary'!I113","v":0},{"$f":"'Hidden Summary'!K113","v":0},{"$f":"'Hidden Summary'!M113","v":0},{"$f":"'Hidden Summary'!Z113","v":0},{"$f":"'Hidden Summary'!O113","v":0},null,{"$f":"'Hidden Summary'!Q113","v":0},{"$f":"'Hidden Summary'!U113","v":0},{"$f":"'Hidden Summary'!S113","v":0},{"$f":"'Hidden Summary'!X113","v":0},null,{"$f":"'Hidden Summary'!J113","v":0},{"$f":"'Hidden Summary'!L113","v":0},{"$f":"'Hidden Summary'!N113","v":0},{"$f":"'Hidden Summary'!AA113","v":0},{"$f":"'Hidden Summary'!P113","v":0},null,{"$f":"'Hidden Summary'!W113","v":0},{"$f":"'Hidden Summary'!Y113","v":0},{"$f":"'Hidden Summary'!R113","v":0},{"$f":"'Hidden Summary'!V113","v":0},{"$f":"'Hidden Summary'!T113","v":0},null,{"$error":"#DIV/0!"},{"$error":"#DIV/0!"},{"$error":"#DIV/0!"},0,0,0,{"$f":"'Hidden Summary'!AB113","v":0}]
[{"$f":"'Hidden Summary'!A114","v":0},null,{"$f":"'Hidden Summary'!D114","v":0},null,{"$f":"IF('Hidden Summary'!G114=\"Rational Method\",\"Rational\",IF('Hidden Summary'!G114=\"TR-55 Method\",\"TR-55\",IF('Hidden Summary'!G114=\"USGS-5030 Method\",\"USGS-5030\",IF('Hidden Summary'!G114=\"USGS-5158 Method\",\"USGS-5158\",IF('Hidden Summary'!G114=\"User Input Method\",\"User Input\",\"\")))))","v":""},null,{"$f":"'Hidden Summary'!I114","v":0},{"$f":"'Hidden Summary'!K114","v":0},{"$f":"'Hidden Summary'!M114","v":0},{"$f":"'Hidden Summary'!Z114","v":0},{"$f":"'Hidden Summary'!O114","v":0},null,{"$f":"'Hidden Summary'!Q114","v":0},{"$f":"'Hidden Summary'!U114","v":0},{"$f":"'Hidden Summary'!S114","v":0},{"$f":"'Hidden Summary'!X114","v":0},null,{"$f":"'Hidden Summary'!J114","v":0},{"$f":"'Hidden Summary'!L114","v":0},{"$f":"'Hidden Summary'!N114","v":0},{"$f":"'Hidden Summary'!AA114","v":0},{"$f":"'Hidden Summary'!P114","v":0},null,{"$f":"'Hidden Summary'!W114","v":0},{"$f":"'Hidden Summary'!Y114","v":0},{"$f":"'Hidden Summary'!R114","v":0},{"$f":"'Hidden Summary'!V114","v":0},{"$f":"'Hidden Summary'!T114","v":0},null,{"$error":"#DIV/0!"},{"$error":"#DIV/0!"},{"$error":"#DIV/0!"},0,0,0,{"$f":"'Hidden Summary'!AB114","v":0}]
[{"$f":"'Hidden Summary'!A115","v":0},null,{"$f":"'Hidden Summary'!D115","v":0},null,{"$f":"IF('Hidden Summary'!G115=\"Rational Method\",\"Rational\",IF('Hidden Summary'!G115=\"TR-55 Method\",\"TR-55\",IF('Hidden Summary'!G115=\"USGS-5030 Method\",\"USGS-5030\",IF('Hidden Summary'!G115=\"USGS-5158 Method\",\"USGS-5158\",IF('Hidden Summary'!G115=\"User Input Method\",\"User Input\",\"\")))))","v":""},null,{"$f":"'Hidden Summary'!I115","v":0},{"$f":"'Hidden Summary'!K115","v":0},{"$f":"'Hidden Summary'!M115","v":0},{"$f":"'Hidden Summary'!Z115","v":0},{"$f":"'Hidden Summary'!O115","v":0},null,{"$f":"'Hidden Summary'!Q115","v":0},{"$f":"'Hidden Summary'!U115","v":0},{"$f":"'Hidden Summary'!S115","v":0},{"$f":"'Hidden Summary'!X115","v":0},null,{"$f":"'Hidden Summary'!J115","v":0},{"$f":"'Hidden Summary'!L115","v":0},{"$f":"'Hidden Summary'!N115","v":0},{"$f":"'Hidden Summary'!AA115","v":0},{"$f":"'Hidden Summary'!P115","v":0},null,{"$f":"'Hidden Summary'!W115","v":0},{"$f":"'Hidden Summary'!Y115","v":0},{"$f":"'Hidden Summary'!R115","v":0},{"$f":"'Hidden Summary'!V115","v":0},{"$f":"'Hidden Summary'!T115","v":0},null,{"$error":"#DIV/0!"},{"$error":"#DIV/0!"},{"$error":"#DIV/0!"},0,0,0,{"$f":"'Hidden Summary'!AB115","v":0}]
[{"$f":"'Hidden Summary'!A116","v":0},null,{"$f":"'Hidden Summary'!D116","v":0},null,{"$f":"IF('Hidden Summary'!G116=\"Rational Method\",\"Rational\",IF('Hidden Summary'!G116=\"TR-55 Method\",\"TR-55\",IF('Hidden Summary'!G116=\"USGS-5030 Method\",\"USGS-5030\",IF('Hidden Summary'!G116=\"USGS-5158 Method\",\"USGS-5158\",IF('Hidden Summary'!G116=\"User Input Method\",\"User Input\",\"\")))))","v":""},null,{"$f":"'Hidden Summary'!I116","v":0},{"$f":"'Hidden Summary'!K116","v":0},{"$f":"'Hidden Summary'!M116","v":0},{"$f":"'Hidden Summary'!Z116","v":0},{"$f":"'Hidden Summary'!O116","v":0},null,{"$f":"'Hidden Summary'!Q116","v":0},{"$f":"'Hidden Summary'!U116","v":0},{"$f":"'Hidden Summary'!S116","v":0},{"$f":"'Hidden Summary'!X116","v":0},null,{"$f":"'Hidden Summary'!J116","v":0},{"$f":"'Hidden Summary'!L116","v":0},{"$f":"'Hidden Summary'!N116","v":0},{"$f":"'Hidden Summary'!AA116","v":0},{"$f":"'Hidden Summary'!P116","v":0},null,{"$f":"'Hidden Summary'!W116","v":0},{"$f":"'Hidden Summary'!Y116","v":0},{"$f":"'Hidden Summary'!R116","v":0},{"$f":"'Hidden Summary'!V116","v":0},{"$f":"'Hidden Summary'!T116","v":0},null,{"$error":"#DIV/0!"},{"$error":"#DIV/0!"},{"$error":"#DIV/0!"},0,0,0,{"$f":"'Hidden Summary'!AB116","v":0}]
[{"$f":"'Hidden Summary'!A117","v":0},null,{"$f":"'Hidden Summary'!D117","v":0},null,{"$f":"IF('Hidden Summary'!G117=\"Rational Method\",\"Rational\",IF('Hidden Summary'!G117=\"TR-55 Method\",\"TR-55\",IF('Hidden Summary'!G117=\"USGS-5030 Method\",\"USGS-5030\",IF('Hidden Summary'!G117=\"USGS-5158 Method\",\"USGS-5158\",IF('Hidden Summary'!G117=\"User Input Method\",\"User Input\",\"\")))))","v":""},null,{"$f":"'Hidden Summary'!I117","v":0},{"$f":"'Hidden Summary'!K117","v":0},{"$f":"'Hidden Summary'!M117","v":0},{"$f":"'Hidden Summary'!Z117","v":0},{"$f":"'Hidden Summary'!O117","v":0},null,{"$f":"'Hidden Summary'!Q117","v":0},{"$f":"'Hidden Summary'!U117","v":0},{"$f":"'Hidden Summary'!S117","v":0},{"$f":"'Hidden Summary'!X117","v":0},null,{"$f":"'Hidden Summary'!J117","v":0},{"$f":"'Hidden Summary'!L117","v":0},{"$f":"'Hidden Summary'!N117","v":0},{"$f":"'Hidden Summary'!AA117","v":0},{"$f":"'Hidden Summary'!P117","v":0},null,{"$f":"'Hidden Summary'!W117","v":0},{"$f":"'Hidden Summary'!Y117","v":0},{"$f":"'Hidden Summary'!R117","v":0},{"$f":"'Hidden Summary'!V117","v":0},{"$f":"'Hidden Summary'!T117","v":0},null,{"$error":"#DIV/0!"},{"$error":"#DIV/0!"},{"$error":"#DIV/0!"},0,0,0,{"$f":"'Hidden Summary'!AB117","v":0}]
[{"$f":"'Hidden Summary'!A118","v":0},null,{"$f":"'Hidden Summary'!D118","v":0},null,{"$f":"IF('Hidden Summary'!G118=\"Rational Method\",\"Rational\",IF('Hidden Summary'!G118=\"TR-55 Method\",\"TR-55\",IF('Hidden Summary'!G118=\"USGS-5030 Method\",\"USGS-5030\",IF('Hidden Summary'!G118=\"USGS-5158 Method\",\"USGS-5158\",IF('Hidden Summary'!G118=\"User Input Method\",\"User Input\",\"\")))))","v":""},null,{"$f":"'Hidden Summary'!I118","v":0},{"$f":"'Hidden Summary'!K118","v":0},{"$f":"'Hidden Summary'!M118","v":0},{"$f":"'Hidden Summary'!Z118","v":0},{"$f":"'Hidden Summary'!O118","v":0},null,{"$f":"'Hidden Summary'!Q118","v":0},{"$f":"'Hidden Summary'!U118","v":0},{"$f":"'Hidden Summary'!S118","v":0},{"$f":"'Hidden Summary'!X118","v":0},null,{"$f":"'Hidden Summary'!J118","v":0},{"$f":"'Hidden Summary'!L118","v":0},{"$f":"'Hidden Summary'!N118","v":0},{"$f":"'Hidden Summary'!AA118","v":0},{"$f":"'Hidden Summary'!P118","v":0},null,{"$f":"'Hidden Summary'!W118","v":0},{"$f":"'Hidden Summary'!Y118","v":0},{"$f":"'Hidden Summary'!R118","v":0},{"$f":"'Hidden Summary'!V118","v":0},{"$f":"'Hidden Summary'!T118","v":0},null,{"$error":"#DIV/0!"},{"$error":"#DIV/0!"},{"$error":"#DIV/0!"},0,0,0,{"$f":"'Hidden Summary'!AB118","v":0}]
[{"$f":"'Hidden Summary'!A119","v":0},null,{"$f":"'Hidden Summary'!D119","v":0},null,{"$f":"IF('Hidden Summary'!G119=\"Rational Method\",\"Rational\",IF('Hidden Summary'!G119=\"TR-55 Method\",\"TR-55\",IF('Hidden Summary'!G119=\"USGS-5030 Method\",\"USGS-5030\",IF('Hidden Summary'!G119=\"USGS-5158 Method\",\"USGS-5158\",IF('Hidden Summary'!G119=\"User Input Method\",\"User Input\",\"\")))))","v":""},null,{"$f":"'Hidden Summary'!I119","v":0},{"$f":"'Hidden Summary'!K119","v":0},{"$f":"'Hidden Summary'!M119","v":0},{"$f":"'Hidden Summary'!Z119","v":0},{"$f":"'Hidden Summary'!O119","v":0},null,{"$f":"'Hidden Summary'!Q119","v":0},{"$f":"'Hidden Summary'!U119","v":0},{"$f":"'Hidden Summary'!S119","v":0},{"$f":"'Hidden Summary'!X119","v":0},null,{"$f":"'Hidden Summary'!J119","v":0},{"$f":"'Hidden Summary'!L119","v":0},{"$f":"'Hidden Summary'!N119","v":0},{"$f":"'Hidden Summary'!AA119","v":0},{"$f":"'Hidden Summary'!P119","v":0},null,{"$f":"'Hidden Summary'!W119","v":0},{"$f":"'Hidden Summary'!Y119","v":0},{"$f":"'Hidden Summary'!R119","v":0},{"$f":"'Hidden Summary'!V119","v":0},{"$f":"'Hidden Summary'!T119","v":0},null,{"$error":"#DIV/0!"},{"$error":"#DIV/0!"},{"$error":"#DIV/0!"},0,0,0,{"$f":"'Hidden Summary'!AB119","v":0}]
[{"$f":"'Hidden Summary'!A120","v":0},null,{"$f":"'Hidden Summary'!D120","v":0},null,{"$f":"IF('Hidden Summary'!G120=\"Rational Method\",\"Rational\",IF('Hidden Summary'!G120=\"TR-55 Method\",\"TR-55\",IF('Hidden Summary'!G120=\"USGS-5030 Method\",\"USGS-5030\",IF('Hidden Summary'!G120=\"USGS-5158 Method\",\"USGS-5158\",IF('Hidden Summary'!G120=\"User Input Method\",\"User Input\",\"\")))))","v":""},null,{"$f":"'Hidden Summary'!I120","v":0},{"$f":"'Hidden Summary'!K120","v":0},{"$f":"'Hidden Summary'!M120","v":0},{"$f":"'Hidden Summary'!Z120","v":0},{"$f":"'Hidden Summary'!O120","v":0},null,{"$f":"'Hidden Summary'!Q120","v":0},{"$f":"'Hidden Summary'!U120","v":0},{"$f":"'Hidden Summary'!S120","v":0},{"$f":"'Hidden Summary'!X120","v":0},null,{"$f":"'Hidden Summary'!J120","v":0},{"$f":"'Hidden Summary'!L120","v":0},{"$f":"'Hidden Summary'!N120","v":0},{"$f":"'Hidden Summary'!AA120","v":0},{"$f":"'Hidden Summary'!P120","v":0},null,{"$f":"'Hidden Summary'!W120","v":0},{"$f":"'Hidden Summary'!Y120","v":0},{"$f":"'Hidden Summary'!R120","v":0},{"$f":"'Hidden Summary'!V120","v":0},{"$f":"'Hidden Summary'!T120","v":0},null,{"$error":"#DIV/0!"},{"$error":"#DIV/0!"},{"$error":"#DIV/0!"},0,0,0,{"$f":"'Hidden Summary'!AB120","v":0}]
[{"$f":"'Hidden Summary'!A121","v":0},null,{"$f":"'Hidden Summary'!D121","v":0},null,{"$f":"IF('Hidden Summary'!G121=\"Rational Method\",\"Rational\",IF('Hidden Summary'!G121=\"TR-55 Method\",\"TR-55\",IF('Hidden Summary'!G121=\"USGS-5030 Method\",\"USGS-5030\",IF('Hidden Summary'!G121=\"USGS-5158 Method\",\"USGS-5158\",IF('Hidden Summary'!G121=\"User Input Method\",\"User Input\",\"\")))))","v":""},null,{"$f":"'Hidden Summary'!I121","v":0},{"$f":"'Hidden Summary'!K121","v":0},{"$f":"'Hidden Summary'!M121","v":0},{"$f":"'Hidden Summary'!Z121","v":0},{"$f":"'Hidden Summary'!O121","v":0},null,{"$f":"'Hidden Summary'!Q121","v":0},{"$f":"'Hidden Summary'!U121","v":0},{"$f":"'Hidden Summary'!S121","v":0},{"$f":"'Hidden Summary'!X121","v":0},null,{"$f":"'Hidden Summary'!J121","v":0},{"$f":"'Hidden Summary'!L121","v":0},{"$f":"'Hidden Summary'!N121","v":0},{"$f":"'Hidden Summary'!AA121","v":0},{"$f":"'Hidden Summary'!P121","v":0},null,{"$f":"'Hidden Summary'!W121","v":0},{"$f":"'Hidden Summary'!Y121","v":0},{"$f":"'Hidden Summary'!R121","v":0},{"$f":"'Hidden Summary'!V121","v":0},{"$f":"'Hidden Summary'!T121","v":0},null,{"$error":"#DIV/0!"},{"$error":"#DIV/0!"},{"$error":"#DIV/0!"},0,0,0,{"$f":"'Hidden Summary'!AB121","v":0}]
[{"$f":"'Hidden Summary'!A122","v":0},null,{"$f":"'Hidden Summary'!D122","v":0},null,{"$f":"IF('Hidden Summary'!G122=\"Rational Method\",\"Rational\",IF('Hidden Summary'!G122=\"TR-55 Method\",\"TR-55\",IF('Hidden Summary'!G122=\"USGS-5030 Method\",\"USGS-5030\",IF('Hidden Summary'!G122=\"USGS-5158 Method\",\"USGS-5158\",IF('Hidden Summary'!G122=\"User Input Method\",\"User Input\",\"\")))))","v":""},null,{"$f":"'Hidden Summary'!I122","v":0},{"$f":"'Hidden Summary'!K122","v":0},{"$f":"'Hidden Summary'!M122","v":0},{"$f":"'Hidden Summary'!Z122","v":0},{"$f":"'Hidden Summary'!O122","v":0},null,{"$f":"'Hidden Summary'!Q122","v":0},{"$f":"'Hidden Summary'!U122","v":0},{"$f":"'Hidden Summary'!S122","v":0},{"$f":"'Hidden Summary'!X122","v":0},null,{"$f":"'Hidden Summary'!J122","v":0},{"$f":"'Hidden Summary'!L122","v":0},{"$f":"'Hidden Summary'!N122","v":0},{"$f":"'Hidden Summary'!AA122","v":0},{"$f":"'Hidden Summary'!P122","v":0},null,{"$f":"'Hidden Summary'!W122","v":0},{"$f":"'Hidden Summary'!Y122","v":0},{"$f":"'Hidden Summary'!R122","v":0},{"$f":"'Hidden Summary'!V122","v":0},{"$f":"'Hidden Summary'!T122","v":0},null,{"$error":"#DIV/0!"},{"$error":"#DIV/0!"},{"$error":"#DIV/0!"},0,0,0,{"$f":"'Hidden Summary'!AB122","v":0}]
[{"$f":"'Hidden Summary'!A123","v":0},null,{"$f":"'Hidden Summary'!D123","v":0},null,{"$f":"IF('Hidden Summary'!G123=\"Rational Method\",\"Rational\",IF('Hidden Summary'!G123=\"TR-55 Method\",\"TR-55\",IF('Hidden Summary'!G123=\"USGS-5030 Method\",\"USGS-5030\",IF('Hidden Summary'!G123=\"USGS-5158 Method\",\"USGS-5158\",IF('Hidden Summary'!G123=\"User Input Method\",\"User Input\",\"\")))))","v":""},null,{"$f":"'Hidden Summary'!I123","v":0},{"$f":"'Hidden Summary'!K123","v":0},{"$f":"'Hidden Summary'!M123","v":0},{"$f":"'Hidden Summary'!Z123","v":0},{"$f":"'Hidden Summary'!O123","v":0},null,{"$f":"'Hidden Summary'!Q123","v":0},{"$f":"'Hidden Summary'!U123","v":0},{"$f":"'Hidden Summary'!S123","v":0},{"$f":"'Hidden Summary'!X123","v":0},null,{"$f":"'Hidden Summary'!J123","v":0},{"$f":"'Hidden Summary'!L123","v":0},{"$f":"'Hidden Summary'!N123","v":0},{"$f":"'Hidden Summary'!AA123","v":0},{"$f":"'Hidden Summary'!P123","v":0},null,{"$f":"'Hidden Summary'!W123","v":0},{"$f":"'Hidden Summary'!Y123","v":0},{"$f":"'Hidden Summary'!R123","v":0},{"$f":"'Hidden Summary'!V123","v":0},{"$f":"'Hidden Summary'!T123","v":0},null,{"$error":"#DIV/0!"},{"$error":"#DIV/0!"},{"$error":"#DIV/0!"},0,0,0,{"$f":"'Hidden Summary'!AB123","v":0}]
[{"$f":"'Hidden Summary'!A124","v":0},null,{"$f":"'Hidden Summary'!D124","v":0},null,{"$f":"IF('Hidden Summary'!G124=\"Rational Method\",\"Rational\",IF('Hidden Summary'!G124=\"TR-55 Method\",\"TR-55\",IF('Hidden Summary'!G124=\"USGS-5030 Method\",\"USGS-5030\",IF('Hidden Summary'!G124=\"USGS-5158 Method\",\"USGS-5158\",IF('Hidden Summary'!G124=\"User Input Method\",\"User Input\",\"\")))))","v":""},null,{"$f":"'Hidden Summary'!I124","v":0},{"$f":"'Hidden Summary'!K124","v":0},{"$f":"'Hidden Summary'!M124","v":0},{"$f":"'Hidden Summary'!Z124","v":0},{"$f":"'Hidden Summary'!O124","v":0},null,{"$f":"'Hidden Summary'!Q124","v":0},{"$f":"'Hidden Summary'!U124","v":0},{"$f":"'Hidden Summary'!S124","v":0},{"$f":"'Hidden Summary'!X124","v":0},null,{"$f":"'Hidden Summary'!J124","v":0},{"$f":"'Hidden Summary'!L124","v":0},{"$f":"'Hidden Summary'!N124","v":0},{"$f":"'Hidden Summary'!AA124","v":0},{"$f":"'Hidden Summary'!P124","v":0},null,{"$f":"'Hidden Summary'!W124","v":0},{"$f":"'Hidden Summary'!Y124","v":0},{"$f":"'Hidden Summary'!R124","v":0},{"$f":"'Hidden Summary'!V124","v":0},{"$f":"'Hidden Summary'!T124","v":0},null,{"$error":"#DIV/0!"},{"$error":"#DIV/0!"},{"$error":"#DIV/0!"},0,0,0,{"$f":"'Hidden Summary'!AB124","v":0}]
[{"$f":"'Hidden Summary'!A125","v":0},null,{"$f":"'Hidden Summary'!D125","v":0},null,{"$f":"IF('Hidden Summary'!G125=\"Rational Method\",\"Rational\",IF('Hidden Summary'!G125=\"TR-55 Method\",\"TR-55\",IF('Hidden Summary'!G125=\"USGS-5030 Method\",\"USGS-5030\",IF('Hidden Summary'!G125=\"USGS-5158 Method\",\"USGS-5158\",IF('Hidden Summary'!G125=\"User Input Method\",\"User Input\",\"\")))))","v":""},null,{"$f":"'Hidden Summary'!I125","v":0},{"$f":"'Hidden Summary'!K125","v":0},{"$f":"'Hidden Summary'!M125","v":0},{"$f":"'Hidden Summary'!Z125","v":0},{"$f":"'Hidden Summary'!O125","v":0},null,{"$f":"'Hidden Summary'!Q125","v":0},{"$f":"'Hidden Summary'!U125","v":0},{"$f":"'Hidden Summary'!S125","v":0},{"$f":"'Hidden Summary'!X125","v":0},null,{"$f":"'Hidden Summary'!J125","v":0},{"$f":"'Hidden Summary'!L125","v":0},{"$f":"'Hidden Summary'!N125","v":0},{"$f":"'Hidden Summary'!AA125","v":0},{"$f":"'Hidden Summary'!P125","v":0},null,{"$f":"'Hidden Summary'!W125","v":0},{"$f":"'Hidden Summary'!Y125","v":0},{"$f":"'Hidden Summary'!R125","v":0},{"$f":"'Hidden Summary'!V125","v":0},{"$f":"'Hidden Summary'!T125","v":0},null,{"$error":"#DIV/0!"},{"$error":"#DIV/0!"},{"$error":"#DIV/0!"},0,0,0,{"$f":"'Hidden Summary'!AB125","v":0}]
[{"$f":"'Hidden Summary'!A126","v":0},null,{"$f":"'Hidden Summary'!D126","v":0},null,{"$f":"IF('Hidden Summary'!G126=\"Rational Method\",\"Rational\",IF('Hidden Summary'!G126=\"TR-55 Method\",\"TR-55\",IF('Hidden Summary'!G126=\"USGS-5030 Method\",\"USGS-5030\",IF('Hidden Summary'!G126=\"USGS-5158 Method\",\"USGS-5158\",IF('Hidden Summary'!G126=\"User Input Method\",\"User Input\",\"\")))))","v":""},null,{"$f":"'Hidden Summary'!I126","v":0},{"$f":"'Hidden Summary'!K126","v":0},{"$f":"'Hidden Summary'!M126","v":0},{"$f":"'Hidden Summary'!Z126","v":0},{"$f":"'Hidden Summary'!O126","v":0},null,{"$f":"'Hidden Summary'!Q126","v":0},{"$f":"'Hidden Summary'!U126","v":0},{"$f":"'Hidden Summary'!S126","v":0},{"$f":"'Hidden Summary'!X126","v":0},null,{"$f":"'Hidden Summary'!J126","v":0},{"$f":"'Hidden Summary'!L126","v":0},{"$f":"'Hidden Summary'!N126","v":0},{"$f":"'Hidden Summary'!AA126","v":0},{"$f":"'Hidden Summary'!P126","v":0},null,{"$f":"'Hidden Summary'!W126","v":0},{"$f":"'Hidden Summary'!Y126","v":0},{"$f":"'Hidden Summary'!R126","v":0},{"$f":"'Hidden Summary'!V126","v":0},{"$f":"'Hidden Summary'!T126","v":0},null,{"$error":"#DIV/0!"},{"$error":"#DIV/0!"},{"$error":"#DIV/0!"},0,0,0,{"$f":"'Hidden Summary'!AB126","v":0}]
[{"$f":"'Hidden Summary'!A127","v":0},null,{"$f":"'Hidden Summary'!D127","v":0},null,{"$f":"IF('Hidden Summary'!G127=\"Rational Method\",\"Rational\",IF('Hidden Summary'!G127=\"TR-55 Method\",\"TR-55\",IF('Hidden Summary'!G127=\"USGS-5030 Method\",\"USGS-5030\",IF('Hidden Summary'!G127=\"USGS-5158 Method\",\"USGS-5158\",IF('Hidden Summary'!G127=\"User Input Method\",\"User Input\",\"\")))))","v":""},null,{"$f":"'Hidden Summary'!I127","v":0},{"$f":"'Hidden Summary'!K127","v":0},{"$f":"'Hidden Summary'!M127","v":0},{"$f":"'Hidden Summary'!Z127","v":0},{"$f":"'Hidden Summary'!O127","v":0},null,{"$f":"'Hidden Summary'!Q127","v":0},{"$f":"'Hidden Summary'!U127","v":0},{"$f":"'Hidden Summary'!S127","v":0},{"$f":"'Hidden Summary'!X127","v":0},null,{"$f":"'Hidden Summary'!J127","v":0},{"$f":"'Hidden Summary'!L127","v":0},{"$f":"'Hidden Summary'!N127","v":0},{"$f":"'Hidden Summary'!AA127","v":0},{"$f":"'Hidden Summary'!P127","v":0},null,{"$f":"'Hidden Summary'!W127","v":0},{"$f":"'Hidden Summary'!Y127","v":0},{"$f":"'Hidden Summary'!R127","v":0},{"$f":"'Hidden Summary'!V127","v":0},{"$f":"'Hidden Summary'!T127","v":0},null,{"$error":"#DIV/0!"},{"$error":"#DIV/0!"},{"$error":"#DIV/0!"},0,0,0,{"$f":"'Hidden Summary'!AB127","v":0}]
[{"$f":"'Hidden Summary'!A128","v":0},null,{"$f":"'Hidden Summary'!D128","v":0},null,{"$f":"IF('Hidden Summary'!G128=\"Rational Method\",\"Rational\",IF('Hidden Summary'!G128=\"TR-55 Method\",\"TR-55\",IF('Hidden Summary'!G128=\"USGS-5030 Method\",\"USGS-5030\",IF('Hidden Summary'!G128=\"USGS-5158 Method\",\"USGS-5158\",IF('Hidden Summary'!G128=\"User Input Method\",\"User Input\",\"\")))))","v":""},null,{"$f":"'Hidden Summary'!I128","v":0},{"$f":"'Hidden Summary'!K128","v":0},{"$f":"'Hidden Summary'!M128","v":0},{"$f":"'Hidden Summary'!Z128","v":0},{"$f":"'Hidden Summary'!O128","v":0},null,{"$f":"'Hidden Summary'!Q128","v":0},{"$f":"'Hidden Summary'!U128","v":0},{"$f":"'Hidden Summary'!S128","v":0},{"$f":"'Hidden Summary'!X128","v":0},null,{"$f":"'Hidden Summary'!J128","v":0},{"$f":"'Hidden Summary'!L128","v":0},{"$f":"'Hidden Summary'!N128","v":0},{"$f":"'Hidden Summary'!AA128","v":0},{"$f":"'Hidden Summary'!P128","v":0},null,{"$f":"'Hidden Summary'!W128","v":0},{"$f":"'Hidden Summary'!Y128","v":0},{"$f":"'Hidden Summary'!R128","v":0},{"$f":"'Hidden Summary'!V128","v":0},{"$f":"'Hidden Summary'!T128","v":0},null,{"$error":"#DIV/0!"},{"$error":"#DIV/0!"},{"$error":"#DIV/0!"},0,0,0,{"$f":"'Hidden Summary'!AB128","v":0}]
[{"$f":"'Hidden Summary'!A129","v":0},null,{"$f":"'Hidden Summary'!D129","v":0},null,{"$f":"IF('Hidden Summary'!G129=\"Rational Method\",\"Rational\",IF('Hidden Summary'!G129=\"TR-55 Method\",\"TR-55\",IF('Hidden Summary'!G129=\"USGS-5030 Method\",\"USGS-5030\",IF('Hidden Summary'!G129=\"USGS-5158 Method\",\"USGS-5158\",IF('Hidden Summary'!G129=\"User Input Method\",\"User Input\",\"\")))))","v":""},null,{"$f":"'Hidden Summary'!I129","v":0},{"$f":"'Hidden Summary'!K129","v":0},{"$f":"'Hidden Summary'!M129","v":0},{"$f":"'Hidden Summary'!Z129","v":0},{"$f":"'Hidden Summary'!O129","v":0},null,{"$f":"'Hidden Summary'!Q129","v":0},{"$f":"'Hidden Summary'!U129","v":0},{"$f":"'Hidden Summary'!S129","v":0},{"$f":"'Hidden Summary'!X129","v":0},null,{"$f":"'Hidden Summary'!J129","v":0},{"$f":"'Hidden Summary'!L129","v":0},{"$f":"'Hidden Summary'!N129","v":0},{"$f":"'Hidden Summary'!AA129","v":0},{"$f":"'Hidden Summary'!P129","v":0},null,{"$f":"'Hidden Summary'!W129","v":0},{"$f":"'Hidden Summary'!Y129","v":0},{"$f":"'Hidden Summary'!R129","v":0},{"$f":"'Hidden Summary'!V129","v":0},{"$f":"'Hidden Summary'!T129","v":0},null,{"$error":"#DIV/0!"},{"$error":"#DIV/0!"},{"$error":"#DIV/0!"},0,0,0,{"$f":"'Hidden Summary'!AB129","v":0}]
[{"$f":"'Hidden Summary'!A130","v":0},null,{"$f":"'Hidden Summary'!D130","v":0},null,{"$f":"IF('Hidden Summary'!G130=\"Rational Method\",\"Rational\",IF('Hidden Summary'!G130=\"TR-55 Method\",\"TR-55\",IF('Hidden Summary'!G130=\"USGS-5030 Method\",\"USGS-5030\",IF('Hidden Summary'!G130=\"USGS-5158 Method\",\"USGS-5158\",IF('Hidden Summary'!G130=\"User Input Method\",\"User Input\",\"\")))))","v":""},null,{"$f":"'Hidden Summary'!I130","v":0},{"$f":"'Hidden Summary'!K130","v":0},{"$f":"'Hidden Summary'!M130","v":0},{"$f":"'Hidden Summary'!Z130","v":0},{"$f":"'Hidden Summary'!O130","v":0},null,{"$f":"'Hidden Summary'!Q130","v":0},{"$f":"'Hidden Summary'!U130","v":0},{"$f":"'Hidden Summary'!S130","v":0},{"$f":"'Hidden Summary'!X130","v":0},null,{"$f":"'Hidden Summary'!J130","v":0},{"$f":"'Hidden Summary'!L130","v":0},{"$f":"'Hidden Summary'!N130","v":0},{"$f":"'Hidden Summary'!AA130","v":0},{"$f":"'Hidden Summary'!P130","v":0},null,{"$f":"'Hidden Summary'!W130","v":0},{"$f":"'Hidden Summary'!Y130","v":0},{"$f":"'Hidden Summary'!R130","v":0},{"$f":"'Hidden Summary'!V130","v":0},{"$f":"'Hidden Summary'!T130","v":0},null,{"$error":"#DIV/0!"},{"$error":"#DIV/0!"},{"$error":"#DIV/0!"},0,0,0,{"$f":"'Hidden Summary'!AB130","v":0}]
[{"$f":"'Hidden Summary'!A131","v":0},null,{"$f":"'Hidden Summary'!D131","v":0},null,{"$f":"IF('Hidden Summary'!G131=\"Rational Method\",\"Rational\",IF('Hidden Summary'!G131=\"TR-55 Method\",\"TR-55\",IF('Hidden Summary'!G131=\"USGS-5030 Method\",\"USGS-5030\",IF('Hidden Summary'!G131=\"USGS-5158 Method\",\"USGS-5158\",IF('Hidden Summary'!G131=\"User Input Method\",\"User Input\",\"\")))))","v":""},null,{"$f":"'Hidden Summary'!I131","v":0},{"$f":"'Hidden Summary'!K131","v":0},{"$f":"'Hidden Summary'!M131","v":0},{"$f":"'Hidden Summary'!Z131","v":0},{"$f":"'Hidden Summary'!O131","v":0},null,{"$f":"'Hidden Summary'!Q131","v":0},{"$f":"'Hidden Summary'!U131","v":0},{"$f":"'Hidden Summary'!S131","v":0},{"$f":"'Hidden Summary'!X131","v":0},null,{"$f":"'Hidden Summary'!J131","v":0},{"$f":"'Hidden Summary'!L131","v":0},{"$f":"'Hidden Summary'!N131","v":0},{"$f":"'Hidden Summary'!AA131","v":0},{"$f":"'Hidden Summary'!P131","v":0},null,{"$f":"'Hidden Summary'!W131","v":0},{"$f":"'Hidden Summary'!Y131","v":0},{"$f":"'Hidden Summary'!R131","v":0},{"$f":"'Hidden Summary'!V131","v":0},{"$f":"'Hidden Summary'!T131","v":0},null,{"$f":"(Z138/M138)-1","v":{"$error":"#DIV/0!"}},{"$f":"(AA138/N138)-1","v":{"$error":"#DIV/0!"}},{"$f":"(AB138/O138)-1","v":{"$error":"#DIV/0!"}},{"$f":"R138-G138","v":0},{"$f":"(U138*R138)-(J138*G138)","v":0},{"$f":"U138-J138","v":0},{"$f":"'Hidden Summary'!AB131","v":0}]
[{"$f":"'Hidden Summary'!A132","v":0},null,{"$f":"'Hidden Summary'!D132","v":0},null,{"$f":"IF('Hidden Summary'!G132=\"Rational Method\",\"Rational\",IF('Hidden Summary'!G132=\"TR-55 Method\",\"TR-55\",IF('Hidden Summary'!G132=\"USGS-5030 Method\",\"USGS-5030\",IF('Hidden Summary'!G132=\"USGS-5158 Method\",\"USGS-5158\",IF('Hidden Summary'!G132=\"User Input Method\",\"User Input\",\"\")))))","v":""},null,{"$f":"'Hidden Summary'!I132","v":0},{"$f":"'Hidden Summary'!K132","v":0},{"$f":"'Hidden Summary'!M132","v":0},{"$f":"'Hidden Summary'!Z132","v":0},{"$f":"'Hidden Summary'!O132","v":0},null,{"$f":"'Hidden Summary'!Q132","v":0},{"$f":"'Hidden Summary'!U132","v":0},{"$f":"'Hidden Summary'!S132","v":0},{"$f":"'Hidden Summary'!X132","v":0},null,{"$f":"'Hidden Summary'!J132","v":0},{"$f":"'Hidden Summary'!L132","v":0},{"$f":"'Hidden Summary'!N132","v":0},{"$f":"'Hidden Summary'!AA132","v":0},{"$f":"'Hidden Summary'!P132","v":0},null,{"$f":"'Hidden Summary'!W132","v":0},{"$f":"'Hidden Summary'!Y132","v":0},{"$f":"'Hidden Summary'!R132","v":0},{"$f":"'Hidden Summary'!V132","v":0},{"$f":"'Hidden Summary'!T132","v":0},null,{"$error":"#DIV/0!"},{"$error":"#DIV/0!"},{"$error":"#DIV/0!"},0,0,0,{"$f":"'Hidden Summary'!AB132","v":0}]
[{"$f":"'Hidden Summary'!A133","v":0},null,{"$f":"'Hidden Summary'!D133","v":0},null,{"$f":"IF('Hidden Summary'!G133=\"Rational Method\",\"Rational\",IF('Hidden Summary'!G133=\"TR-55 Method\",\"TR-55\",IF('Hidden Summary'!G133=\"USGS-5030 Method\",\"USGS-5030\",IF('Hidden Summary'!G133=\"USGS-5158 Method\",\"USGS-5158\",IF('Hidden Summary'!G133=\"User Input Method\",\"User Input\",\"\")))))","v":""},null,{"$f":"'Hidden Summary'!I133","v":0},{"$f":"'Hidden Summary'!K133","v":0},{"$f":"'Hidden Summary'!M133","v":0},{"$f":"'Hidden Summary'!Z133","v":0},{"$f":"'Hidden Summary'!O133","v":0},null,{"$f":"'Hidden Summary'!Q133","v":0},{"$f":"'Hidden Summary'!U133","v":0},{"$f":"'Hidden Summary'!S133","v":0},{"$f":"'Hidden Summary'!X133","v":0},null,{"$f":"'Hidden Summary'!J133","v":0},{"$f":"'Hidden Summary'!L133","v":0},{"$f":"'Hidden Summary'!N133","v":0},{"$f":"'Hidden Summary'!AA133","v":0},{"$f":"'Hidden Summary'!P133","v":0},null,{"$f":"'Hidden Summary'!W133","v":0},{"$f":"'Hidden Summary'!Y133","v":0},{"$f":"'Hidden Summary'!R133","v":0},{"$f":"'Hidden Summary'!V133","v":0},{"$f":"'Hidden Summary'!T133","v":0},null,{"$error":"#DIV/0!"},{"$error":"#DIV/0!"},{"$error":"#DIV/0!"},0,0,0,{"$f":"'Hidden Summary'!AB133","v":0}]
[{"$f":"'Hidden Summary'!A134","v":0},null,{"$f":"'Hidden Summary'!D134","v":0},null,{"$f":"IF('Hidden Summary'!G134=\"Rational Method\",\"Rational\",IF('Hidden Summary'!G134=\"TR-55 Method\",\"TR-55\",IF('Hidden Summary'!G134=\"USGS-5030 Method\",\"USGS-5030\",IF('Hidden Summary'!G134=\"USGS-5158 Method\",\"USGS-5158\",IF('Hidden Summary'!G134=\"User Input Method\",\"User Input\",\"\")))))","v":""},null,{"$f":"'Hidden Summary'!I134","v":0},{"$f":"'Hidden Summary'!K134","v":0},{"$f":"'Hidden Summary'!M134","v":0},{"$f":"'Hidden Summary'!Z134","v":0},{"$f":"'Hidden Summary'!O134","v":0},null,{"$f":"'Hidden Summary'!Q134","v":0},{"$f":"'Hidden Summary'!U134","v":0},{"$f":"'Hidden Summary'!S134","v":0},{"$f":"'Hidden Summary'!X134","v":0},null,{"$f":"'Hidden Summary'!J134","v":0},{"$f":"'Hidden Summary'!L134","v":0},{"$f":"'Hidden Summary'!N134","v":0},{"$f":"'Hidden Summary'!AA134","v":0},{"$f":"'Hidden Summary'!P134","v":0},null,{"$f":"'Hidden Summary'!W134","v":0},{"$f":"'Hidden Summary'!Y134","v":0},{"$f":"'Hidden Summary'!R134","v":0},{"$f":"'Hidden Summary'!V134","v":0},{"$f":"'Hidden Summary'!T134","v":0},null,{"$error":"#DIV/0!"},{"$error":"#DIV/0!"},{"$error":"#DIV/0!"},0,0,0,{"$f":"'Hidden Summary'!AB134","v":0}]
[{"$f":"'Hidden Summary'!A135","v":0},null,{"$f":"'Hidden Summary'!D135","v":0},null,{"$f":"IF('Hidden Summary'!G135=\"Rational Method\",\"Rational\",IF('Hidden Summary'!G135=\"TR-55 Method\",\"TR-55\",IF('Hidden Summary'!G135=\"USGS-5030 Method\",\"USGS-5030\",IF('Hidden Summary'!G135=\"USGS-5158 Method\",\"USGS-5158\",IF('Hidden Summary'!G135=\"User Input Method\",\"User Input\",\"\")))))","v":""},null,{"$f":"'Hidden Summary'!I135","v":0},{"$f":"'Hidden Summary'!K135","v":0},{"$f":"'Hidden Summary'!M135","v":0},{"$f":"'Hidden Summary'!Z135","v":0},{"$f":"'Hidden Summary'!O135","v":0},null,{"$f":"'Hidden Summary'!Q135","v":0},{"$f":"'Hidden Summary'!U135","v":0},{"$f":"'Hidden Summary'!S135","v":0},{"$f":"'Hidden Summary'!X135","v":0},null,{"$f":"'Hidden Summary'!J135","v":0},{"$f":"'Hidden Summary'!L135","v":0},{"$f":"'Hidden Summary'!N135","v":0},{"$f":"'Hidden Summary'!AA135","v":0},{"$f":"'Hidden Summary'!P135","v":0},null,{"$f":"'Hidden Summary'!W135","v":0},{"$f":"'Hidden Summary'!Y135","v":0},{"$f":"'Hidden Summary'!R135","v":0},{"$f":"'Hidden Summary'!V135","v":0},{"$f":"'Hidden Summary'!T135","v":0},null,{"$error":"#DIV/0!"},{"$error":"#DIV/0!"},{"$error":"#DIV/0!"},0,0,0,{"$f":"'Hidden Summary'!AB135","v":0}]
[{"$f":"'Hidden Summary'!A136","v":0},null,{"$f":"'Hidden Summary'!D136","v":0},null,{"$f":"IF('Hidden Summary'!G136=\"Rational Method\",\"Rational\",IF('Hidden Summary'!G136=\"TR-55 Method\",\"TR-55\",IF('Hidden Summary'!G136=\"USGS-5030 Method\",\"USGS-5030\",IF('Hidden Summary'!G136=\"USGS-5158 Method\",\"USGS-5158\",IF('Hidden Summary'!G136=\"User Input Method\",\"User Input\",\"\")))))","v":""},null,{"$f":"'Hidden Summary'!I136","v":0},{"$f":"'Hidden Summary'!K136","v":0},{"$f":"'Hidden Summary'!M136","v":0},{"$f":"'Hidden Summary'!Z136","v":0},{"$f":"'Hidden Summary'!O136","v":0},null,{"$f":"'Hidden Summary'!Q136","v":0},{"$f":"'Hidden Summary'!U136","v":0},{"$f":"'Hidden Summary'!S136","v":0},{"$f":"'Hidden Summary'!X136","v":0},null,{"$f":"'Hidden Summary'!J136","v":0},{"$f":"'Hidden Summary'!L136","v":0},{"$f":"'Hidden Summary'!N136","v":0},{"$f":"'Hidden Summary'!AA136","v":0},{"$f":"'Hidden Summary'!P136","v":0},null,{"$f":"'Hidden Summary'!W136","v":0},{"$f":"'Hidden Summary'!Y136","v":0},{"$f":"'Hidden Summary'!R136","v":0},{"$f":"'Hidden Summary'!V136","v":0},{"$f":"'Hidden Summary'!T136","v":0},null,{"$error":"#DIV/0!"},{"$error":"#DIV/0!"},{"$error":"#DIV/0!"},0,0,0,{"$f":"'Hidden Summary'!AB136","v":0}]
[{"$f":"'Hidden Summary'!A137","v":0},null,{"$f":"'Hidden Summary'!D137","v":0},null,{"$f":"IF('Hidden Summary'!G137=\"Rational Method\",\"Rational\",IF('Hidden Summary'!G137=\"TR-55 Method\",\"TR-55\",IF('Hidden Summary'!G137=\"USGS-5030 Method\",\"USGS-5030\",IF('Hidden Summary'!G137=\"USGS-5158 Method\",\"USGS-5158\",IF('Hidden Summary'!G137=\"User Input Method\",\"User Input\",\"\")))))","v":""},null,{"$f":"'Hidden Summary'!I137","v":0},{"$f":"'Hidden Summary'!K137","v":0},{"$f":"'Hidden Summary'!M137","v":0},{"$f":"'Hidden Summary'!Z137","v":0},{"$f":"'Hidden Summary'!O137","v":0},null,{"$f":"'Hidden Summary'!Q137","v":0},{"$f":"'Hidden Summary'!U137","v":0},{"$f":"'Hidden Summary'!S137","v":0},{"$f":"'Hidden Summary'!X137","v":0},null,{"$f":"'Hidden Summary'!J137","v":0},{"$f":"'Hidden Summary'!L137","v":0},{"$f":"'Hidden Summary'!N137","v":0},{"$f":"'Hidden Summary'!AA137","v":0},{"$f":"'Hidden Summary'!P137","v":0},null,{"$f":"'Hidden Summary'!W137","v":0},{"$f":"'Hidden Summary'!Y137","v":0},{"$f":"'Hidden Summary'!R137","v":0},{"$f":"'Hidden Summary'!V137","v":0},{"$f":"'Hidden Summary'!T137","v":0},null,{"$error":"#DIV/0!"},{"$error":"#DIV/0!"},{"$error":"#DIV/0!"},0,0,0,{"$f":"'Hidden Summary'!AB137","v":0}]
[{"$f":"'Hidden Summary'!A138","v":0},null,{"$f":"'Hidden Summary'!D138","v":0},null,{"$f":"IF('Hidden Summary'!G138=\"Rational Method\",\"Rational\",IF('Hidden Summary'!G138=\"TR-55 Method\",\"TR-55\",IF('Hidden Summary'!G138=\"USGS-5030 Method\",\"USGS-5030\",IF('Hidden Summary'!G138=\"USGS-5158 Method\",\"USGS-5158\",IF('Hidden Summary'!G138=\"User Input Method\",\"User Input\",\"\")))))","v":""},null,{"$f":"'Hidden Summary'!I138","v":0},{"$f":"'Hidden Summary'!K138","v":0},{"$f":"'Hidden Summary'!M138","v":0},{"$f":"'Hidden Summary'!Z138","v":0},{"$f":"'Hidden Summary'!O138","v":0},null,{"$f":"'Hidden Summary'!Q138","v":0},{"$f":"'Hidden Summary'!U138","v":0},{"$f":"'Hidden Summary'!S138","v":0},{"$f":"'Hidden Summary'!X138","v":0},null,{"$f":"'Hidden Summary'!J138","v":0},{"$f":"'Hidden Summary'!L138","v":0},{"$f":"'Hidden Summary'!N138","v":0},{"$f":"'Hidden Summary'!AA138","v":0},{"$f":"'Hidden Summary'!P138","v":0},null,{"$f":"'Hidden Summary'!W138","v":0},{"$f":"'Hidden Summary'!Y138","v":0},{"$f":"'Hidden Summary'!R138","v":0},{"$f":"'Hidden Summary'!V138","v":0},{"$f":"'Hidden Summary'!T138","v":0},null,{"$error":"#DIV/0!"},{"$error":"#DIV/0!"},{"$error":"#DIV/0!"},0,0,0,{"$f":"'Hidden Summary'!AB138","v":0}]
[{"$f":"'Hidden Summary'!A139","v":0},null,{"$f":"'Hidden Summary'!D139","v":0},null,{"$f":"IF('Hidden Summary'!G139=\"Rational Method\",\"Rational\",IF('Hidden Summary'!G139=\"TR-55 Method\",\"TR-55\",IF('Hidden Summary'!G139=\"USGS-5030 Method\",\"USGS-5030\",IF('Hidden Summary'!G139=\"USGS-5158 Method\",\"USGS-5158\",IF('Hidden Summary'!G139=\"User Input Method\",\"User Input\",\"\")))))","v":""},null,{"$f":"'Hidden Summary'!I139","v":0},{"$f":"'Hidden Summary'!K139","v":0},{"$f":"'Hidden Summary'!M139","v":0},{"$f":"'Hidden Summary'!Z139","v":0},{"$f":"'Hidden Summary'!O139","v":0},null,{"$f":"'Hidden Summary'!Q139","v":0},{"$f":"'Hidden Summary'!U139","v":0},{"$f":"'Hidden Summary'!S139","v":0},{"$f":"'Hidden Summary'!X139","v":0},null,{"$f":"'Hidden Summary'!J139","v":0},{"$f":"'Hidden Summary'!L139","v":0},{"$f":"'Hidden Summary'!N139","v":0},{"$f":"'Hidden Summary'!AA139","v":0},{"$f":"'Hidden Summary'!P139","v":0},null,{"$f":"'Hidden Summary'!W139","v":0},{"$f":"'Hidden Summary'!Y139","v":0},{"$f":"'Hidden Summary'!R139","v":0},{"$f":"'Hidden Summary'!V139","v":0},{"$f":"'Hidden Summary'!T139","v":0},null,{"$error":"#DIV/0!"},{"$error":"#DIV/0!"},{"$error":"#DIV/0!"},0,0,0,{"$f":"'Hidden Summary'!AB139","v":0}]
[{"$f":"'Hidden Summary'!A140","v":0},null,{"$f":"'Hidden Summary'!D140","v":0},null,{"$f":"IF('Hidden Summary'!G140=\"Rational Method\",\"Rational\",IF('Hidden Summary'!G140=\"TR-55 Method\",\"TR-55\",IF('Hidden Summary'!G140=\"USGS-5030 Method\",\"USGS-5030\",IF('Hidden Summary'!G140=\"USGS-5158 Method\",\"USGS-5158\",IF('Hidden Summary'!G140=\"User Input Method\",\"User Input\",\"\")))))","v":""},null,{"$f":"'Hidden Summary'!I140","v":0},{"$f":"'Hidden Summary'!K140","v":0},{"$f":"'Hidden Summary'!M140","v":0},{"$f":"'Hidden Summary'!Z140","v":0},{"$f":"'Hidden Summary'!O140","v":0},null,{"$f":"'Hidden Summary'!Q140","v":0},{"$f":"'Hidden Summary'!U140","v":0},{"$f":"'Hidden Summary'!S140","v":0},{"$f":"'Hidden Summary'!X140","v":0},null,{"$f":"'Hidden Summary'!J140","v":0},{"$f":"'Hidden Summary'!L140","v":0},{"$f":"'Hidden Summary'!N140","v":0},{"$f":"'Hidden Summary'!AA140","v":0},{"$f":"'Hidden Summary'!P140","v":0},null,{"$f":"'Hidden Summary'!W140","v":0},{"$f":"'Hidden Summary'!Y140","v":0},{"$f":"'Hidden Summary'!R140","v":0},{"$f":"'Hidden Summary'!V140","v":0},{"$f":"'Hidden Summary'!T140","v":0},null,{"$error":"#DIV/0!"},{"$error":"#DIV/0!"},{"$error":"#DIV/0!"},0,0,0,{"$f":"'Hidden Summary'!AB140","v":0}]
[{"$f":"'Hidden Summary'!A141","v":0},null,{"$f":"'Hidden Summary'!D141","v":0},null,{"$f":"IF('Hidden Summary'!G141=\"Rational Method\",\"Rational\",IF('Hidden Summary'!G141=\"TR-55 Method\",\"TR-55\",IF('Hidden Summary'!G141=\"USGS-5030 Method\",\"USGS-5030\",IF('Hidden Summary'!G141=\"USGS-5158 Method\",\"USGS-5158\",IF('Hidden Summary'!G141=\"User Input Method\",\"User Input\",\"\")))))","v":""},null,{"$f":"'Hidden Summary'!I141","v":0},{"$f":"'Hidden Summary'!K141","v":0},{"$f":"'Hidden Summary'!M141","v":0},{"$f":"'Hidden Summary'!Z141","v":0},{"$f":"'Hidden Summary'!O141","v":0},null,{"$f":"'Hidden Summary'!Q141","v":0},{"$f":"'Hidden Summary'!U141","v":0},{"$f":"'Hidden Summary'!S141","v":0},{"$f":"'Hidden Summary'!X141","v":0},null,{"$f":"'Hidden Summary'!J141","v":0},{"$f":"'Hidden Summary'!L141","v":0},{"$f":"'Hidden Summary'!N141","v":0},{"$f":"'Hidden Summary'!AA141","v":0},{"$f":"'Hidden Summary'!P141","v":0},null,{"$f":"'Hidden Summary'!W141","v":0},{"$f":"'Hidden Summary'!Y141","v":0},{"$f":"'Hidden Summary'!R141","v":0},{"$f":"'Hidden Summary'!V141","v":0},{"$f":"'Hidden Summary'!T141","v":0},null,{"$error":"#DIV/0!"},{"$error":"#DIV/0!"},{"$error":"#DIV/0!"},0,0,0,{"$f":"'Hidden Summary'!AB141","v":0}]
[{"$f":"'Hidden Summary'!A142","v":0},null,{"$f":"'Hidden Summary'!D142","v":0},null,{"$f":"IF('Hidden Summary'!G142=\"Rational Method\",\"Rational\",IF('Hidden Summary'!G142=\"TR-55 Method\",\"TR-55\",IF('Hidden Summary'!G142=\"USGS-5030 Method\",\"USGS-5030\",IF('Hidden Summary'!G142=\"USGS-5158 Method\",\"USGS-5158\",IF('Hidden Summary'!G142=\"User Input Method\",\"User Input\",\"\")))))","v":""},null,{"$f":"'Hidden Summary'!I142","v":0},{"$f":"'Hidden Summary'!K142","v":0},{"$f":"'Hidden Summary'!M142","v":0},{"$f":"'Hidden Summary'!Z142","v":0},{"$f":"'Hidden Summary'!O142","v":0},null,{"$f":"'Hidden Summary'!Q142","v":0},{"$f":"'Hidden Summary'!U142","v":0},{"$f":"'Hidden Summary'!S142","v":0},{"$f":"'Hidden Summary'!X142","v":0},null,{"$f":"'Hidden Summary'!J142","v":0},{"$f":"'Hidden Summary'!L142","v":0},{"$f":"'Hidden Summary'!N142","v":0},{"$f":"'Hidden Summary'!AA142","v":0},{"$f":"'Hidden Summary'!P142","v":0},null,{"$f":"'Hidden Summary'!W142","v":0},{"$f":"'Hidden Summary'!Y142","v":0},{"$f":"'Hidden Summary'!R142","v":0},{"$f":"'Hidden Summary'!V142","v":0},{"$f":"'Hidden Summary'!T142","v":0},null,{"$error":"#DIV/0!"},{"$error":"#DIV/0!"},{"$error":"#DIV/0!"},0,0,0,{"$f":"'Hidden Summary'!AB142","v":0}]
[{"$f":"'Hidden Summary'!A143","v":0},null,{"$f":"'Hidden Summary'!D143","v":0},null,{"$f":"IF('Hidden Summary'!G143=\"Rational Method\",\"Rational\",IF('Hidden Summary'!G143=\"TR-55 Method\",\"TR-55\",IF('Hidden Summary'!G143=\"USGS-5030 Method\",\"USGS-5030\",IF('Hidden Summary'!G143=\"USGS-5158 Method\",\"USGS-5158\",IF('Hidden Summary'!G143=\"User Input Method\",\"User Input\",\"\")))))","v":""},null,{"$f":"'Hidden Summary'!I143","v":0},{"$f":"'Hidden Summary'!K143","v":0},{"$f":"'Hidden Summary'!M143","v":0},{"$f":"'Hidden Summary'!Z143","v":0},{"$f":"'Hidden Summary'!O143","v":0},null,{"$f":"'Hidden Summary'!Q143","v":0},{"$f":"'Hidden Summary'!U143","v":0},{"$f":"'Hidden Summary'!S143","v":0},{"$f":"'Hidden Summary'!X143","v":0},null,{"$f":"'Hidden Summary'!J143","v":0},{"$f":"'Hidden Summary'!L143","v":0},{"$f":"'Hidden Summary'!N143","v":0},{"$f":"'Hidden Summary'!AA143","v":0},{"$f":"'Hidden Summary'!P143","v":0},null,{"$f":"'Hidden Summary'!W143","v":0},{"$f":"'Hidden Summary'!Y143","v":0},{"$f":"'Hidden Summary'!R143","v":0},{"$f":"'Hidden Summary'!V143","v":0},{"$f":"'Hidden Summary'!T143","v":0},null,{"$error":"#DIV/0!"},{"$error":"#DIV/0!"},{"$error":"#DIV/0!"},0,0,0,{"$f":"'Hidden Summary'!AB143","v":0}]
[{"$f":"'Hidden Summary'!A144","v":0},null,{"$f":"'Hidden Summary'!D144","v":0},null,{"$f":"IF('Hidden Summary'!G144=\"Rational Method\",\"Rational\",IF('Hidden Summary'!G144=\"TR-55 Method\",\"TR-55\",IF('Hidden Summary'!G144=\"USGS-5030 Method\",\"USGS-5030\",IF('Hidden Summary'!G144=\"USGS-5158 Method\",\"USGS-5158\",IF('Hidden Summary'!G144=\"User Input Method\",\"User Input\",\"\")))))","v":""},null,{"$f":"'Hidden Summary'!I144","v":0},{"$f":"'Hidden Summary'!K144","v":0},{"$f":"'Hidden Summary'!M144","v":0},{"$f":"'Hidden Summary'!Z144","v":0},{"$f":"'Hidden Summary'!O144","v":0},null,{"$f":"'Hidden Summary'!Q144","v":0},{"$f":"'Hidden Summary'!U144","v":0},{"$f":"'Hidden Summary'!S144","v":0},{"$f":"'Hidden Summary'!X144","v":0},null,{"$f":"'Hidden Summary'!J144","v":0},{"$f":"'Hidden Summary'!L144","v":0},{"$f":"'Hidden Summary'!N144","v":0},{"$f":"'Hidden Summary'!AA144","v":0},{"$f":"'Hidden Summary'!P144","v":0},null,{"$f":"'Hidden Summary'!W144","v":0},{"$f":"'Hidden Summary'!Y144","v":0},{"$f":"'Hidden Summary'!R144","v":0},{"$f":"'Hidden Summary'!V144","v":0},{"$f":"'Hidden Summary'!T144","v":0},null,{"$error":"#DIV/0!"},{"$error":"#DIV/0!"},{"$error":"#DIV/0!"},0,0,0,{"$f":"'Hidden Summary'!AB144","v":0}]
[{"$f":"'Hidden Summary'!A145","v":0},null,{"$f":"'Hidden Summary'!D145","v":0},null,{"$f":"IF('Hidden Summary'!G145=\"Rational Method\",\"Rational\",IF('Hidden Summary'!G145=\"TR-55 Method\",\"TR-55\",IF('Hidden Summary'!G145=\"USGS-5030 Method\",\"USGS-5030\",IF('Hidden Summary'!G145=\"USGS-5158 Method\",\"USGS-5158\",IF('Hidden Summary'!G145=\"User Input Method\",\"User Input\",\"\")))))","v":""},null,{"$f":"'Hidden Summary'!I145","v":0},{"$f":"'Hidden Summary'!K145","v":0},{"$f":"'Hidden Summary'!M145","v":0},{"$f":"'Hidden Summary'!Z145","v":0},{"$f":"'Hidden Summary'!O145","v":0},null,{"$f":"'Hidden Summary'!Q145","v":0},{"$f":"'Hidden Summary'!U145","v":0},{"$f":"'Hidden Summary'!S145","v":0},{"$f":"'Hidden Summary'!X145","v":0},null,{"$f":"'Hidden Summary'!J145","v":0},{"$f":"'Hidden Summary'!L145","v":0},{"$f":"'Hidden Summary'!N145","v":0},{"$f":"'Hidden Summary'!AA145","v":0},{"$f":"'Hidden Summary'!P145","v":0},null,{"$f":"'Hidden Summary'!W145","v":0},{"$f":"'Hidden Summary'!Y145","v":0},{"$f":"'Hidden Summary'!R145","v":0},{"$f":"'Hidden Summary'!V145","v":0},{"$f":"'Hidden Summary'!T145","v":0},null,{"$error":"#DIV/0!"},{"$error":"#DIV/0!"},{"$error":"#DIV/0!"},0,0,0,{"$f":"'Hidden Summary'!AB145","v":0}]
[{"$f":"'Hidden Summary'!A146","v":0},null,{"$f":"'Hidden Summary'!D146","v":0},null,{"$f":"IF('Hidden Summary'!G146=\"Rational Method\",\"Rational\",IF('Hidden Summary'!G146=\"TR-55 Method\",\"TR-55\",IF('Hidden Summary'!G146=\"USGS-5030 Method\",\"USGS-5030\",IF('Hidden Summary'!G146=\"USGS-5158 Method\",\"USGS-5158\",IF('Hidden Summary'!G146=\"User Input Method\",\"User Input\",\"\")))))","v":""},null,{"$f":"'Hidden Summary'!I146","v":0},{"$f":"'Hidden Summary'!K146","v":0},{"$f":"'Hidden Summary'!M146","v":0},{"$f":"'Hidden Summary'!Z146","v":0},{"$f":"'Hidden Summary'!O146","v":0},null,{"$f":"'Hidden Summary'!Q146","v":0},{"$f":"'Hidden Summary'!U146","v":0},{"$f":"'Hidden Summary'!S146","v":0},{"$f":"'Hidden Summary'!X146","v":0},null,{"$f":"'Hidden Summary'!J146","v":0},{"$f":"'Hidden Summary'!L146","v":0},{"$f":"'Hidden Summary'!N146","v":0},{"$f":"'Hidden Summary'!AA146","v":0},{"$f":"'Hidden Summary'!P146","v":0},null,{"$f":"'Hidden Summary'!W146","v":0},{"$f":"'Hidden Summary'!Y146","v":0},{"$f":"'Hidden Summary'!R146","v":0},{"$f":"'Hidden Summary'!V146","v":0},{"$f":"'Hidden Summary'!T146","v":0},null,{"$error":"#DIV/0!"},{"$error":"#DIV/0!"},{"$error":"#DIV/0!"},0,0,0,{"$f":"'Hidden Summary'!AB146","v":0}]
[{"$f":"'Hidden Summary'!A147","v":0},null,{"$f":"'Hidden Summary'!D147","v":0},null,{"$f":"IF('Hidden Summary'!G147=\"Rational Method\",\"Rational\",IF('Hidden Summary'!G147=\"TR-55 Method\",\"TR-55\",IF('Hidden Summary'!G147=\"USGS-5030 Method\",\"USGS-5030\",IF('Hidden Summary'!G147=\"USGS-5158 Method\",\"USGS-5158\",IF('Hidden Summary'!G147=\"User Input Method\",\"User Input\",\"\")))))","v":""},null,{"$f":"'Hidden Summary'!I147","v":0},{"$f":"'Hidden Summary'!K147","v":0},{"$f":"'Hidden Summary'!M147","v":0},{"$f":"'Hidden Summary'!Z147","v":0},{"$f":"'Hidden Summary'!O147","v":0},null,{"$f":"'Hidden Summary'!Q147","v":0},{"$f":"'Hidden Summary'!U147","v":0},{"$f":"'Hidden Summary'!S147","v":0},{"$f":"'Hidden Summary'!X147","v":0},null,{"$f":"'Hidden Summary'!J147","v":0},{"$f":"'Hidden Summary'!L147","v":0},{"$f":"'Hidden Summary'!N147","v":0},{"$f":"'Hidden Summary'!AA147","v":0},{"$f":"'Hidden Summary'!P147","v":0},null,{"$f":"'Hidden Summary'!W147","v":0},{"$f":"'Hidden Summary'!Y147","v":0},{"$f":"'Hidden Summary'!R147","v":0},{"$f":"'Hidden Summary'!V147","v":0},{"$f":"'Hidden Summary'!T147","v":0},null,{"$error":"#DIV/0!"},{"$error":"#DIV/0!"},{"$error":"#DIV/0!"},0,0,0,{"$f":"'Hidden Summary'!AB147","v":0}]
[{"$f":"'Hidden Summary'!A148","v":0},null,{"$f":"'Hidden Summary'!D148","v":0},null,{"$f":"IF('Hidden Summary'!G148=\"Rational Method\",\"Rational\",IF('Hidden Summary'!G148=\"TR-55 Method\",\"TR-55\",IF('Hidden Summary'!G148=\"USGS-5030 Method\",\"USGS-5030\",IF('Hidden Summary'!G148=\"USGS-5158 Method\",\"USGS-5158\",IF('Hidden Summary'!G148=\"User Input Method\",\"User Input\",\"\")))))","v":""},null,{"$f":"'Hidden Summary'!I148","v":0},{"$f":"'Hidden Summary'!K148","v":0},{"$f":"'Hidden Summary'!M148","v":0},{"$f":"'Hidden Summary'!Z148","v":0},{"$f":"'Hidden Summary'!O148","v":0},null,{"$f":"'Hidden Summary'!Q148","v":0},{"$f":"'Hidden Summary'!U148","v":0},{"$f":"'Hidden Summary'!S148","v":0},{"$f":"'Hidden Summary'!X148","v":0},null,{"$f":"'Hidden Summary'!J148","v":0},{"$f":"'Hidden Summary'!L148","v":0},{"$f":"'Hidden Summary'!N148","v":0},{"$f":"'Hidden Summary'!AA148","v":0},{"$f":"'Hidden Summary'!P148","v":0},null,{"$f":"'Hidden Summary'!W148","v":0},{"$f":"'Hidden Summary'!Y148","v":0},{"$f":"'Hidden Summary'!R148","v":0},{"$f":"'Hidden Summary'!V148","v":0},{"$f":"'Hidden Summary'!T148","v":0},null,{"$error":"#DIV/0!"},{"$error":"#DIV/0!"},{"$error":"#DIV/0!"},0,0,0,{"$f":"'Hidden Summary'!AB148","v":0}]
[{"$f":"'Hidden Summary'!A149","v":0},null,{"$f":"'Hidden Summary'!D149","v":0},null,{"$f":"IF('Hidden Summary'!G149=\"Rational Method\",\"Rational\",IF('Hidden Summary'!G149=\"TR-55 Method\",\"TR-55\",IF('Hidden Summary'!G149=\"USGS-5030 Method\",\"USGS-5030\",IF('Hidden Summary'!G149=\"USGS-5158 Method\",\"USGS-5158\",IF('Hidden Summary'!G149=\"User Input Method\",\"User Input\",\"\")))))","v":""},null,{"$f":"'Hidden Summary'!I149","v":0},{"$f":"'Hidden Summary'!K149","v":0},{"$f":"'Hidden Summary'!M149","v":0},{"$f":"'Hidden Summary'!Z149","v":0},{"$f":"'Hidden Summary'!O149","v":0},null,{"$f":"'Hidden Summary'!Q149","v":0},{"$f":"'Hidden Summary'!U149","v":0},{"$f":"'Hidden Summary'!S149","v":0},{"$f":"'Hidden Summary'!X149","v":0},null,{"$f":"'Hidden Summary'!J149","v":0},{"$f":"'Hidden Summary'!L149","v":0},{"$f":"'Hidden Summary'!N149","v":0},{"$f":"'Hidden Summary'!AA149","v":0},{"$f":"'Hidden Summary'!P149","v":0},null,{"$f":"'Hidden Summary'!W149","v":0},{"$f":"'Hidden Summary'!Y149","v":0},{"$f":"'Hidden Summary'!R149","v":0},{"$f":"'Hidden Summary'!V149","v":0},{"$f":"'Hidden Summary'!T149","v":0},null,{"$error":"#DIV/0!"},{"$error":"#DIV/0!"},{"$error":"#DIV/0!"},0,0,0,{"$f":"'Hidden Summary'!AB149","v":0}]
[{"$f":"'Hidden Summary'!A150","v":0},null,{"$f":"'Hidden Summary'!D150","v":0},null,{"$f":"IF('Hidden Summary'!G150=\"Rational Method\",\"Rational\",IF('Hidden Summary'!G150=\"TR-55 Method\",\"TR-55\",IF('Hidden Summary'!G150=\"USGS-5030 Method\",\"USGS-5030\",IF('Hidden Summary'!G150=\"USGS-5158 Method\",\"USGS-5158\",IF('Hidden Summary'!G150=\"User Input Method\",\"User Input\",\"\")))))","v":""},null,{"$f":"'Hidden Summary'!I150","v":0},{"$f":"'Hidden Summary'!K150","v":0},{"$f":"'Hidden Summary'!M150","v":0},{"$f":"'Hidden Summary'!Z150","v":0},{"$f":"'Hidden Summary'!O150","v":0},null,{"$f":"'Hidden Summary'!Q150","v":0},{"$f":"'Hidden Summary'!U150","v":0},{"$f":"'Hidden Summary'!S150","v":0},{"$f":"'Hidden Summary'!X150","v":0},null,{"$f":"'Hidden Summary'!J150","v":0},{"$f":"'Hidden Summary'!L150","v":0},{"$f":"'Hidden Summary'!N150","v":0},{"$f":"'Hidden Summary'!AA150","v":0},{"$f":"'Hidden Summary'!P150","v":0},null,{"$f":"'Hidden Summary'!W150","v":0},{"$f":"'Hidden Summary'!Y150","v":0},{"$f":"'Hidden Summary'!R150","v":0},{"$f":"'Hidden Summary'!V150","v":0},{"$f":"'Hidden Summary'!T150","v":0},null,{"$error":"#DIV/0!"},{"$error":"#DIV/0!"},{"$error":"#DIV/0!"},0,0,0,{"$f":"'Hidden Summary'!AB150","v":0}]
[{"$f":"'Hidden Summary'!A151","v":0},null,{"$f":"'Hidden Summary'!D151","v":0},null,{"$f":"IF('Hidden Summary'!G151=\"Rational Method\",\"Rational\",IF('Hidden Summary'!G151=\"TR-55 Method\",\"TR-55\",IF('Hidden Summary'!G151=\"USGS-5030 Method\",\"USGS-5030\",IF('Hidden Summary'!G151=\"USGS-5158 Method\",\"USGS-5158\",IF('Hidden Summary'!G151=\"User Input Method\",\"User Input\",\"\")))))","v":""},null,{"$f":"'Hidden Summary'!I151","v":0},{"$f":"'Hidden Summary'!K151","v":0},{"$f":"'Hidden Summary'!M151","v":0},{"$f":"'Hidden Summary'!Z151","v":0},{"$f":"'Hidden Summary'!O151","v":0},null,{"$f":"'Hidden Summary'!Q151","v":0},{"$f":"'Hidden Summary'!U151","v":0},{"$f":"'Hidden Summary'!S151","v":0},{"$f":"'Hidden Summary'!X151","v":0},null,{"$f":"'Hidden Summary'!J151","v":0},{"$f":"'Hidden Summary'!L151","v":0},{"$f":"'Hidden Summary'!N151","v":0},{"$f":"'Hidden Summary'!AA151","v":0},{"$f":"'Hidden Summary'!P151","v":0},null,{"$f":"'Hidden Summary'!W151","v":0},{"$f":"'Hidden Summary'!Y151","v":0},{"$f":"'Hidden Summary'!R151","v":0},{"$f":"'Hidden Summary'!V151","v":0},{"$f":"'Hidden Summary'!T151","v":0},null,{"$error":"#DIV/0!"},{"$error":"#DIV/0!"},{"$error":"#DIV/0!"},0,0,0,{"$f":"'Hidden Summary'!AB151","v":0}]
[{"$f":"'Hidden Summary'!A152","v":0},null,{"$f":"'Hidden Summary'!D152","v":0},null,{"$f":"IF('Hidden Summary'!G152=\"Rational Method\",\"Rational\",IF('Hidden Summary'!G152=\"TR-55 Method\",\"TR-55\",IF('Hidden Summary'!G152=\"USGS-5030 Method\",\"USGS-5030\",IF('Hidden Summary'!G152=\"USGS-5158 Method\",\"USGS-5158\",IF('Hidden Summary'!G152=\"User Input Method\",\"User Input\",\"\")))))","v":""},null,{"$f":"'Hidden Summary'!I152","v":0},{"$f":"'Hidden Summary'!K152","v":0},{"$f":"'Hidden Summary'!M152","v":0},{"$f":"'Hidden Summary'!Z152","v":0},{"$f":"'Hidden Summary'!O152","v":0},null,{"$f":"'Hidden Summary'!Q152","v":0},{"$f":"'Hidden Summary'!U152","v":0},{"$f":"'Hidden Summary'!S152","v":0},{"$f":"'Hidden Summary'!X152","v":0},null,{"$f":"'Hidden Summary'!J152","v":0},{"$f":"'Hidden Summary'!L152","v":0},{"$f":"'Hidden Summary'!N152","v":0},{"$f":"'Hidden Summary'!AA152","v":0},{"$f":"'Hidden Summary'!P152","v":0},null,{"$f":"'Hidden Summary'!W152","v":0},{"$f":"'Hidden Summary'!Y152","v":0},{"$f":"'Hidden Summary'!R152","v":0},{"$f":"'Hidden Summary'!V152","v":0},{"$f":"'Hidden Summary'!T152","v":0},null,{"$error":"#DIV/0!"},{"$error":"#DIV/0!"},{"$error":"#DIV/0!"},0,0,0,{"$f":"'Hidden Summary'!AB152","v":0}]
[{"$f":"'Hidden Summary'!A153","v":0},null,{"$f":"'Hidden Summary'!D153","v":0},null,{"$f":"IF('Hidden Summary'!G153=\"Rational Method\",\"Rational\",IF('Hidden Summary'!G153=\"TR-55 Method\",\"TR-55\",IF('Hidden Summary'!G153=\"USGS-5030 Method\",\"USGS-5030\",IF('Hidden Summary'!G153=\"USGS-5158 Method\",\"USGS-5158\",IF('Hidden Summary'!G153=\"User Input Method\",\"User Input\",\"\")))))","v":""},null,{"$f":"'Hidden Summary'!I153","v":0},{"$f":"'Hidden Summary'!K153","v":0},{"$f":"'Hidden Summary'!M153","v":0},{"$f":"'Hidden Summary'!Z153","v":0},{"$f":"'Hidden Summary'!O153","v":0},null,{"$f":"'Hidden Summary'!Q153","v":0},{"$f":"'Hidden Summary'!U153","v":0},{"$f":"'Hidden Summary'!S153","v":0},{"$f":"'Hidden Summary'!X153","v":0},null,{"$f":"'Hidden Summary'!J153","v":0},{"$f":"'Hidden Summary'!L153","v":0},{"$f":"'Hidden Summary'!N153","v":0},{"$f":"'Hidden Summary'!AA153","v":0},{"$f":"'Hidden Summary'!P153","v":0},null,{"$f":"'Hidden Summary'!W153","v":0},{"$f":"'Hidden Summary'!Y153","v":0},{"$f":"'Hidden Summary'!R153","v":0},{"$f":"'Hidden Summary'!V153","v":0},{"$f":"'Hidden Summary'!T153","v":0},null,{"$error":"#DIV/0!"},{"$error":"#DIV/0!"},{"$error":"#DIV/0!"},0,0,0,{"$f":"'Hidden Summary'!AB153","v":0}]
[{"$f":"'Hidden Summary'!A154","v":0},null,{"$f":"'Hidden Summary'!D154","v":0},null,{"$f":"IF('Hidden Summary'!G154=\"Rational Method\",\"Rational\",IF('Hidden Summary'!G154=\"TR-55 Method\",\"TR-55\",IF('Hidden Summary'!G154=\"USGS-5030 Method\",\"USGS-5030\",IF('Hidden Summary'!G154=\"USGS-5158 Method\",\"USGS-5158\",IF('Hidden Summary'!G154=\"User Input Method\",\"User Input\",\"\")))))","v":""},null,{"$f":"'Hidden Summary'!I154","v":0},{"$f":"'Hidden Summary'!K154","v":0},{"$f":"'Hidden Summary'!M154","v":0},{"$f":"'Hidden Summary'!Z154","v":0},{"$f":"'Hidden Summary'!O154","v":0},null,{"$f":"'Hidden Summary'!Q154","v":0},{"$f":"'Hidden Summary'!U154","v":0},{"$f":"'Hidden Summary'!S154","v":0},{"$f":"'Hidden Summary'!X154","v":0},null,{"$f":"'Hidden Summary'!J154","v":0},{"$f":"'Hidden Summary'!L154","v":0},{"$f":"'Hidden Summary'!N154","v":0},{"$f":"'Hidden Summary'!AA154","v":0},{"$f":"'Hidden Summary'!P154","v":0},null,{"$f":"'Hidden Summary'!W154","v":0},{"$f":"'Hidden Summary'!Y154","v":0},{"$f":"'Hidden Summary'!R154","v":0},{"$f":"'Hidden Summary'!V154","v":0},{"$f":"'Hidden Summary'!T154","v":0},null,{"$error":"#DIV/0!"},{"$error":"#DIV/0!"},{"$error":"#DIV/0!"},0,0,0,{"$f":"'Hidden Summary'!AB154","v":0}]
[{"$f":"'Hidden Summary'!A155","v":0},null,{"$f":"'Hidden Summary'!D155","v":0},null,{"$f":"IF('Hidden Summary'!G155=\"Rational Method\",\"Rational\",IF('Hidden Summary'!G155=\"TR-55 Method\",\"TR-55\",IF('Hidden Summary'!G155=\"USGS-5030 Method\",\"USGS-5030\",IF('Hidden Summary'!G155=\"USGS-5158 Method\",\"USGS-5158\",IF('Hidden Summary'!G155=\"User Input Method\",\"User Input\",\"\")))))","v":""},null,{"$f":"'Hidden Summary'!I155","v":0},{"$f":"'Hidden Summary'!K155","v":0},{"$f":"'Hidden Summary'!M155","v":0},{"$f":"'Hidden Summary'!Z155","v":0},{"$f":"'Hidden Summary'!O155","v":0},null,{"$f":"'Hidden Summary'!Q155","v":0},{"$f":"'Hidden Summary'!U155","v":0},{"$f":"'Hidden Summary'!S155","v":0},{"$f":"'Hidden Summary'!X155","v":0},null,{"$f":"'Hidden Summary'!J155","v":0},{"$f":"'Hidden Summary'!L155","v":0},{"$f":"'Hidden Summary'!N155","v":0},{"$f":"'Hidden Summary'!AA155","v":0},{"$f":"'Hidden Summary'!P155","v":0},null,{"$f":"'Hidden Summary'!W155","v":0},{"$f":"'Hidden Summary'!Y155","v":0},{"$f":"'Hidden Summary'!R155","v":0},{"$f":"'Hidden Summary'!V155","v":0},{"$f":"'Hidden Summary'!T155","v":0},null,{"$error":"#DIV/0!"},{"$error":"#DIV/0!"},{"$error":"#DIV/0!"},0,0,0,{"$f":"'Hidden Summary'!AB155","v":0}]
[{"$f":"'Hidden Summary'!A156","v":0},null,{"$f":"'Hidden Summary'!D156","v":0},null,{"$f":"IF('Hidden Summary'!G156=\"Rational Method\",\"Rational\",IF('Hidden Summary'!G156=\"TR-55 Method\",\"TR-55\",IF('Hidden Summary'!G156=\"USGS-5030 Method\",\"USGS-5030\",IF('Hidden Summary'!G156=\"USGS-5158 Method\",\"USGS-5158\",IF('Hidden Summary'!G156=\"User Input Method\",\"User Input\",\"\")))))","v":""},null,{"$f":"'Hidden Summary'!I156","v":0},{"$f":"'Hidden Summary'!K156","v":0},{"$f":"'Hidden Summary'!M156","v":0},{"$f":"'Hidden Summary'!Z156","v":0},{"$f":"'Hidden Summary'!O156","v":0},null,{"$f":"'Hidden Summary'!Q156","v":0},{"$f":"'Hidden Summary'!U156","v":0},{"$f":"'Hidden Summary'!S156","v":0},{"$f":"'Hidden Summary'!X156","v":0},null,{"$f":"'Hidden Summary'!J156","v":0},{"$f":"'Hidden Summary'!L156","v":0},{"$f":"'Hidden Summary'!N156","v":0},{"$f":"'Hidden Summary'!AA156","v":0},{"$f":"'Hidden Summary'!P156","v":0},null,{"$f":"'Hidden Summary'!W156","v":0},{"$f":"'Hidden Summary'!Y156","v":0},{"$f":"'Hidden Summary'!R156","v":0},{"$f":"'Hidden Summary'!V156","v":0},{"$f":"'Hidden Summary'!T156","v":0},null,{"$error":"#DIV/0!"},{"$error":"#DIV/0!"},{"$error":"#DIV/0!"},0,0,0,{"$f":"'Hidden Summary'!AB156","v":0}]
[{"$f":"'Hidden Summary'!A157","v":0},null,{"$f":"'Hidden Summary'!D157","v":0},null,{"$f":"IF('Hidden Summary'!G157=\"Rational Method\",\"Rational\",IF('Hidden Summary'!G157=\"TR-55 Method\",\"TR-55\",IF('Hidden Summary'!G157=\"USGS-5030 Method\",\"USGS-5030\",IF('Hidden Summary'!G157=\"USGS-5158 Method\",\"USGS-5158\",IF('Hidden Summary'!G157=\"User Input Method\",\"User Input\",\"\")))))","v":""},null,{"$f":"'Hidden Summary'!I157","v":0},{"$f":"'Hidden Summary'!K157","v":0},{"$f":"'Hidden Summary'!M157","v":0},{"$f":"'Hidden Summary'!Z157","v":0},{"$f":"'Hidden Summary'!O157","v":0},null,{"$f":"'Hidden Summary'!Q157","v":0},{"$f":"'Hidden Summary'!U157","v":0},{"$f":"'Hidden Summary'!S157","v":0},{"$f":"'Hidden Summary'!X157","v":0},null,{"$f":"'Hidden Summary'!J157","v":0},{"$f":"'Hidden Summary'!L157","v":0},{"$f":"'Hidden Summary'!N157","v":0},{"$f":"'Hidden Summary'!AA157","v":0},{"$f":"'Hidden Summary'!P157","v":0},null,{"$f":"'Hidden Summary'!W157","v":0},{"$f":"'Hidden Summary'!Y157","v":0},{"$f":"'Hidden Summary'!R157","v":0},{"$f":"'Hidden Summary'!V157","v":0},{"$f":"'Hidden Summary'!T157","v":0},null,{"$error":"#DIV/0!"},{"$error":"#DIV/0!"},{"$error":"#DIV/0!"},0,0,0,{"$f":"'Hidden Summary'!AB157","v":0}]
[{"$f":"'Hidden Summary'!A158","v":0},null,{"$f":"'Hidden Summary'!D158","v":0},null,{"$f":"IF('Hidden Summary'!G158=\"Rational Method\",\"Rational\",IF('Hidden Summary'!G158=\"TR-55 Method\",\"TR-55\",IF('Hidden Summary'!G158=\"USGS-5030 Method\",\"USGS-5030\",IF('Hidden Summary'!G158=\"USGS-5158 Method\",\"USGS-5158\",IF('Hidden Summary'!G158=\"User Input Method\",\"User Input\",\"\")))))","v":""},null,{"$f":"'Hidden Summary'!I158","v":0},{"$f":"'Hidden Summary'!K158","v":0},{"$f":"'Hidden Summary'!M158","v":0},{"$f":"'Hidden Summary'!Z158","v":0},{"$f":"'Hidden Summary'!O158","v":0},null,{"$f":"'Hidden Summary'!Q158","v":0},{"$f":"'Hidden Summary'!U158","v":0},{"$f":"'Hidden Summary'!S158","v":0},{"$f":"'Hidden Summary'!X158","v":0},null,{"$f":"'Hidden Summary'!J158","v":0},{"$f":"'Hidden Summary'!L158","v":0},{"$f":"'Hidden Summary'!N158","v":0},{"$f":"'Hidden Summary'!AA158","v":0},{"$f":"'Hidden Summary'!P158","v":0},null,{"$f":"'Hidden Summary'!W158","v":0},{"$f":"'Hidden Summary'!Y158","v":0},{"$f":"'Hidden Summary'!R158","v":0},{"$f":"'Hidden Summary'!V158","v":0},{"$f":"'Hidden Summary'!T158","v":0},null,{"$error":"#DIV/0!"},{"$error":"#DIV/0!"},{"$error":"#DIV/0!"},0,0,0,{"$f":"'Hidden Summary'!AB158","v":0}]
[{"$f":"'Hidden Summary'!A159","v":0},null,{"$f":"'Hidden Summary'!D159","v":0},null,{"$f":"IF('Hidden Summary'!G159=\"Rational Method\",\"Rational\",IF('Hidden Summary'!G159=\"TR-55 Method\",\"TR-55\",IF('Hidden Summary'!G159=\"USGS-5030 Method\",\"USGS-5030\",IF('Hidden Summary'!G159=\"USGS-5158 Method\",\"USGS-5158\",IF('Hidden Summary'!G159=\"User Input Method\",\"User Input\",\"\")))))","v":""},null,{"$f":"'Hidden Summary'!I159","v":0},{"$f":"'Hidden Summary'!K159","v":0},{"$f":"'Hidden Summary'!M159","v":0},{"$f":"'Hidden Summary'!Z159","v":0},{"$f":"'Hidden Summary'!O159","v":0},null,{"$f":"'Hidden Summary'!Q159","v":0},{"$f":"'Hidden Summary'!U159","v":0},{"$f":"'Hidden Summary'!S159","v":0},{"$f":"'Hidden Summary'!X159","v":0},null,{"$f":"'Hidden Summary'!J159","v":0},{"$f":"'Hidden Summary'!L159","v":0},{"$f":"'Hidden Summary'!N159","v":0},{"$f":"'Hidden Summary'!AA159","v":0},{"$f":"'Hidden Summary'!P159","v":0},null,{"$f":"'Hidden Summary'!W159","v":0},{"$f":"'Hidden Summary'!Y159","v":0},{"$f":"'Hidden Summary'!R159","v":0},{"$f":"'Hidden Summary'!V159","v":0},{"$f":"'Hidden Summary'!T159","v":0},null,{"$error":"#DIV/0!"},{"$error":"#DIV/0!"},{"$error":"#DIV/0!"},0,0,0,{"$f":"'Hidden Summary'!AB159","v":0}]
[{"$f":"'Hidden Summary'!A160","v":0},null,{"$f":"'Hidden Summary'!D160","v":0},null,{"$f":"IF('Hidden Summary'!G160=\"Rational Method\",\"Rational\",IF('Hidden Summary'!G160=\"TR-55 Method\",\"TR-55\",IF('Hidden Summary'!G160=\"USGS-5030 Method\",\"USGS-5030\",IF('Hidden Summary'!G160=\"USGS-5158 Method\",\"USGS-5158\",IF('Hidden Summary'!G160=\"User Input Method\",\"User Input\",\"\")))))","v":""},null,{"$f":"'Hidden Summary'!I160","v":0},{"$f":"'Hidden Summary'!K160","v":0},{"$f":"'Hidden Summary'!M160","v":0},{"$f":"'Hidden Summary'!Z160","v":0},{"$f":"'Hidden Summary'!O160","v":0},null,{"$f":"'Hidden Summary'!Q160","v":0},{"$f":"'Hidden Summary'!U160","v":0},{"$f":"'Hidden Summary'!S160","v":0},{"$f":"'Hidden Summary'!X160","v":0},null,{"$f":"'Hidden Summary'!J160","v":0},{"$f":"'Hidden Summary'!L160","v":0},{"$f":"'Hidden Summary'!N160","v":0},{"$f":"'Hidden Summary'!AA160","v":0},{"$f":"'Hidden Summary'!P160","v":0},null,{"$f":"'Hidden Summary'!W160","v":0},{"$f":"'Hidden Summary'!Y160","v":0},{"$f":"'Hidden Summary'!R160","v":0},{"$f":"'Hidden Summary'!V160","v":0},{"$f":"'Hidden Summary'!T160","v":0},null,{"$error":"#DIV/0!"},{"$error":"#DIV/0!"},{"$error":"#DIV/0!"},0,0,0,{"$f":"'Hidden Summary'!AB160","v":0}]
[{"$f":"'Hidden Summary'!A161","v":0},null,{"$f":"'Hidden Summary'!D161","v":0},null,{"$f":"IF('Hidden Summary'!G161=\"Rational Method\",\"Rational\",IF('Hidden Summary'!G161=\"TR-55 Method\",\"TR-55\",IF('Hidden Summary'!G161=\"USGS-5030 Method\",\"USGS-5030\",IF('Hidden Summary'!G161=\"USGS-5158 Method\",\"USGS-5158\",IF('Hidden Summary'!G161=\"User Input Method\",\"User Input\",\"\")))))","v":""},null,{"$f":"'Hidden Summary'!I161","v":0},{"$f":"'Hidden Summary'!K161","v":0},{"$f":"'Hidden Summary'!M161","v":0},{"$f":"'Hidden Summary'!Z161","v":0},{"$f":"'Hidden Summary'!O161","v":0},null,{"$f":"'Hidden Summary'!Q161","v":0},{"$f":"'Hidden Summary'!U161","v":0},{"$f":"'Hidden Summary'!S161","v":0},{"$f":"'Hidden Summary'!X161","v":0},null,{"$f":"'Hidden Summary'!J161","v":0},{"$f":"'Hidden Summary'!L161","v":0},{"$f":"'Hidden Summary'!N161","v":0},{"$f":"'Hidden Summary'!AA161","v":0},{"$f":"'Hidden Summary'!P161","v":0},null,{"$f":"'Hidden Summary'!W161","v":0},{"$f":"'Hidden Summary'!Y161","v":0},{"$f":"'Hidden Summary'!R161","v":0},{"$f":"'Hidden Summary'!V161","v":0},{"$f":"'Hidden Summary'!T161","v":0},null,{"$error":"#DIV/0!"},{"$error":"#DIV/0!"},{"$error":"#DIV/0!"},0,0,0,{"$f":"'Hidden Summary'!AB161","v":0}]
[{"$f":"'Hidden Summary'!A162","v":0},null,{"$f":"'Hidden Summary'!D162","v":0},null,{"$f":"IF('Hidden Summary'!G162=\"Rational Method\",\"Rational\",IF('Hidden Summary'!G162=\"TR-55 Method\",\"TR-55\",IF('Hidden Summary'!G162=\"USGS-5030 Method\",\"USGS-5030\",IF('Hidden Summary'!G162=\"USGS-5158 Method\",\"USGS-5158\",IF('Hidden Summary'!G162=\"User Input Method\",\"User Input\",\"\")))))","v":""},null,{"$f":"'Hidden Summary'!I162","v":0},{"$f":"'Hidden Summary'!K162","v":0},{"$f":"'Hidden Summary'!M162","v":0},{"$f":"'Hidden Summary'!Z162","v":0},{"$f":"'Hidden Summary'!O162","v":0},null,{"$f":"'Hidden Summary'!Q162","v":0},{"$f":"'Hidden Summary'!U162","v":0},{"$f":"'Hidden Summary'!S162","v":0},{"$f":"'Hidden Summary'!X162","v":0},null,{"$f":"'Hidden Summary'!J162","v":0},{"$f":"'Hidden Summary'!L162","v":0},{"$f":"'Hidden Summary'!N162","v":0},{"$f":"'Hidden Summary'!AA162","v":0},{"$f":"'Hidden Summary'!P162","v":0},null,{"$f":"'Hidden Summary'!W162","v":0},{"$f":"'Hidden Summary'!Y162","v":0},{"$f":"'Hidden Summary'!R162","v":0},{"$f":"'Hidden Summary'!V162","v":0},{"$f":"'Hidden Summary'!T162","v":0},null,{"$error":"#DIV/0!"},{"$error":"#DIV/0!"},{"$error":"#DIV/0!"},0,0,0,{"$f":"'Hidden Summary'!AB162","v":0}]
[{"$f":"'Hidden Summary'!A163","v":0},null,{"$f":"'Hidden Summary'!D163","v":0},null,{"$f":"IF('Hidden Summary'!G163=\"Rational Method\",\"Rational\",IF('Hidden Summary'!G163=\"TR-55 Method\",\"TR-55\",IF('Hidden Summary'!G163=\"USGS-5030 Method\",\"USGS-5030\",IF('Hidden Summary'!G163=\"USGS-5158 Method\",\"USGS-5158\",IF('Hidden Summary'!G163=\"User Input Method\",\"User Input\",\"\")))))","v":""},null,{"$f":"'Hidden Summary'!I163","v":0},{"$f":"'Hidden Summary'!K163","v":0},{"$f":"'Hidden Summary'!M163","v":0},{"$f":"'Hidden Summary'!Z163","v":0},{"$f":"'Hidden Summary'!O163","v":0},null,{"$f":"'Hidden Summary'!Q163","v":0},{"$f":"'Hidden Summary'!U163","v":0},{"$f":"'Hidden Summary'!S163","v":0},{"$f":"'Hidden Summary'!X163","v":0},null,{"$f":"'Hidden Summary'!J163","v":0},{"$f":"'Hidden Summary'!L163","v":0},{"$f":"'Hidden Summary'!N163","v":0},{"$f":"'Hidden Summary'!AA163","v":0},{"$f":"'Hidden Summary'!P163","v":0},null,{"$f":"'Hidden Summary'!W163","v":0},{"$f":"'Hidden Summary'!Y163","v":0},{"$f":"'Hidden Summary'!R163","v":0},{"$f":"'Hidden Summary'!V163","v":0},{"$f":"'Hidden Summary'!T163","v":0},null,{"$error":"#DIV/0!"},{"$error":"#DIV/0!"},{"$error":"#DIV/0!"},0,0,0,{"$f":"'Hidden Summary'!AB163","v":0}]
[{"$f":"'Hidden Summary'!A164","v":0},null,{"$f":"'Hidden Summary'!D164","v":0},null,{"$f":"IF('Hidden Summary'!G164=\"Rational Method\",\"Rational\",IF('Hidden Summary'!G164=\"TR-55 Method\",\"TR-55\",IF('Hidden Summary'!G164=\"USGS-5030 Method\",\"USGS-5030\",IF('Hidden Summary'!G164=\"USGS-5158 Method\",\"USGS-5158\",IF('Hidden Summary'!G164=\"User Input Method\",\"User Input\",\"\")))))","v":""},null,{"$f":"'Hidden Summary'!I164","v":0},{"$f":"'Hidden Summary'!K164","v":0},{"$f":"'Hidden Summary'!M164","v":0},{"$f":"'Hidden Summary'!Z164","v":0},{"$f":"'Hidden Summary'!O164","v":0},null,{"$f":"'Hidden Summary'!Q164","v":0},{"$f":"'Hidden Summary'!U164","v":0},{"$f":"'Hidden Summary'!S164","v":0},{"$f":"'Hidden Summary'!X164","v":0},null,{"$f":"'Hidden Summary'!J164","v":0},{"$f":"'Hidden Summary'!L164","v":0},{"$f":"'Hidden Summary'!N164","v":0},{"$f":"'Hidden Summary'!AA164","v":0},{"$f":"'Hidden Summary'!P164","v":0},null,{"$f":"'Hidden Summary'!W164","v":0},{"$f":"'Hidden Summary'!Y164","v":0},{"$f":"'Hidden Summary'!R164","v":0},{"$f":"'Hidden Summary'!V164","v":0},{"$f":"'Hidden Summary'!T164","v":0},null,{"$error":"#DIV/0!"},{"$error":"#DIV/0!"},{"$error":"#DIV/0!"},0,0,0,{"$f":"'Hidden Summary'!AB164","v":0}]
[{"$f":"'Hidden Summary'!A165","v":0},null,{"$f":"'Hidden Summary'!D165","v":0},null,{"$f":"IF('Hidden Summary'!G165=\"Rational Method\",\"Rational\",IF('Hidden Summary'!G165=\"TR-55 Method\",\"TR-55\",IF('Hidden Summary'!G165=\"USGS-5030 Method\",\"USGS-5030\",IF('Hidden Summary'!G165=\"USGS-5158 Method\",\"USGS-5158\",IF('Hidden Summary'!G165=\"User Input Method\",\"User Input\",\"\")))))","v":""},null,{"$f":"'Hidden Summary'!I165","v":0},{"$f":"'Hidden Summary'!K165","v":0},{"$f":"'Hidden Summary'!M165","v":0},{"$f":"'Hidden Summary'!Z165","v":0},{"$f":"'Hidden Summary'!O165","v":0},null,{"$f":"'Hidden Summary'!Q165","v":0},{"$f":"'Hidden Summary'!U165","v":0},{"$f":"'Hidden Summary'!S165","v":0},{"$f":"'Hidden Summary'!X165","v":0},null,{"$f":"'Hidden Summary'!J165","v":0},{"$f":"'Hidden Summary'!L165","v":0},{"$f":"'Hidden Summary'!N165","v":0},{"$f":"'Hidden Summary'!AA165","v":0},{"$f":"'Hidden Summary'!P165","v":0},null,{"$f":"'Hidden Summary'!W165","v":0},{"$f":"'Hidden Summary'!Y165","v":0},{"$f":"'Hidden Summary'!R165","v":0},{"$f":"'Hidden Summary'!V165","v":0},{"$f":"'Hidden Summary'!T165","v":0},null,{"$error":"#DIV/0!"},{"$error":"#DIV/0!"},{"$error":"#DIV/0!"},0,0,0,{"$f":"'Hidden Summary'!AB165","v":0}]
[{"$f":"'Hidden Summary'!A166","v":0},null,{"$f":"'Hidden Summary'!D166","v":0},null,{"$f":"IF('Hidden Summary'!G166=\"Rational Method\",\"Rational\",IF('Hidden Summary'!G166=\"TR-55 Method\",\"TR-55\",IF('Hidden Summary'!G166=\"USGS-5030 Method\",\"USGS-5030\",IF('Hidden Summary'!G166=\"USGS-5158 Method\",\"USGS-5158\",IF('Hidden Summary'!G166=\"User Input Method\",\"User Input\",\"\")))))","v":""},null,{"$f":"'Hidden Summary'!I166","v":0},{"$f":"'Hidden Summary'!K166","v":0},{"$f":"'Hidden Summary'!M166","v":0},{"$f":"'Hidden Summary'!Z166","v":0},{"$f":"'Hidden Summary'!O166","v":0},null,{"$f":"'Hidden Summary'!Q166","v":0},{"$f":"'Hidden Summary'!U166","v":0},{"$f":"'Hidden Summary'!S166","v":0},{"$f":"'Hidden Summary'!X166","v":0},null,{"$f":"'Hidden Summary'!J166","v":0},{"$f":"'Hidden Summary'!L166","v":0},{"$f":"'Hidden Summary'!N166","v":0},{"$f":"'Hidden Summary'!AA166","v":0},{"$f":"'Hidden Summary'!P166","v":0},null,{"$f":"'Hidden Summary'!W166","v":0},{"$f":"'Hidden Summary'!Y166","v":0},{"$f":"'Hidden Summary'!R166","v":0},{"$f":"'Hidden Summary'!V166","v":0},{"$f":"'Hidden Summary'!T166","v":0},null,{"$error":"#DIV/0!"},{"$error":"#DIV/0!"},{"$error":"#DIV/0!"},0,0,0,{"$f":"'Hidden Summary'!AB166","v":0}]
[{"$f":"'Hidden Summary'!A167","v":0},null,{"$f":"'Hidden Summary'!D167","v":0},null,{"$f":"IF('Hidden Summary'!G167=\"Rational Method\",\"Rational\",IF('Hidden Summary'!G167=\"TR-55 Method\",\"TR-55\",IF('Hidden Summary'!G167=\"USGS-5030 Method\",\"USGS-5030\",IF('Hidden Summary'!G167=\"USGS-5158 Method\",\"USGS-5158\",IF('Hidden Summary'!G167=\"User Input Method\",\"User Input\",\"\")))))","v":""},null,{"$f":"'Hidden Summary'!I167","v":0},{"$f":"'Hidden Summary'!K167","v":0},{"$f":"'Hidden Summary'!M167","v":0},{"$f":"'Hidden Summary'!Z167","v":0},{"$f":"'Hidden Summary'!O167","v":0},null,{"$f":"'Hidden Summary'!Q167","v":0},{"$f":"'Hidden Summary'!U167","v":0},{"$f":"'Hidden Summary'!S167","v":0},{"$f":"'Hidden Summary'!X167","v":0},null,{"$f":"'Hidden Summary'!J167","v":0},{"$f":"'Hidden Summary'!L167","v":0},{"$f":"'Hidden Summary'!N167","v":0},{"$f":"'Hidden Summary'!AA167","v":0},{"$f":"'Hidden Summary'!P167","v":0},null,{"$f":"'Hidden Summary'!W167","v":0},{"$f":"'Hidden Summary'!Y167","v":0},{"$f":"'Hidden Summary'!R167","v":0},{"$f":"'Hidden Summary'!V167","v":0},{"$f":"'Hidden Summary'!T167","v":0},null,{"$error":"#DIV/0!"},{"$error":"#DIV/0!"},{"$error":"#DIV/0!"},0,0,0,{"$f":"'Hidden Summary'!AB167","v":0}]
[{"$f":"'Hidden Summary'!A168","v":0},null,{"$f":"'Hidden Summary'!D168","v":0},null,{"$f":"IF('Hidden Summary'!G168=\"Rational Method\",\"Rational\",IF('Hidden Summary'!G168=\"TR-55 Method\",\"TR-55\",IF('Hidden Summary'!G168=\"USGS-5030 Method\",\"USGS-5030\",IF('Hidden Summary'!G168=\"USGS-5158 Method\",\"USGS-5158\",IF('Hidden Summary'!G168=\"User Input Method\",\"User Input\",\"\")))))","v":""},null,{"$f":"'Hidden Summary'!I168","v":0},{"$f":"'Hidden Summary'!K168","v":0},{"$f":"'Hidden Summary'!M168","v":0},{"$f":"'Hidden Summary'!Z168","v":0},{"$f":"'Hidden Summary'!O168","v":0},null,{"$f":"'Hidden Summary'!Q168","v":0},{"$f":"'Hidden Summary'!U168","v":0},{"$f":"'Hidden Summary'!S168","v":0},{"$f":"'Hidden Summary'!X168","v":0},null,{"$f":"'Hidden Summary'!J168","v":0},{"$f":"'Hidden Summary'!L168","v":0},{"$f":"'Hidden Summary'!N168","v":0},{"$f":"'Hidden Summary'!AA168","v":0},{"$f":"'Hidden Summary'!P168","v":0},null,{"$f":"'Hidden Summary'!W168","v":0},{"$f":"'Hidden Summary'!Y168","v":0},{"$f":"'Hidden Summary'!R168","v":0},{"$f":"'Hidden Summary'!V168","v":0},{"$f":"'Hidden Summary'!T168","v":0},null,{"$error":"#DIV/0!"},{"$error":"#DIV/0!"},{"$error":"#DIV/0!"},0,0,0,{"$f":"'Hidden Summary'!AB168","v":0}]
[{"$f":"'Hidden Summary'!A169","v":0},null,{"$f":"'Hidden Summary'!D169","v":0},null,{"$f":"IF('Hidden Summary'!G169=\"Rational Method\",\"Rational\",IF('Hidden Summary'!G169=\"TR-55 Method\",\"TR-55\",IF('Hidden Summary'!G169=\"USGS-5030 Method\",\"USGS-5030\",IF('Hidden Summary'!G169=\"USGS-5158 Method\",\"USGS-5158\",IF('Hidden Summary'!G169=\"User Input Method\",\"User Input\",\"\")))))","v":""},null,{"$f":"'Hidden Summary'!I169","v":0},{"$f":"'Hidden Summary'!K169","v":0},{"$f":"'Hidden Summary'!M169","v":0},{"$f":"'Hidden Summary'!Z169","v":0},{"$f":"'Hidden Summary'!O169","v":0},null,{"$f":"'Hidden Summary'!Q169","v":0},{"$f":"'Hidden Summary'!U169","v":0},{"$f":"'Hidden Summary'!S169","v":0},{"$f":"'Hidden Summary'!X169","v":0},null,{"$f":"'Hidden Summary'!J169","v":0},{"$f":"'Hidden Summary'!L169","v":0},{"$f":"'Hidden Summary'!N169","v":0},{"$f":"'Hidden Summary'!AA169","v":0},{"$f":"'Hidden Summary'!P169","v":0},null,{"$f":"'Hidden Summary'!W169","v":0},{"$f":"'Hidden Summary'!Y169","v":0},{"$f":"'Hidden Summary'!R169","v":0},{"$f":"'Hidden Summary'!V169","v":0},{"$f":"'Hidden Summary'!T169","v":0},null,{"$error":"#DIV/0!"},{"$error":"#DIV/0!"},{"$error":"#DIV/0!"},0,0,0,{"$f":"'Hidden Summary'!AB169","v":0}]
[{"$f":"'Hidden Summary'!A170","v":0},null,{"$f":"'Hidden Summary'!D170","v":0},null,{"$f":"IF('Hidden Summary'!G170=\"Rational Method\",\"Rational\",IF('Hidden Summary'!G170=\"TR-55 Method\",\"TR-55\",IF('Hidden Summary'!G170=\"USGS-5030 Method\",\"USGS-5030\",IF('Hidden Summary'!G170=\"USGS-5158 Method\",\"USGS-5158\",IF('Hidden Summary'!G170=\"User Input Method\",\"User Input\",\"\")))))","v":""},null,{"$f":"'Hidden Summary'!I170","v":0},{"$f":"'Hidden Summary'!K170","v":0},{"$f":"'Hidden Summary'!M170","v":0},{"$f":"'Hidden Summary'!Z170","v":0},{"$f":"'Hidden Summary'!O170","v":0},null,{"$f":"'Hidden Summary'!Q170","v":0},{"$f":"'Hidden Summary'!U170","v":0},{"$f":"'Hidden Summary'!S170","v":0},{"$f":"'Hidden Summary'!X170","v":0},null,{"$f":"'Hidden Summary'!J170","v":0},{"$f":"'Hidden Summary'!L170","v":0},{"$f":"'Hidden Summary'!N170","v":0},{"$f":"'Hidden Summary'!AA170","v":0},{"$f":"'Hidden Summary'!P170","v":0},null,{"$f":"'Hidden Summary'!W170","v":0},{"$f":"'Hidden Summary'!Y170","v":0},{"$f":"'Hidden Summary'!R170","v":0},{"$f":"'Hidden Summary'!V170","v":0},{"$f":"'Hidden Summary'!T170","v":0},null,{"$error":"#DIV/0!"},{"$error":"#DIV/0!"},{"$error":"#DIV/0!"},0,0,0,{"$f":"'Hidden Summary'!AB170","v":0}]
[{"$f":"'Hidden Summary'!A171","v":0},null,{"$f":"'Hidden Summary'!D171","v":0},null,{"$f":"IF('Hidden Summary'!G171=\"Rational Method\",\"Rational\",IF('Hidden Summary'!G171=\"TR-55 Method\",\"TR-55\",IF('Hidden Summary'!G171=\"USGS-5030 Method\",\"USGS-5030\",IF('Hidden Summary'!G171=\"USGS-5158 Method\",\"USGS-5158\",IF('Hidden Summary'!G171=\"User Input Method\",\"User Input\",\"\")))))","v":""},null,{"$f":"'Hidden Summary'!I171","v":0},{"$f":"'Hidden Summary'!K171","v":0},{"$f":"'Hidden Summary'!M171","v":0},{"$f":"'Hidden Summary'!Z171","v":0},{"$f":"'Hidden Summary'!O171","v":0},null,{"$f":"'Hidden Summary'!Q171","v":0},{"$f":"'Hidden Summary'!U171","v":0},{"$f":"'Hidden Summary'!S171","v":0},{"$f":"'Hidden Summary'!X171","v":0},null,{"$f":"'Hidden Summary'!J171","v":0},{"$f":"'Hidden Summary'!L171","v":0},{"$f":"'Hidden Summary'!N171","v":0},{"$f":"'Hidden Summary'!AA171","v":0},{"$f":"'Hidden Summary'!P171","v":0},null,{"$f":"'Hidden Summary'!W171","v":0},{"$f":"'Hidden Summary'!Y171","v":0},{"$f":"'Hidden Summary'!R171","v":0},{"$f":"'Hidden Summary'!V171","v":0},{"$f":"'Hidden Summary'!T171","v":0},null,{"$error":"#DIV/0!"},{"$error":"#DIV/0!"},{"$error":"#DIV/0!"},0,0,0,{"$f":"'Hidden Summary'!AB171","v":0}]
[{"$f":"'Hidden Summary'!A172","v":0},null,{"$f":"'Hidden Summary'!D172","v":0},null,{"$f":"IF('Hidden Summary'!G172=\"Rational Method\",\"Rational\",IF('Hidden Summary'!G172=\"TR-55 Method\",\"TR-55\",IF('Hidden Summary'!G172=\"USGS-5030 Method\",\"USGS-5030\",IF('Hidden Summary'!G172=\"USGS-5158 Method\",\"USGS-5158\",IF('Hidden Summary'!G172=\"User Input Method\",\"User Input\",\"\")))))","v":""},null,{"$f":"'Hidden Summary'!I172","v":0},{"$f":"'Hidden Summary'!K172","v":0},{"$f":"'Hidden Summary'!M172","v":0},{"$f":"'Hidden Summary'!Z172","v":0},{"$f":"'Hidden Summary'!O172","v":0},null,{"$f":"'Hidden Summary'!Q172","v":0},{"$f":"'Hidden Summary'!U172","v":0},{"$f":"'Hidden Summary'!S172","v":0},{"$f":"'Hidden Summary'!X172","v":0},null,{"$f":"'Hidden Summary'!J172","v":0},{"$f":"'Hidden Summary'!L172","v":0},{"$f":"'Hidden Summary'!N172","v":0},{"$f":"'Hidden Summary'!AA172","v":0},{"$f":"'Hidden Summary'!P172","v":0},null,{"$f":"'Hidden Summary'!W172","v":0},{"$f":"'Hidden Summary'!Y172","v":0},{"$f":"'Hidden Summary'!R172","v":0},{"$f":"'Hidden Summary'!V172","v":0},{"$f":"'Hidden Summary'!T172","v":0},null,{"$error":"#DIV/0!"},{"$error":"#DIV/0!"},{"$error":"#DIV/0!"},0,0,0,{"$f":"'Hidden Summary'!AB172","v":0}]
[{"$f":"'Hidden Summary'!A173","v":0},null,{"$f":"'Hidden Summary'!D173","v":0},null,{"$f":"IF('Hidden Summary'!G173=\"Rational Method\",\"Rational\",IF('Hidden Summary'!G173=\"TR-55 Method\",\"TR-55\",IF('Hidden Summary'!G173=\"USGS-5030 Method\",\"USGS-5030\",IF('Hidden Summary'!G173=\"USGS-5158 Method\",\"USGS-5158\",IF('Hidden Summary'!G173=\"User Input Method\",\"User Input\",\"\")))))","v":""},null,{"$f":"'Hidden Summary'!I173","v":0},{"$f":"'Hidden Summary'!K173","v":0},{"$f":"'Hidden Summary'!M173","v":0},{"$f":"'Hidden Summary'!Z173","v":0},{"$f":"'Hidden Summary'!O173","v":0},null,{"$f":"'Hidden Summary'!Q173","v":0},{"$f":"'Hidden Summary'!U173","v":0},{"$f":"'Hidden Summary'!S173","v":0},{"$f":"'Hidden Summary'!X173","v":0},null,{"$f":"'Hidden Summary'!J173","v":0},{"$f":"'Hidden Summary'!L173","v":0},{"$f":"'Hidden Summary'!N173","v":0},{"$f":"'Hidden Summary'!AA173","v":0},{"$f":"'Hidden Summary'!P173","v":0},null,{"$f":"'Hidden Summary'!W173","v":0},{"$f":"'Hidden Summary'!Y173","v":0},{"$f":"'Hidden Summary'!R173","v":0},{"$f":"'Hidden Summary'!V173","v":0},{"$f":"'Hidden Summary'!T173","v":0},null,{"$error":"#DIV/0!"},{"$error":"#DIV/0!"},{"$error":"#DIV/0!"},0,0,0,{"$f":"'Hidden Summary'!AB173","v":0}]
[{"$f":"'Hidden Summary'!A174","v":0},null,{"$f":"'Hidden Summary'!D174","v":0},null,{"$f":"IF('Hidden Summary'!G174=\"Rational Method\",\"Rational\",IF('Hidden Summary'!G174=\"TR-55 Method\",\"TR-55\",IF('Hidden Summary'!G174=\"USGS-5030 Method\",\"USGS-5030\",IF('Hidden Summary'!G174=\"USGS-5158 Method\",\"USGS-5158\",IF('Hidden Summary'!G174=\"User Input Method\",\"User Input\",\"\")))))","v":""},null,{"$f":"'Hidden Summary'!I174","v":0},{"$f":"'Hidden Summary'!K174","v":0},{"$f":"'Hidden Summary'!M174","v":0},{"$f":"'Hidden Summary'!Z174","v":0},{"$f":"'Hidden Summary'!O174","v":0},null,{"$f":"'Hidden Summary'!Q174","v":0},{"$f":"'Hidden Summary'!U174","v":0},{"$f":"'Hidden Summary'!S174","v":0},{"$f":"'Hidden Summary'!X174","v":0},null,{"$f":"'Hidden Summary'!J174","v":0},{"$f":"'Hidden Summary'!L174","v":0},{"$f":"'Hidden Summary'!N174","v":0},{"$f":"'Hidden Summary'!AA174","v":0},{"$f":"'Hidden Summary'!P174","v":0},null,{"$f":"'Hidden Summary'!W174","v":0},{"$f":"'Hidden Summary'!Y174","v":0},{"$f":"'Hidden Summary'!R174","v":0},{"$f":"'Hidden Summary'!V174","v":0},{"$f":"'Hidden Summary'!T174","v":0},null,{"$error":"#DIV/0!"},{"$error":"#DIV/0!"},{"$error":"#DIV/0!"},0,0,0,{"$f":"'Hidden Summary'!AB174","v":0}]
[{"$f":"'Hidden Summary'!A175","v":0},null,{"$f":"'Hidden Summary'!D175","v":0},null,{"$f":"IF('Hidden Summary'!G175=\"Rational Method\",\"Rational\",IF('Hidden Summary'!G175=\"TR-55 Method\",\"TR-55\",IF('Hidden Summary'!G175=\"USGS-5030 Method\",\"USGS-5030\",IF('Hidden Summary'!G175=\"USGS-5158 Method\",\"USGS-5158\",IF('Hidden Summary'!G175=\"User Input Method\",\"User Input\",\"\")))))","v":""},null,{"$f":"'Hidden Summary'!I175","v":0},{"$f":"'Hidden Summary'!K175","v":0},{"$f":"'Hidden Summary'!M175","v":0},{"$f":"'Hidden Summary'!Z175","v":0},{"$f":"'Hidden Summary'!O175","v":0},null,{"$f":"'Hidden Summary'!Q175","v":0},{"$f":"'Hidden Summary'!U175","v":0},{"$f":"'Hidden Summary'!S175","v":0},{"$f":"'Hidden Summary'!X175","v":0},null,{"$f":"'Hidden Summary'!J175","v":0},{"$f":"'Hidden Summary'!L175","v":0},{"$f":"'Hidden Summary'!N175","v":0},{"$f":"'Hidden Summary'!AA175","v":0},{"$f":"'Hidden Summary'!P175","v":0},null,{"$f":"'Hidden Summary'!W175","v":0},{"$f":"'Hidden Summary'!Y175","v":0},{"$f":"'Hidden Summary'!R175","v":0},{"$f":"'Hidden Summary'!V175","v":0},{"$f":"'Hidden Summary'!T175","v":0},null,{"$error":"#DIV/0!"},{"$error":"#DIV/0!"},{"$error":"#DIV/0!"},0,0,0,{"$f":"'Hidden Summary'!AB175","v":0}]
[{"$f":"'Hidden Summary'!A176","v":0},null,{"$f":"'Hidden Summary'!D176","v":0},null,{"$f":"IF('Hidden Summary'!G176=\"Rational Method\",\"Rational\",IF('Hidden Summary'!G176=\"TR-55 Method\",\"TR-55\",IF('Hidden Summary'!G176=\"USGS-5030 Method\",\"USGS-5030\",IF('Hidden Summary'!G176=\"USGS-5158 Method\",\"USGS-5158\",IF('Hidden Summary'!G176=\"User Input Method\",\"User Input\",\"\")))))","v":""},null,{"$f":"'Hidden Summary'!I176","v":0},{"$f":"'Hidden Summary'!K176","v":0},{"$f":"'Hidden Summary'!M176","v":0},{"$f":"'Hidden Summary'!Z176","v":0},{"$f":"'Hidden Summary'!O176","v":0},null,{"$f":"'Hidden Summary'!Q176","v":0},{"$f":"'Hidden Summary'!U176","v":0},{"$f":"'Hidden Summary'!S176","v":0},{"$f":"'Hidden Summary'!X176","v":0},null,{"$f":"'Hidden Summary'!J176","v":0},{"$f":"'Hidden Summary'!L176","v":0},{"$f":"'Hidden Summary'!N176","v":0},{"$f":"'Hidden Summary'!AA176","v":0},{"$f":"'Hidden Summary'!P176","v":0},null,{"$f":"'Hidden Summary'!W176","v":0},{"$f":"'Hidden Summary'!Y176","v":0},{"$f":"'Hidden Summary'!R176","v":0},{"$f":"'Hidden Summary'!V176","v":0},{"$f":"'Hidden Summary'!T176","v":0},null,{"$error":"#DIV/0!"},{"$error":"#DIV/0!"},{"$error":"#DIV/0!"},0,0,0,{"$f":"'Hidden Summary'!AB176","v":0}]
[{"$f":"'Hidden Summary'!A177","v":0},null,{"$f":"'Hidden Summary'!D177","v":0},null,{"$f":"IF('Hidden Summary'!G177=\"Rational Method\",\"Rational\",IF('Hidden Summary'!G177=\"TR-55 Method\",\"TR-55\",IF('Hidden Summary'!G177=\"USGS-5030 Method\",\"USGS-5030\",IF('Hidden Summary'!G177=\"USGS-5158 Method\",\"USGS-5158\",IF('Hidden Summary'!G177=\"User Input Method\",\"User Input\",\"\")))))","v":""},null,{"$f":"'Hidden Summary'!I177","v":0},{"$f":"'Hidden Summary'!K177","v":0},{"$f":"'Hidden Summary'!M177","v":0},{"$f":"'Hidden Summary'!Z177","v":0},{"$f":"'Hidden Summary'!O177","v":0},null,{"$f":"'Hidden Summary'!Q177","v":0},{"$f":"'Hidden Summary'!U177","v":0},{"$f":"'Hidden Summary'!S177","v":0},{"$f":"'Hidden Summary'!X177","v":0},null,{"$f":"'Hidden Summary'!J177","v":0},{"$f":"'Hidden Summary'!L177","v":0},{"$f":"'Hidden Summary'!N177","v":0},{"$f":"'Hidden Summary'!AA177","v":0},{"$f":"'Hidden Summary'!P177","v":0},null,{"$f":"'Hidden Summary'!W177","v":0},{"$f":"'Hidden Summary'!Y177","v":0},{"$f":"'Hidden Summary'!R177","v":0},{"$f":"'Hidden Summary'!V177","v":0},{"$f":"'Hidden Summary'!T177","v":0},null,{"$error":"#DIV/0!"},{"$error":"#DIV/0!"},{"$error":"#DIV/0!"},0,0,0,{"$f":"'Hidden Summary'!AB177","v":0}]
[{"$f":"'Hidden Summary'!A178","v":0},null,{"$f":"'Hidden Summary'!D178","v":0},null,{"$f":"IF('Hidden Summary'!G178=\"Rational Method\",\"Rational\",IF('Hidden Summary'!G178=\"TR-55 Method\",\"TR-55\",IF('Hidden Summary'!G178=\"USGS-5030 Method\",\"USGS-5030\",IF('Hidden Summary'!G178=\"USGS-5158 Method\",\"USGS-5158\",IF('Hidden Summary'!G178=\"User Input Method\",\"User Input\",\"\")))))","v":""},null,{"$f":"'Hidden Summary'!I178","v":0},{"$f":"'Hidden Summary'!K178","v":0},{"$f":"'Hidden Summary'!M178","v":0},{"$f":"'Hidden Summary'!Z178","v":0},{"$f":"'Hidden Summary'!O178","v":0},null,{"$f":"'Hidden Summary'!Q178","v":0},{"$f":"'Hidden Summary'!U178","v":0},{"$f":"'Hidden Summary'!S178","v":0},{"$f":"'Hidden Summary'!X178","v":0},null,{"$f":"'Hidden Summary'!J178","v":0},{"$f":"'Hidden Summary'!L178","v":0},{"$f":"'Hidden Summary'!N178","v":0},{"$f":"'Hidden Summary'!AA178","v":0},{"$f":"'Hidden Summary'!P178","v":0},null,{"$f":"'Hidden Summary'!W178","v":0},{"$f":"'Hidden Summary'!Y178","v":0},{"$f":"'Hidden Summary'!R178","v":0},{"$f":"'Hidden Summary'!V178","v":0},{"$f":"'Hidden Summary'!T178","v":0},null,{"$error":"#DIV/0!"},{"$error":"#DIV/0!"},{"$error":"#DIV/0!"},0,0,0,{"$f":"'Hidden Summary'!AB178","v":0}]
[{"$f":"'Hidden Summary'!A179","v":0},null,{"$f":"'Hidden Summary'!D179","v":0},null,{"$f":"IF('Hidden Summary'!G179=\"Rational Method\",\"Rational\",IF('Hidden Summary'!G179=\"TR-55 Method\",\"TR-55\",IF('Hidden Summary'!G179=\"USGS-5030 Method\",\"USGS-5030\",IF('Hidden Summary'!G179=\"USGS-5158 Method\",\"USGS-5158\",IF('Hidden Summary'!G179=\"User Input Method\",\"User Input\",\"\")))))","v":""},null,{"$f":"'Hidden Summary'!I179","v":0},{"$f":"'Hidden Summary'!K179","v":0},{"$f":"'Hidden Summary'!M179","v":0},{"$f":"'Hidden Summary'!Z179","v":0},{"$f":"'Hidden Summary'!O179","v":0},null,{"$f":"'Hidden Summary'!Q179","v":0},{"$f":"'Hidden Summary'!U179","v":0},{"$f":"'Hidden Summary'!S179","v":0},{"$f":"'Hidden Summary'!X179","v":0},null,{"$f":"'Hidden Summary'!J179","v":0},{"$f":"'Hidden Summary'!L179","v":0},{"$f":"'Hidden Summary'!N179","v":0},{"$f":"'Hidden Summary'!AA179","v":0},{"$f":"'Hidden Summary'!P179","v":0},null,{"$f":"'Hidden Summary'!W179","v":0},{"$f":"'Hidden Summary'!Y179","v":0},{"$f":"'Hidden Summary'!R179","v":0},{"$f":"'Hidden Summary'!V179","v":0},{"$f":"'Hidden Summary'!T179","v":0},null,{"$error":"#DIV/0!"},{"$error":"#DIV/0!"},{"$error":"#DIV/0!"},0,0,0,{"$f":"'Hidden Summary'!AB179","v":0}]
[{"$f":"'Hidden Summary'!A180","v":0},null,{"$f":"'Hidden Summary'!D180","v":0},null,{"$f":"IF('Hidden Summary'!G180=\"Rational Method\",\"Rational\",IF('Hidden Summary'!G180=\"TR-55 Method\",\"TR-55\",IF('Hidden Summary'!G180=\"USGS-5030 Method\",\"USGS-5030\",IF('Hidden Summary'!G180=\"USGS-5158 Method\",\"USGS-5158\",IF('Hidden Summary'!G180=\"User Input Method\",\"User Input\",\"\")))))","v":""},null,{"$f":"'Hidden Summary'!I180","v":0},{"$f":"'Hidden Summary'!K180","v":0},{"$f":"'Hidden Summary'!M180","v":0},{"$f":"'Hidden Summary'!Z180","v":0},{"$f":"'Hidden Summary'!O180","v":0},null,{"$f":"'Hidden Summary'!Q180","v":0},{"$f":"'Hidden Summary'!U180","v":0},{"$f":"'Hidden Summary'!S180","v":0},{"$f":"'Hidden Summary'!X180","v":0},null,{"$f":"'Hidden Summary'!J180","v":0},{"$f":"'Hidden Summary'!L180","v":0},{"$f":"'Hidden Summary'!N180","v":0},{"$f":"'Hidden Summary'!AA180","v":0},{"$f":"'Hidden Summary'!P180","v":0},null,{"$f":"'Hidden Summary'!W180","v":0},{"$f":"'Hidden Summary'!Y180","v":0},{"$f":"'Hidden Summary'!R180","v":0},{"$f":"'Hidden Summary'!V180","v":0},{"$f":"'Hidden Summary'!T180","v":0},null,{"$error":"#DIV/0!"},{"$error":"#DIV/0!"},{"$error":"#DIV/0!"},0,0,0,{"$f":"'Hidden Summary'!AB180","v":0}]
[{"$f":"'Hidden Summary'!A181","v":0},null,{"$f":"'Hidden Summary'!D181","v":0},null,{"$f":"IF('Hidden Summary'!G181=\"Rational Method\",\"Rational\",IF('Hidden Summary'!G181=\"TR-55 Method\",\"TR-55\",IF('Hidden Summary'!G181=\"USGS-5030 Method\",\"USGS-5030\",IF('Hidden Summary'!G181=\"USGS-5158 Method\",\"USGS-5158\",IF('Hidden Summary'!G181=\"User Input Method\",\"User Input\",\"\")))))","v":""},null,{"$f":"'Hidden Summary'!I181","v":0},{"$f":"'Hidden Summary'!K181","v":0},{"$f":"'Hidden Summary'!M181","v":0},{"$f":"'Hidden Summary'!Z181","v":0},{"$f":"'Hidden Summary'!O181","v":0},null,{"$f":"'Hidden Summary'!Q181","v":0},{"$f":"'Hidden Summary'!U181","v":0},{"$f":"'Hidden Summary'!S181","v":0},{"$f":"'Hidden Summary'!X181","v":0},null,{"$f":"'Hidden Summary'!J181","v":0},{"$f":"'Hidden Summary'!L181","v":0},{"$f":"'Hidden Summary'!N181","v":0},{"$f":"'Hidden Summary'!AA181","v":0},{"$f":"'Hidden Summary'!P181","v":0},null,{"$f":"'Hidden Summary'!W181","v":0},{"$f":"'Hidden Summary'!Y181","v":0},{"$f":"'Hidden Summary'!R181","v":0},{"$f":"'Hidden Summary'!V181","v":0},{"$f":"'Hidden Summary'!T181","v":0},null,{"$error":"#DIV/0!"},{"$error":"#DIV/0!"},{"$error":"#DIV/0!"},0,0,0,{"$f":"'Hidden Summary'!AB181","v":0}]
[{"$f":"'Hidden Summary'!A182","v":0},null,{"$f":"'Hidden Summary'!D182","v":0},null,{"$f":"IF('Hidden Summary'!G182=\"Rational Method\",\"Rational\",IF('Hidden Summary'!G182=\"TR-55 Method\",\"TR-55\",IF('Hidden Summary'!G182=\"USGS-5030 Method\",\"USGS-5030\",IF('Hidden Summary'!G182=\"USGS-5158 Method\",\"USGS-5158\",IF('Hidden Summary'!G182=\"User Input Method\",\"User Input\",\"\")))))","v":""},null,{"$f":"'Hidden Summary'!I182","v":0},{"$f":"'Hidden Summary'!K182","v":0},{"$f":"'Hidden Summary'!M182","v":0},{"$f":"'Hidden Summary'!Z182","v":0},{"$f":"'Hidden Summary'!O182","v":0},null,{"$f":"'Hidden Summary'!Q182","v":0},{"$f":"'Hidden Summary'!U182","v":0},{"$f":"'Hidden Summary'!S182","v":0},{"$f":"'Hidden Summary'!X182","v":0},null,{"$f":"'Hidden Summary'!J182","v":0},{"$f":"'Hidden Summary'!L182","v":0},{"$f":"'Hidden Summary'!N182","v":0},{"$f":"'Hidden Summary'!AA182","v":0},{"$f":"'Hidden Summary'!P182","v":0},null,{"$f":"'Hidden Summary'!W182","v":0},{"$f":"'Hidden Summary'!Y182","v":0},{"$f":"'Hidden Summary'!R182","v":0},{"$f":"'Hidden Summary'!V182","v":0},{"$f":"'Hidden Summary'!T182","v":0},null,{"$error":"#DIV/0!"},{"$error":"#DIV/0!"},{"$error":"#DIV/0!"},0,0,0,{"$f":"'Hidden Summary'!AB182","v":0}]
[{"$f":"'Hidden Summary'!A183","v":0},null,{"$f":"'Hidden Summary'!D183","v":0},null,{"$f":"IF('Hidden Summary'!G183=\"Rational Method\",\"Rational\",IF('Hidden Summary'!G183=\"TR-55 Method\",\"TR-55\",IF('Hidden Summary'!G183=\"USGS-5030 Method\",\"USGS-5030\",IF('Hidden Summary'!G183=\"USGS-5158 Method\",\"USGS-5158\",IF('Hidden Summary'!G183=\"User Input Method\",\"User Input\",\"\")))))","v":""},null,{"$f":"'Hidden Summary'!I183","v":0},{"$f":"'Hidden Summary'!K183","v":0},{"$f":"'Hidden Summary'!M183","v":0},{"$f":"'Hidden Summary'!Z183","v":0},{"$f":"'Hidden Summary'!O183","v":0},null,{"$f":"'Hidden Summary'!Q183","v":0},{"$f":"'Hidden Summary'!U183","v":0},{"$f":"'Hidden Summary'!S183","v":0},{"$f":"'Hidden Summary'!X183","v":0},null,{"$f":"'Hidden Summary'!J183","v":0},{"$f":"'Hidden Summary'!L183","v":0},{"$f":"'Hidden Summary'!N183","v":0},{"$f":"'Hidden Summary'!AA183","v":0},{"$f":"'Hidden Summary'!P183","v":0},null,{"$f":"'Hidden Summary'!W183","v":0},{"$f":"'Hidden Summary'!Y183","v":0},{"$f":"'Hidden Summary'!R183","v":0},{"$f":"'Hidden Summary'!V183","v":0},{"$f":"'Hidden Summary'!T183","v":0},null,{"$error":"#DIV/0!"},{"$error":"#DIV/0!"},{"$error":"#DIV/0!"},0,0,0,{"$f":"'Hidden Summary'!AB183","v":0}]
[{"$f":"'Hidden Summary'!A184","v":0},null,{"$f":"'Hidden Summary'!D184","v":0},null,{"$f":"IF('Hidden Summary'!G184=\"Rational Method\",\"Rational\",IF('Hidden Summary'!G184=\"TR-55 Method\",\"TR-55\",IF('Hidden Summary'!G184=\"USGS-5030 Method\",\"USGS-5030\",IF('Hidden Summary'!G184=\"USGS-5158 Method\",\"USGS-5158\",IF('Hidden Summary'!G184=\"User Input Method\",\"User Input\",\"\")))))","v":""},null,{"$f":"'Hidden Summary'!I184","v":0},{"$f":"'Hidden Summary'!K184","v":0},{"$f":"'Hidden Summary'!M184","v":0},{"$f":"'Hidden Summary'!Z184","v":0},{"$f":"'Hidden Summary'!O184","v":0},null,{"$f":"'Hidden Summary'!Q184","v":0},{"$f":"'Hidden Summary'!U184","v":0},{"$f":"'Hidden Summary'!S184","v":0},{"$f":"'Hidden Summary'!X184","v":0},null,{"$f":"'Hidden Summary'!J184","v":0},{"$f":"'Hidden Summary'!L184","v":0},{"$f":"'Hidden Summary'!N184","v":0},{"$f":"'Hidden Summary'!AA184","v":0},{"$f":"'Hidden Summary'!P184","v":0},null,{"$f":"'Hidden Summary'!W184","v":0},{"$f":"'Hidden Summary'!Y184","v":0},{"$f":"'Hidden Summary'!R184","v":0},{"$f":"'Hidden Summary'!V184","v":0},{"$f":"'Hidden Summary'!T184","v":0},null,{"$error":"#DIV/0!"},{"$error":"#DIV/0!"},{"$error":"#DIV/0!"},0,0,0,{"$f":"'Hidden Summary'!AB184","v":0}]
[{"$f":"'Hidden Summary'!A185","v":0},null,{"$f":"'Hidden Summary'!D185","v":0},null,{"$f":"IF('Hidden Summary'!G185=\"Rational Method\",\"Rational\",IF('Hidden Summary'!G185=\"TR-55 Method\",\"TR-55\",IF('Hidden Summary'!G185=\"USGS-5030 Method\",\"USGS-5030\",IF('Hidden Summary'!G185=\"USGS-5158 Method\",\"USGS-5158\",IF('Hidden Summary'!G185=\"User Input Method\",\"User Input\",\"\")))))","v":""},null,{"$f":"'Hidden Summary'!I185","v":0},{"$f":"'Hidden Summary'!K185","v":0},{"$f":"'Hidden Summary'!M185","v":0},{"$f":"'Hidden Summary'!Z185","v":0},{"$f":"'Hidden Summary'!O185","v":0},null,{"$f":"'Hidden Summary'!Q185","v":0},{"$f":"'Hidden Summary'!U185","v":0},{"$f":"'Hidden Summary'!S185","v":0},{"$f":"'Hidden Summary'!X185","v":0},null,{"$f":"'Hidden Summary'!J185","v":0},{"$f":"'Hidden Summary'!L185","v":0},{"$f":"'Hidden Summary'!N185","v":0},{"$f":"'Hidden Summary'!AA185","v":0},{"$f":"'Hidden Summary'!P185","v":0},null,{"$f":"'Hidden Summary'!W185","v":0},{"$f":"'Hidden Summary'!Y185","v":0},{"$f":"'Hidden Summary'!R185","v":0},{"$f":"'Hidden Summary'!V185","v":0},{"$f":"'Hidden Summary'!T185","v":0},null,{"$error":"#DIV/0!"},{"$error":"#DIV/0!"},{"$error":"#DIV/0!"},0,0,0,{"$f":"'Hidden Summary'!AB185","v":0}]
[{"$f":"'Hidden Summary'!A186","v":0},null,{"$f":"'Hidden Summary'!D186","v":0},null,{"$f":"IF('Hidden Summary'!G186=\"Rational Method\",\"Rational\",IF('Hidden Summary'!G186=\"TR-55 Method\",\"TR-55\",IF('Hidden Summary'!G186=\"USGS-5030 Method\",\"USGS-5030\",IF('Hidden Summary'!G186=\"USGS-5158 Method\",\"USGS-5158\",IF('Hidden Summary'!G186=\"User Input Method\",\"User Input\",\"\")))))","v":""},null,{"$f":"'Hidden Summary'!I186","v":0},{"$f":"'Hidden Summary'!K186","v":0},{"$f":"'Hidden Summary'!M186","v":0},{"$f":"'Hidden Summary'!Z186","v":0},{"$f":"'Hidden Summary'!O186","v":0},null,{"$f":"'Hidden Summary'!Q186","v":0},{"$f":"'Hidden Summary'!U186","v":0},{"$f":"'Hidden Summary'!S186","v":0},{"$f":"'Hidden Summary'!X186","v":0},null,{"$f":"'Hidden Summary'!J186","v":0},{"$f":"'Hidden Summary'!L186","v":0},{"$f":"'Hidden Summary'!N186","v":0},{"$f":"'Hidden Summary'!AA186","v":0},{"$f":"'Hidden Summary'!P186","v":0},null,{"$f":"'Hidden Summary'!W186","v":0},{"$f":"'Hidden Summary'!Y186","v":0},{"$f":"'Hidden Summary'!R186","v":0},{"$f":"'Hidden Summary'!V186","v":0},{"$f":"'Hidden Summary'!T186","v":0},null,{"$error":"#DIV/0!"},{"$error":"#DIV/0!"},{"$error":"#DIV/0!"},0,0,0,{"$f":"'Hidden Summary'!AB186","v":0}]
[{"$f":"'Hidden Summary'!A187","v":0},null,{"$f":"'Hidden Summary'!D187","v":0},null,{"$f":"IF('Hidden Summary'!G187=\"Rational Method\",\"Rational\",IF('Hidden Summary'!G187=\"TR-55 Method\",\"TR-55\",IF('Hidden Summary'!G187=\"USGS-5030 Method\",\"USGS-5030\",IF('Hidden Summary'!G187=\"USGS-5158 Method\",\"USGS-5158\",IF('Hidden Summary'!G187=\"User Input Method\",\"User Input\",\"\")))))","v":""},null,{"$f":"'Hidden Summary'!I187","v":0},{"$f":"'Hidden Summary'!K187","v":0},{"$f":"'Hidden Summary'!M187","v":0},{"$f":"'Hidden Summary'!Z187","v":0},{"$f":"'Hidden Summary'!O187","v":0},null,{"$f":"'Hidden Summary'!Q187","v":0},{"$f":"'Hidden Summary'!U187","v":0},{"$f":"'Hidden Summary'!S187","v":0},{"$f":"'Hidden Summary'!X187","v":0},null,{"$f":"'Hidden Summary'!J187","v":0},{"$f":"'Hidden Summary'!L187","v":0},{"$f":"'Hidden Summary'!N187","v":0},{"$f":"'Hidden Summary'!AA187","v":0},{"$f":"'Hidden Summary'!P187","v":0},null,{"$f":"'Hidden Summary'!W187","v":0},{"$f":"'Hidden Summary'!Y187","v":0},{"$f":"'Hidden Summary'!R187","v":0},{"$f":"'Hidden Summary'!V187","v":0},{"$f":"'Hidden Summary'!T187","v":0},null,{"$error":"#DIV/0!"},{"$error":"#DIV/0!"},{"$error":"#DIV/0!"},0,0,0,{"$f":"'Hidden Summary'!AB187","v":0}]
[{"$f":"'Hidden Summary'!A188","v":0},null,{"$f":"'Hidden Summary'!D188","v":0},null,{"$f":"IF('Hidden Summary'!G188=\"Rational Method\",\"Rational\",IF('Hidden Summary'!G188=\"TR-55 Method\",\"TR-55\",IF('Hidden Summary'!G188=\"USGS-5030 Method\",\"USGS-5030\",IF('Hidden Summary'!G188=\"USGS-5158 Method\",\"USGS-5158\",IF('Hidden Summary'!G188=\"User Input Method\",\"User Input\",\"\")))))","v":""},null,{"$f":"'Hidden Summary'!I188","v":0},{"$f":"'Hidden Summary'!K188","v":0},{"$f":"'Hidden Summary'!M188","v":0},{"$f":"'Hidden Summary'!Z188","v":0},{"$f":"'Hidden Summary'!O188","v":0},null,{"$f":"'Hidden Summary'!Q188","v":0},{"$f":"'Hidden Summary'!U188","v":0},{"$f":"'Hidden Summary'!S188","v":0},{"$f":"'Hidden Summary'!X188","v":0},null,{"$f":"'Hidden Summary'!J188","v":0},{"$f":"'Hidden Summary'!L188","v":0},{"$f":"'Hidden Summary'!N188","v":0},{"$f":"'Hidden Summary'!AA188","v":0},{"$f":"'Hidden Summary'!P188","v":0},null,{"$f":"'Hidden Summary'!W188","v":0},{"$f":"'Hidden Summary'!Y188","v":0},{"$f":"'Hidden Summary'!R188","v":0},{"$f":"'Hidden Summary'!V188","v":0},{"$f":"'Hidden Summary'!T188","v":0},null,{"$error":"#DIV/0!"},{"$error":"#DIV/0!"},{"$error":"#DIV/0!"},0,0,0,{"$f":"'Hidden Summary'!AB188","v":0}]
[{"$f":"'Hidden Summary'!A189","v":0},null,{"$f":"'Hidden Summary'!D189","v":0},null,{"$f":"IF('Hidden Summary'!G189=\"Rational Method\",\"Rational\",IF('Hidden Summary'!G189=\"TR-55 Method\",\"TR-55\",IF('Hidden Summary'!G189=\"USGS-5030 Method\",\"USGS-5030\",IF('Hidden Summary'!G189=\"USGS-5158 Method\",\"USGS-5158\",IF('Hidden Summary'!G189=\"User Input Method\",\"User Input\",\"\")))))","v":""},null,{"$f":"'Hidden Summary'!I189","v":0},{"$f":"'Hidden Summary'!K189","v":0},{"$f":"'Hidden Summary'!M189","v":0},{"$f":"'Hidden Summary'!Z189","v":0},{"$f":"'Hidden Summary'!O189","v":0},null,{"$f":"'Hidden Summary'!Q189","v":0},{"$f":"'Hidden Summary'!U189","v":0},{"$f":"'Hidden Summary'!S189","v":0},{"$f":"'Hidden Summary'!X189","v":0},null,{"$f":"'Hidden Summary'!J189","v":0},{"$f":"'Hidden Summary'!L189","v":0},{"$f":"'Hidden Summary'!N189","v":0},{"$f":"'Hidden Summary'!AA189","v":0},{"$f":"'Hidden Summary'!P189","v":0},null,{"$f":"'Hidden Summary'!W189","v":0},{"$f":"'Hidden Summary'!Y189","v":0},{"$f":"'Hidden Summary'!R189","v":0},{"$f":"'Hidden Summary'!V189","v":0},{"$f":"'Hidden Summary'!T189","v":0},null,{"$error":"#DIV/0!"},{"$error":"#DIV/0!"},{"$error":"#DIV/0!"},0,0,0,{"$f":"'Hidden Summary'!AB189","v":0}]
[{"$f":"'Hidden Summary'!A190","v":0},null,{"$f":"'Hidden Summary'!D190","v":0},null,{"$f":"IF('Hidden Summary'!G190=\"Rational Method\",\"Rational\",IF('Hidden Summary'!G190=\"TR-55 Method\",\"TR-55\",IF('Hidden Summary'!G190=\"USGS-5030 Method\",\"USGS-5030\",IF('Hidden Summary'!G190=\"USGS-5158 Method\",\"USGS-5158\",IF('Hidden Summary'!G190=\"User Input Method\",\"User Input\",\"\")))))","v":""},null,{"$f":"'Hidden Summary'!I190","v":0},{"$f":"'Hidden Summary'!K190","v":0},{"$f":"'Hidden Summary'!M190","v":0},{"$f":"'Hidden Summary'!Z190","v":0},{"$f":"'Hidden Summary'!O190","v":0},null,{"$f":"'Hidden Summary'!Q190","v":0},{"$f":"'Hidden Summary'!U190","v":0},{"$f":"'Hidden Summary'!S190","v":0},{"$f":"'Hidden Summary'!X190","v":0},null,{"$f":"'Hidden Summary'!J190","v":0},{"$f":"'Hidden Summary'!L190","v":0},{"$f":"'Hidden Summary'!N190","v":0},{"$f":"'Hidden Summary'!AA190","v":0},{"$f":"'Hidden Summary'!P190","v":0},null,{"$f":"'Hidden Summary'!W190","v":0},{"$f":"'Hidden Summary'!Y190","v":0},{"$f":"'Hidden Summary'!R190","v":0},{"$f":"'Hidden Summary'!V190","v":0},{"$f":"'Hidden Summary'!T190","v":0},null,{"$error":"#DIV/0!"},{"$error":"#DIV/0!"},{"$error":"#DIV/0!"},0,0,0,{"$f":"'Hidden Summary'!AB190","v":0}]
[{"$f":"'Hidden Summary'!A191","v":0},null,{"$f":"'Hidden Summary'!D191","v":0},null,{"$f":"IF('Hidden Summary'!G191=\"Rational Method\",\"Rational\",IF('Hidden Summary'!G191=\"TR-55 Method\",\"TR-55\",IF('Hidden Summary'!G191=\"USGS-5030 Method\",\"USGS-5030\",IF('Hidden Summary'!G191=\"USGS-5158 Method\",\"USGS-5158\",IF('Hidden Summary'!G191=\"User Input Method\",\"User Input\",\"\")))))","v":""},null,{"$f":"'Hidden Summary'!I191","v":0},{"$f":"'Hidden Summary'!K191","v":0},{"$f":"'Hidden Summary'!M191","v":0},{"$f":"'Hidden Summary'!Z191","v":0},{"$f":"'Hidden Summary'!O191","v":0},null,{"$f":"'Hidden Summary'!Q191","v":0},{"$f":"'Hidden Summary'!U191","v":0},{"$f":"'Hidden Summary'!S191","v":0},{"$f":"'Hidden Summary'!X191","v":0},null,{"$f":"'Hidden Summary'!J191","v":0},{"$f":"'Hidden Summary'!L191","v":0},{"$f":"'Hidden Summary'!N191","v":0},{"$f":"'Hidden Summary'!AA191","v":0},{"$f":"'Hidden Summary'!P191","v":0},null,{"$f":"'Hidden Summary'!W191","v":0},{"$f":"'Hidden Summary'!Y191","v":0},{"$f":"'Hidden Summary'!R191","v":0},{"$f":"'Hidden Summary'!V191","v":0},{"$f":"'Hidden Summary'!T191","v":0},null,{"$error":"#DIV/0!"},{"$error":"#DIV/0!"},{"$error":"#DIV/0!"},0,0,0,{"$f":"'Hidden Summary'!AB191","v":0}]
[{"$f":"'Hidden Summary'!A192","v":0},null,{"$f":"'Hidden Summary'!D192","v":0},null,{"$f":"IF('Hidden Summary'!G192=\"Rational Method\",\"Rational\",IF('Hidden Summary'!G192=\"TR-55 Method\",\"TR-55\",IF('Hidden Summary'!G192=\"USGS-5030 Method\",\"USGS-5030\",IF('Hidden Summary'!G192=\"USGS-5158 Method\",\"USGS-5158\",IF('Hidden Summary'!G192=\"User Input Method\",\"User Input\",\"\")))))","v":""},null,{"$f":"'Hidden Summary'!I192","v":0},{"$f":"'Hidden Summary'!K192","v":0},{"$f":"'Hidden Summary'!M192","v":0},{"$f":"'Hidden Summary'!Z192","v":0},{"$f":"'Hidden Summary'!O192","v":0},null,{"$f":"'Hidden Summary'!Q192","v":0},{"$f":"'Hidden Summary'!U192","v":0},{"$f":"'Hidden Summary'!S192","v":0},{"$f":"'Hidden Summary'!X192","v":0},null,{"$f":"'Hidden Summary'!J192","v":0},{"$f":"'Hidden Summary'!L192","v":0},{"$f":"'Hidden Summary'!N192","v":0},{"$f":"'Hidden Summary'!AA192","v":0},{"$f":"'Hidden Summary'!P192","v":0},null,{"$f":"'Hidden Summary'!W192","v":0},{"$f":"'Hidden Summary'!Y192","v":0},{"$f":"'Hidden Summary'!R192","v":0},{"$f":"'Hidden Summary'!V192","v":0},{"$f":"'Hidden Summary'!T192","v":0},null,{"$error":"#DIV/0!"},{"$error":"#DIV/0!"},{"$error":"#DIV/0!"},0,0,0,{"$f":"'Hidden Summary'!AB192","v":0}]
[{"$f":"'Hidden Summary'!A193","v":0},null,{"$f":"'Hidden Summary'!D193","v":0},null,{"$f":"IF('Hidden Summary'!G193=\"Rational Method\",\"Rational\",IF('Hidden Summary'!G193=\"TR-55 Method\",\"TR-55\",IF('Hidden Summary'!G193=\"USGS-5030 Method\",\"USGS-5030\",IF('Hidden Summary'!G193=\"USGS-5158 Method\",\"USGS-5158\",IF('Hidden Summary'!G193=\"User Input Method\",\"User Input\",\"\")))))","v":""},null,{"$f":"'Hidden Summary'!I193","v":0},{"$f":"'Hidden Summary'!K193","v":0},{"$f":"'Hidden Summary'!M193","v":0},{"$f":"'Hidden Summary'!Z193","v":0},{"$f":"'Hidden Summary'!O193","v":0},null,{"$f":"'Hidden Summary'!Q193","v":0},{"$f":"'Hidden Summary'!U193","v":0},{"$f":"'Hidden Summary'!S193","v":0},{"$f":"'Hidden Summary'!X193","v":0},null,{"$f":"'Hidden Summary'!J193","v":0},{"$f":"'Hidden Summary'!L193","v":0},{"$f":"'Hidden Summary'!N193","v":0},{"$f":"'Hidden Summary'!AA193","v":0},{"$f":"'Hidden Summary'!P193","v":0},null,{"$f":"'Hidden Summary'!W193","v":0},{"$f":"'Hidden Summary'!Y193","v":0},{"$f":"'Hidden Summary'!R193","v":0},{"$f":"'Hidden Summary'!V193","v":0},{"$f":"'Hidden Summary'!T193","v":0},null,{"$error":"#DIV/0!"},{"$error":"#DIV/0!"},{"$error":"#DIV/0!"},0,0,0,{"$f":"'Hidden Summary'!AB193","v":0}]

{"sheet":"RATIONAL TAB TEMPLATE","index":3,"n_rows":328,"n_cols":117,"rows_kept":328,"cut":false,"hidden":true,"merged":[[322,1,322,4],[164,0,164,16],[165,0,180,7],[165,8,180,16],[181,0,197,7],[181,8,197,16],[198,0,198,16],[199,0,214,7],[199,8,214,16],[215,0,231,7],[215,8,231,16],[311,13,313,14],[285,0,286,5],[285,8,286,15],[301,14,303,15],[278,0,280,24],[282,10,282,12],[283,10,283,12],[284,10,284,12],[301,19,305,24],[304,0,305,5],[304,8,305,15],[294,8,296,15],[294,0,296,5],[320,1,320,4],[51,19,53,20],[40,18,41,23],[59,29,68,30],[58,29,58,30],[58,31,60,32],[61,31,68,32],[198,108,198,124],[199,108,214,115],[199,116,214,124],[215,108,231,115],[215,116,231,124],[97,108,112,115],[97,116,112,124],[113,108,129,115],[113,116,129,124],[131,108,146,115],[147,116,163,124],[104,34,105,34],[97,0,112,7],[131,72,146,79],[97,8,112,16],[113,0,129,7],[113,8,129,16],[16,18,29,23],[33,27,33,28],[28,3,30,4],[29,5,29,6],[28,7,30,7],[33,10,33,15],[36,27,36,28],[50,0,50,16],[130,108,130,124],[95,54,95,70],[95,72,95,88],[95,90,95,106],[130,72,130,88],[97,90,112,97],[97,98,112,106],[40,8,41,14],[38,8,38,15],[96,108,96,124],[96,90,96,106],[113,90,129,97],[113,98,129,106],[130,90,130,106],[96,54,96,70],[96,72,96,88],[165,116,180,124],[181,108,197,115],[181,116,197,124],[131,90,146,97],[131,98,146,106],[147,90,163,97],[147,98,163,106],[164,90,164,106],[165,90,180,97],[165,98,180,106],[165,108,180,115],[181,90,197,97],[181,98,197,106],[164,108,164,124],[131,116,146,124],[147,108,163,115],[7,40,8,40],[5,38,6,48],[7,38,8,38],[7,39,8,39],[131,80,146,88],[147,72,163,79],[147,80,163,88],[147,0,163,7],[147,8,163,16],[58,20,59,20],[96,0,96,16],[51,0,70,16],[73,0,95,7],[73,8,95,16],[71,0,72,16],[97,72,112,79],[97,80,112,88],[113,72,129,79],[113,80,129,88],[104,38,105,38],[97,54,112,61],[97,62,112,70],[113,54,129,61],[113,62,129,70],[5,26,6,36],[7,26,8,26],[7,27,8,27],[7,28,8,28],[7,29,8,29],[7,30,8,30],[7,31,8,31],[7,32,8,32],[7,33,8,33],[7,34,8,34],[7,35,8,35],[7,36,8,36],[95,108,95,124],[0,100,3,125],[1,11,1,16],[0,11,0,16],[0,25,3,51],[7,46,8,46],[7,47,8,47],[7,48,8,48],[7,41,8,41],[7,42,8,42],[7,43,8,43],[7,44,8,44],[7,45,8,45],[2,11,2,16],[5,11,5,13],[7,7,7,11],[7,13,7,15],[5,14,5,15],[1,7,1,8],[58,18,59,19],[15,18,15,23],[0,52,3,75],[0,76,3,99],[3,11,3,16],[238,0,238,1],[238,2,238,4],[238,5,238,7],[238,8,238,10],[238,11,238,13],[238,14,238,16],[239,11,244,13],[245,11,250,13],[5,1,5,3],[45,8,47,15],[130,0,130,16],[21,0,22,0],[21,1,22,1],[21,7,22,7],[21,8,22,8],[33,1,33,4],[33,7,33,9],[40,0,41,5],[38,0,38,5],[35,7,35,9],[35,10,35,15],[234,0,234,16],[236,0,236,7],[236,8,236,16],[45,0,47,5],[2,5,2,9],[3,5,3,9],[7,0,7,5],[28,0,29,0],[5,4,5,5],[131,0,146,7],[131,8,146,16],[35,3,36,5],[2,1,4,4],[257,5,259,7],[260,5,262,7],[263,5,265,7],[257,0,259,1],[260,0,262,1],[263,0,265,1],[239,0,241,1],[242,0,244,1],[239,5,241,7],[242,5,244,7],[245,5,247,7],[248,5,250,7],[251,5,253,7],[254,5,256,7],[239,2,244,4],[245,2,250,4],[251,2,256,4],[266,0,268,1],[269,0,271,1],[257,14,259,16],[260,14,262,16],[263,14,265,16],[266,14,268,16],[269,14,271,16],[257,11,262,13],[263,11,268,13],[269,11,274,13],[266,5,268,7],[269,5,271,7],[257,2,262,4],[263,2,268,4],[269,2,274,4],[272,5,274,7],[266,8,268,10],[269,8,271,10],[272,8,274,10],[272,14,274,16],[272,0,274,1],[257,8,259,10],[260,8,262,10],[263,8,265,10],[251,11,256,13],[245,0,247,1],[248,0,250,1],[251,0,253,1],[254,0,256,1],[239,14,241,16],[242,14,244,16],[245,14,247,16],[248,14,250,16],[251,14,253,16],[239,8,241,10],[242,8,244,10],[245,8,247,10],[254,14,256,16],[248,8,250,10],[251,8,253,10],[254,8,256,10]]}
["TIP Project:",{"$f":"TIP_number_MAIN_tab","v":0},null,null,null,null,null,null,null,null,"Date:",{"$f":"Date_MAIN_tab","v":"00:00:00"},null,null,null,null,null,null,null,null,null,null,null,null,null,"COLUMNS HOLDING CELLS BELOW TO BE HIDDEN (CELLS HOLD BACKGROUND DATA FOR MACROS AND CALCULATIONS)",null,null,null,null,null,null,null,null,null,null,null,null,null,null,null,null,null,null,null,null,null,null,null,null,null,null,"COLUMNS HOLDING CELLS BELOW TO BE HIDDEN (CELLS HOLD BACKGROUND DATA FOR MACROS AND CALCULATIONS)",null,null,null,null,null,null,null,null,null,null,null,null,null,null,null,null,null,null,null,null,null,null,null,"COLUMNS HOLDING CELLS BELOW TO BE HIDDEN (CELLS HOLD BACKGROUND DATA FOR MACROS AND CALCULATIONS)",null,null,null,null,null,null,null,null,null,null,null,null,null,null,null,null,null,null,null,null,null,null,null,"COLUMNS HOLDING CELLS BELOW TO BE HIDDEN (CELLS HOLD BACKGROUND DATA FOR MACROS AND CALCULATIONS)"]
["County:",null,null,null,null,null,null,"PSH # OUTLET #",null,null,"  Design Firm:",{"$f":"design_firm_MAIN_tab","v":0}]
["Description:",{"$f":"IF(project_description_MAIN_tab=\"\",\"\",project_description_MAIN_tab)","v":""},null,null,null,null,null,null,null,null,"  Designed By:",{"$f":"designer_MAIN_tab","v":0}]
[null,null,null,null,null,"Input Alignment, Station, Offset Here",null,null,null,null,"Reviewed By:"]
[]
[{"$f":"MAIN!A37","v":"Version 1.0"},"Outlet UID Number:",null,null,{"$f":"IF(TIP_number_MAIN_tab=0,\"ENTER TIP OR PROJ #\",AG30)","v":"ENTER TIP OR PROJ #"},null,null,"Latitude:",null,null,"Longitude:",null,null,null,"Google Maps",null,null,null,null,null,null,null,null,null,null,null,"PRE CONST. MANNING'S EQUATION OPEN CHANNEL",null,null,null,null,null,null,null,null,null,null,null,"POST CONST. MANNING'S EQUATION OPEN CHANNEL"]
[]
["PRE-CONSTRUCTION (RATIONAL METHOD)",null,null,null,null,null,null,"POST-CONSTRUCTION (RATIONAL METHOD)",null,null,null,null,null,"CHANGE",null,null,null,null,null,null,null,null,null,null,null,null,"B (ft)","norm. depth (ft)","avg sideslope","S (ft/ft)","N val","A (sq.ft.)","P (ft.)","R (ft.)","Q (cfs)","Vc (ft/s)","Q Compare Check: Make sure = 0 (set to 0 by changing y in data>what if> goal seek)",null,"B (ft)","norm. depth (ft)","avg sideslope","S (ft/ft)","N val","A (sq.ft.)","P (ft.)","R (ft.)","Q (cfs)","Vc (ft/s)","Q Compare Check: Make sure = 0 (set to 0 by changing y in data>what if> goal seek)"]
[]
[null,null,null,"Q2 =",{"$f":"IF(OR(c_composite_pre=0,i2pre=\"ENTER T.O.C\",da_total_pre=0),\"\",c_composite_pre*i2pre*da_total_pre)","v":""},"cfs",null,null,null,"Q2 =",{"$f":"IF(OR(c_composite_post=0,i2post=\"ENTER T.O.C\",da_total_post=0),\"\",c_composite_post*i2post*da_total_post)","v":""},"cfs",null,"Q2 =",{"$f":"IF(OR(q2post=\"\",q2pre=\"\"),\"\",(q2post/q2pre)-1)","v":""}]
[null,null,null,"V2 =",null,"ft./s",null,null,null,"V2 =",null,"ft./s",null,"V2 =",{"$f":"IF(OR(v2post=0,v2pre=0),\"\",(v2post/v2pre)-1)","v":""},null,null,null,"Green = Calculated / up to date (color 210,255,210)",null,null,null,null,null,null,null,{"$f":"Base_Width_Pre","v":0},1.4727991030475791,{"$f":"(Side_Slope_Left_Pre+Side_Slope_Right_Pre)/2","v":0},{"$f":"Slope_Pre","v":0},{"$f":"Roughness_Pre","v":0},{"$f":"AA11*AB11+AC11*AB11^2","v":0},{"$f":"AA11+((AB11*Side_Slope_Left_Pre)^2+AB11^2)^0.5+((AB11*Side_Slope_Right_Pre)^2+AB11^2)^0.5","v":2.9455982060951582},{"$f":"AF11/AG11","v":0},{"$f":"1.49/AE11*AF11*AH11^0.667*AD11^0.5","v":{"$error":"#DIV/0!"}},{"$f":"1.49/AE11*AH11^0.667*AD11^0.5","v":{"$error":"#DIV/0!"}},{"$f":"AI11-q2pre","v":{"$error":"#DIV/0!"}},{"$f":"ROUND(AK11,1)","v":{"$error":"#DIV/0!"}},{"$f":"IF(Post_Const_Geometry_Selection=\"Geometry Same as Pre-Construction\",Base_Width_Pre,Base_Width_Post)","v":0},1,{"$f":"IF(Post_Const_Geometry_Selection=\"Geometry Same as Pre-Construction\",(Side_Slope_Left_Pre+Side_Slope_Right_Pre)/2,(Side_Slope_Left_Post+Side_Slope_Right_Post)/2)","v":0},{"$f":"IF(Post_Const_Geometry_Selection=\"Geometry Same as Pre-Construction\",Slope_Pre,Slope_Post)","v":0},{"$f":"IF(Post_Const_Geometry_Selection=\"Geometry Same as Pre-Construction\",Roughness_Pre,Roughness_Post)","v":0},{"$f":"AM11*AN11+AO11*AN11^2","v":0},{"$f":"IF(Post_Const_Geometry_Selection=\"Geometry Same as Pre-Construction\",AM11+((AN11*Side_Slope_Left_Pre)^2+AN11^2)^0.5+((AN11*Side_Slope_Right_Pre)^2+AN11^2)^0.5,AM11+((AN11*Side_Slope_Left_Post)^2+AN11^2)^0.5+((AN11*Side_Slope_Right_Post)^2+AN11^2)^0.5)","v":2},{"$f":"AR11/AS11","v":0},{"$f":"1.49/AQ11*AR11*AT11^0.667*AP11^0.5","v":{"$error":"#DIV/0!"}},{"$f":"1.49/AQ11*AT11^0.667*AP11^0.5","v":{"$error":"#DIV/0!"}},{"$f":"AU11-q2post","v":{"$error":"#DIV/0!"}},{"$f":"ROUND(AW11,1)","v":{"$error":"#DIV/0!"}}]
["Ccomposite = ",null,null,"D2 =",null,"ft.",null,"Ccomposite = ",null,"D2 =",null,"ft.",null,"D2 =",{"$f":"IF(OR(d2post=0,d2pre=0),\"\",(d2post/d2pre)-1)","v":""},null,null,null,"Red = Calculated, incorrect, or not up to date (color 255,165,165)",null,null,null,null,null,null,null,{"$f":"Base_Width_Pre","v":0},1.4727991030475791,{"$f":"(Side_Slope_Left_Pre+Side_Slope_Right_Pre)/2","v":0},{"$f":"Slope_Pre","v":0},{"$f":"Roughness_Pre","v":0},{"$f":"AA12*AB12+AC12*AB12^2","v":0},{"$f":"AA12+((AB12*Side_Slope_Left_Pre)^2+AB12^2)^0.5+((AB12*Side_Slope_Right_Pre)^2+AB12^2)^0.5","v":2.9455982060951582},{"$f":"AF12/AG12","v":0},{"$f":"1.49/AE12*AF12*AH12^0.667*AD12^0.5","v":{"$error":"#DIV/0!"}},{"$f":"1.49/AE12*AH12^0.667*AD12^0.5","v":{"$error":"#DIV/0!"}},{"$f":"AI12-q2pre","v":{"$error":"#DIV/0!"}},{"$f":"ROUND(AK12,1)","v":{"$error":"#DIV/0!"}},{"$f":"IF(Post_Const_Geometry_Selection=\"Geometry Same as Pre-Construction\",Base_Width_Pre,Base_Width_Post)","v":0},1,{"$f":"IF(Post_Const_Geometry_Selection=\"Geometry Same as Pre-Construction\",(Side_Slope_Left_Pre+Side_Slope_Right_Pre)/2,(Side_Slope_Left_Post+Side_Slope_Right_Post)/2)","v":0},{"$f":"IF(Post_Const_Geometry_Selection=\"Geometry Same as Pre-Construction\",Slope_Pre,Slope_Post)","v":0},{"$f":"IF(Post_Const_Geometry_Selection=\"Geometry Same as Pre-Construction\",Roughness_Pre,Roughness_Post)","v":0},{"$f":"AM12*AN12+AO12*AN12^2","v":0},{"$f":"IF(Post_Const_Geometry_Selection=\"Geometry Same as Pre-Construction\",AM12+((AN12*Side_Slope_Left_Pre)^2+AN12^2)^0.5+((AN12*Side_Slope_Right_Pre)^2+AN12^2)^0.5,AM12+((AN12*Side_Slope_Left_Post)^2+AN12^2)^0.5+((AN12*Side_Slope_Right_Post)^2+AN12^2)^0.5)","v":2},{"$f":"AR12/AS12","v":0},{"$f":"1.49/AQ12*AR12*AT12^0.667*AP12^0.5","v":{"$error":"#DIV/0!"}},{"$f":"1.49/AQ12*AT12^0.667*AP12^0.5","v":{"$error":"#DIV/0!"}},{"$f":"AU12-q2post","v":{"$error":"#DIV/0!"}},{"$f":"ROUND(AW12,1)","v":{"$error":"#DIV/0!"}}]
["T.O.C (min.)",null,null,"Q5 =",{"$f":"IF(OR(c_composite_pre=0,i5pre=0,da_total_pre=0),\"\",c_composite_pre*i5pre*da_total_pre)","v":""},"cfs",null,"T.O.C (min.)",null,"Q5 =",{"$f":"IF(OR(c_composite_post=0,i5post=0,da_total_post=0),\"\",c_composite_post*i5post*da_total_post)","v":""},"cfs",null,"Q5 =",{"$f":"IF(OR(q5post=\"\",q5pre=\"\"),\"\",(q5post/q5pre)-1)","v":""},null,null,null,"light blue = user iput (cells unlocked) (color 190,240,240)"]
["I2 (in/hr) = ",{"$f":"IF(Tc_R_Pre=0,\"ENTER T.O.C\",IF(Name_R=\"\",\"PICK COUNTY\",TRANSPOSE(AO58:AS58)))","v":"ENTER T.O.C"},null,"V5 =",null,"ft./s",null,"I2 (in/hr) = ",{"$f":"IF(Tc_R_Post=0,\"ENTER T.O.C\",IF(Name_R=\"\",\"PICK COUNTY\",TRANSPOSE(AO86:AS86)))","v":"ENTER T.O.C"},"V5 =",null,"ft./s",null,"V5 =",{"$f":"IF(OR(v5post=0,v5pre=0),\"\",(v5post/v5pre)-1)","v":""},null,null,null,"Yellow = Warning / Caution           (color 255,255,100)",null,null,null,null,null,null,null,{"$f":"Base_Width_Pre","v":0},1.5647239205356298,{"$f":"(Side_Slope_Left_Pre+Side_Slope_Right_Pre)/2","v":0},{"$f":"Slope_Pre","v":0},{"$f":"Roughness_Pre","v":0},{"$f":"AA14*AB14+AC14*AB14^2","v":0},{"$f":"AA14+((AB14*Side_Slope_Left_Pre)^2+AB14^2)^0.5+((AB14*Side_Slope_Right_Pre)^2+AB14^2)^0.5","v":3.1294478410712596},{"$f":"AF14/AG14","v":0},{"$f":"1.49/AE14*AF14*AH14^0.667*AD14^0.5","v":{"$error":"#DIV/0!"}},{"$f":"1.49/AE14*AH14^0.667*AD14^0.5","v":{"$error":"#DIV/0!"}},{"$f":"AI14-q5pre","v":{"$error":"#DIV/0!"}},{"$f":"ROUND(AK14,1)","v":{"$error":"#DIV/0!"}},{"$f":"IF(Post_Const_Geometry_Selection=\"Geometry Same as Pre-Construction\",Base_Width_Pre,Base_Width_Post)","v":0},1,{"$f":"IF(Post_Const_Geometry_Selection=\"Geometry Same as Pre-Construction\",(Side_Slope_Left_Pre+Side_Slope_Right_Pre)/2,(Side_Slope_Left_Post+Side_Slope_Right_Post)/2)","v":0},{"$f":"IF(Post_Const_Geometry_Selection=\"Geometry Same as Pre-Construction\",Slope_Pre,Slope_Post)","v":0},{"$f":"IF(Post_Const_Geometry_Selection=\"Geometry Same as Pre-Construction\",Roughness_Pre,Roughness_Post)","v":0},{"$f":"AM14*AN14+AO14*AN14^2","v":0},{"$f":"IF(Post_Const_Geometry_Selection=\"Geometry Same as Pre-Construction\",AM14+((AN14*Side_Slope_Left_Pre)^2+AN14^2)^0.5+((AN14*Side_Slope_Right_Pre)^2+AN14^2)^0.5,AM14+((AN14*Side_Slope_Left_Post)^2+AN14^2)^0.5+((AN14*Side_Slope_Right_Post)^2+AN14^2)^0.5)","v":2},{"$f":"AR14/AS14","v":0},{"$f":"1.49/AQ14*AR14*AT14^0.667*AP14^0.5","v":{"$error":"#DIV/0!"}},{"$f":"1.49/AQ14*AT14^0.667*AP14^0.5","v":{"$error":"#DIV/0!"}},{"$f":"AU14-q5post","v":{"$error":"#DIV/0!"}},{"$f":"ROUND(AW14,1)","v":{"$error":"#DIV/0!"}}]
["I5 (in/hr) = ",null,null,"D5 =",null,"ft.",null,"I5 (in/hr) = ",null,"D5 =",null,"ft.",null,"D5 =",{"$f":"IF(OR(d5post=0,d5pre=0),\"\",(d5post/d5pre)-1)","v":""},null,null,null,null,null,null,null,null,null,null,null,{"$f":"Base_Width_Pre","v":0},1.5647239205356298,{"$f":"(Side_Slope_Left_Pre+Side_Slope_Right_Pre)/2","v":0},{"$f":"Slope_Pre","v":0},{"$f":"Roughness_Pre","v":0},0,{"$f":"AA15+((AB15*Side_Slope_Left_Pre)^2+AB15^2)^0.5+((AB15*Side_Slope_Right_Pre)^2+AB15^2)^0.5","v":3.1294478410712596},0,{"$error":"#DIV/0!"},{"$error":"#DIV/0!"},{"$f":"AI15-q5pre","v":{"$error":"#DIV/0!"}},{"$error":"#DIV/0!"},{"$f":"IF(Post_Const_Geometry_Selection=\"Geometry Same as Pre-Construction\",Base_Width_Pre,Base_Width_Post)","v":0},1,{"$f":"IF(Post_Const_Geometry_Selection=\"Geometry Same as Pre-Construction\",(Side_Slope_Left_Pre+Side_Slope_Right_Pre)/2,(Side_Slope_Left_Post+Side_Slope_Right_Post)/2)","v":0},{"$f":"IF(Post_Const_Geometry_Selection=\"Geometry Same as Pre-Construction\",Slope_Pre,Slope_Post)","v":0},{"$f":"IF(Post_Const_Geometry_Selection=\"Geometry Same as Pre-Construction\",Roughness_Pre,Roughness_Post)","v":0},0,{"$f":"IF(Post_Const_Geometry_Selection=\"Geometry Same as Pre-Construction\",AM15+((AN15*Side_Slope_Left_Pre)^2+AN15^2)^0.5+((AN15*Side_Slope_Right_Pre)^2+AN15^2)^0.5,AM15+((AN15*Side_Slope_Left_Post)^2+AN15^2)^0.5+((AN15*Side_Slope_Right_Post)^2+AN15^2)^0.5)","v":2},0,{"$error":"#DIV/0!"},{"$error":"#DIV/0!"},{"$f":"AU15-q5post","v":{"$error":"#DIV/0!"}},{"$error":"#DIV/0!"}]
["I10 (in/hr) = ",null,null,"Q10 =",{"$f":"IF(OR(c_composite_pre=0,i10pre=0,da_total_pre=0),\"\",c_composite_pre*i10pre*da_total_pre)","v":""},"cfs",null,"I10 (in/hr) = ",null,"Q10 =",{"$f":"IF(OR(c_composite_post=0,i10post=0,da_total_post=0),\"\",c_composite_post*i10post*da_total_post)","v":""},"cfs",null,"Q10 =",{"$f":"IF(OR(q10post=\"\",q10pre=\"\"),\"\",(q10post/q10pre)-1)","v":""},null,null,null,"User Notes (will not be printed)",null,null,null,null,null,null,null,null,null,null,null,null,null,null,null,null,null,null,0]
["I25 (in/hr) = ",null,null,"V10 =",null,"ft./s",null,"I25 (in/hr) = ",null,"V10 =",null,"ft./s",null,"V10 =",{"$f":"IF(OR(v10post=0,v10pre=0),\"\",(v10post/v10pre)-1)","v":""},null,null,null,null,null,null,null,null,null,null,null,{"$f":"Base_Width_Pre","v":0},1.6213254592941764,{"$f":"(Side_Slope_Left_Pre+Side_Slope_Right_Pre)/2","v":0},{"$f":"Slope_Pre","v":0},{"$f":"Roughness_Pre","v":0},0,{"$f":"AA17+((AB17*Side_Slope_Left_Pre)^2+AB17^2)^0.5+((AB17*Side_Slope_Right_Pre)^2+AB17^2)^0.5","v":3.2426509185883527},0,{"$error":"#DIV/0!"},{"$error":"#DIV/0!"},{"$f":"AI17-q10pre","v":{"$error":"#DIV/0!"}},{"$error":"#DIV/0!"},{"$f":"IF(Post_Const_Geometry_Selection=\"Geometry Same as Pre-Construction\",Base_Width_Pre,Base_Width_Post)","v":0},1,{"$f":"IF(Post_Const_Geometry_Selection=\"Geometry Same as Pre-Construction\",(Side_Slope_Left_Pre+Side_Slope_Right_Pre)/2,(Side_Slope_Left_Post+Side_Slope_Right_Post)/2)","v":0},{"$f":"IF(Post_Const_Geometry_Selection=\"Geometry Same as Pre-Construction\",Slope_Pre,Slope_Post)","v":0},{"$f":"IF(Post_Const_Geometry_Selection=\"Geometry Same as Pre-Construction\",Roughness_Pre,Roughness_Post)","v":0},{"$f":"AM17*AN17+AO17*AN17^2","v":0},{"$f":"IF(Post_Const_Geometry_Selection=\"Geometry Same as Pre-Construction\",AM17+((AN17*Side_Slope_Left_Pre)^2+AN17^2)^0.5+((AN17*Side_Slope_Right_Pre)^2+AN17^2)^0.5,AM17+((AN17*Side_Slope_Left_Post)^2+AN17^2)^0.5+((AN17*Side_Slope_Right_Post)^2+AN17^2)^0.5)","v":2},{"$f":"AR17/AS17","v":0},{"$f":"1.49/AQ17*AR17*AT17^0.667*AP17^0.5","v":{"$error":"#DIV/0!"}},{"$f":"1.49/AQ17*AT17^0.667*AP17^0.5","v":{"$error":"#DIV/0!"}},{"$f":"AU17-q10post","v":{"$error":"#DIV/0!"}},{"$error":"#DIV/0!"}]
["I50 (in/hr) = ",null,null,"D10 =",null,"ft.",null,"I50 (in/hr) = ",null,"D10 =",null,"ft.",null,"D10 =",{"$f":"IF(OR(d10post=0,d10pre=0),\"\",(d10post/d10pre)-1)","v":""},null,null,null,null,null,null,null,null,null,null,null,{"$f":"Base_Width_Pre","v":0},1.6213254592941764,{"$f":"(Side_Slope_Left_Pre+Side_Slope_Right_Pre)/2","v":0},{"$f":"Slope_Pre","v":0},{"$f":"Roughness_Pre","v":0},0,{"$f":"AA18+((AB18*Side_Slope_Left_Pre)^2+AB18^2)^0.5+((AB18*Side_Slope_Right_Pre)^2+AB18^2)^0.5","v":3.2426509185883527},0,{"$error":"#DIV/0!"},{"$error":"#DIV/0!"},{"$f":"AI18-q10pre","v":{"$error":"#DIV/0!"}},{"$error":"#DIV/0!"},{"$f":"IF(Post_Const_Geometry_Selection=\"Geometry Same as Pre-Construction\",Base_Width_Pre,Base_Width_Post)","v":0},1,{"$f":"IF(Post_Const_Geometry_Selection=\"Geometry Same as Pre-Construction\",(Side_Slope_Left_Pre+Side_Slope_Right_Pre)/2,(Side_Slope_Left_Post+Side_Slope_Right_Post)/2)","v":0},{"$f":"IF(Post_Const_Geometry_Selection=\"Geometry Same as Pre-Construction\",Slope_Pre,Slope_Post)","v":0},{"$f":"IF(Post_Const_Geometry_Selection=\"Geometry Same as Pre-Construction\",Roughness_Pre,Roughness_Post)","v":0},0,{"$f":"IF(Post_Const_Geometry_Selection=\"Geometry Same as Pre-Construction\",AM18+((AN18*Side_Slope_Left_Pre)^2+AN18^2)^0.5+((AN18*Side_Slope_Right_Pre)^2+AN18^2)^0.5,AM18+((AN18*Side_Slope_Left_Post)^2+AN18^2)^0.5+((AN18*Side_Slope_Right_Post)^2+AN18^2)^0.5)","v":2},0,{"$error":"#DIV/0!"},{"$error":"#DIV/0!"},{"$f":"AU18-q10post","v":{"$error":"#DIV/0!"}},{"$error":"#DIV/0!"}]
["DA imp in R/W = ",null,null,"Q25 =",{"$f":"IF(OR(c_composite_pre=0,i25pre=0,da_total_pre=0),\"\",c_composite_pre*i25pre*da_total_pre)","v":""},"cfs",null,"DA imp in R/W = ",null,"Q25 =",{"$f":"IF(OR(c_composite_post=0,i25post=0,da_total_post=0),\"\",c_composite_post*i25post*da_total_post)","v":""},"cfs",null,"Q25 =",{"$f":"IF(OR(q25post=\"\",q25pre=\"\"),\"\",(q25post/q25pre)-1)","v":""}]
["DAtotal  =",null,null,"V25 =",null,"ft./s",null,"DAtotal  =",null,"V25 =",null,"ft./s",null,"V25 =",{"$f":"IF(OR(v25post=0,v25pre=0),\"\",(v25post/v25pre)-1)","v":""},null,null,null,null,null,null,null,null,null,null,null,{"$f":"Base_Width_Pre","v":0},1.682068068069611,{"$f":"(Side_Slope_Left_Pre+Side_Slope_Right_Pre)/2","v":0},{"$f":"Slope_Pre","v":0},{"$f":"Roughness_Pre","v":0},{"$f":"AA20*AB20+AC20*AB20^2","v":0},{"$f":"AA20+((AB20*Side_Slope_Left_Pre)^2+AB20^2)^0.5+((AB20*Side_Slope_Right_Pre)^2+AB20^2)^0.5","v":3.3641361361392219},0,{"$error":"#DIV/0!"},{"$error":"#DIV/0!"},{"$f":"AI20-q25pre","v":{"$error":"#DIV/0!"}},{"$error":"#DIV/0!"},{"$f":"IF(Post_Const_Geometry_Selection=\"Geometry Same as Pre-Construction\",Base_Width_Pre,Base_Width_Post)","v":0},1,{"$f":"IF(Post_Const_Geometry_Selection=\"Geometry Same as Pre-Construction\",(Side_Slope_Left_Pre+Side_Slope_Right_Pre)/2,(Side_Slope_Left_Post+Side_Slope_Right_Post)/2)","v":0},{"$f":"IF(Post_Const_Geometry_Selection=\"Geometry Same as Pre-Construction\",Slope_Pre,Slope_Post)","v":0},{"$f":"IF(Post_Const_Geometry_Selection=\"Geometry Same as Pre-Construction\",Roughness_Pre,Roughness_Post)","v":0},{"$f":"AM20*AN20+AO20*AN20^2","v":0},{"$f":"IF(Post_Const_Geometry_Selection=\"Geometry Same as Pre-Construction\",AM20+((AN20*Side_Slope_Left_Pre)^2+AN20^2)^0.5+((AN20*Side_Slope_Right_Pre)^2+AN20^2)^0.5,AM20+((AN20*Side_Slope_Left_Post)^2+AN20^2)^0.5+((AN20*Side_Slope_Right_Post)^2+AN20^2)^0.5)","v":2},{"$f":"AR20/AS20","v":0},{"$f":"1.49/AQ20*AR20*AT20^0.667*AP20^0.5","v":{"$error":"#DIV/0!"}},{"$f":"1.49/AQ20*AT20^0.667*AP20^0.5","v":{"$error":"#DIV/0!"}},{"$f":"AU20-q25post","v":{"$error":"#DIV/0!"}},{"$error":"#DIV/0!"}]
["% Imp. Area (Total)",null,null,"D25 =",null,"ft.",null,"% Imp. Area (Total)",null,"D25 =",null,"ft.",null,"D25 =",{"$f":"IF(OR(d25post=0,d25pre=0),\"\",(d25post/d25pre)-1)","v":""},null,null,null,null,null,null,null,null,null,null,null,{"$f":"Base_Width_Pre","v":0},1.682068068069611,{"$f":"(Side_Slope_Left_Pre+Side_Slope_Right_Pre)/2","v":0},{"$f":"Slope_Pre","v":0},{"$f":"Roughness_Pre","v":0},0,{"$f":"AA21+((AB21*Side_Slope_Left_Pre)^2+AB21^2)^0.5+((AB21*Side_Slope_Right_Pre)^2+AB21^2)^0.5","v":3.3641361361392219},0,{"$error":"#DIV/0!"},{"$error":"#DIV/0!"},{"$f":"AI21-q25pre","v":{"$error":"#DIV/0!"}},{"$error":"#DIV/0!"},{"$f":"IF(Post_Const_Geometry_Selection=\"Geometry Same as Pre-Construction\",Base_Width_Pre,Base_Width_Post)","v":0},1,{"$f":"IF(Post_Const_Geometry_Selection=\"Geometry Same as Pre-Construction\",(Side_Slope_Left_Pre+Side_Slope_Right_Pre)/2,(Side_Slope_Left_Post+Side_Slope_Right_Post)/2)","v":0},{"$f":"IF(Post_Const_Geometry_Selection=\"Geometry Same as Pre-Construction\",Slope_Pre,Slope_Post)","v":0},{"$f":"IF(Post_Const_Geometry_Selection=\"Geometry Same as Pre-Construction\",Roughness_Pre,Roughness_Post)","v":0},{"$f":"AM21*AN21+AO21*AN21^2","v":0},{"$f":"IF(Post_Const_Geometry_Selection=\"Geometry Same as Pre-Construction\",AM21+((AN21*Side_Slope_Left_Pre)^2+AN21^2)^0.5+((AN21*Side_Slope_Right_Pre)^2+AN21^2)^0.5,AM21+((AN21*Side_Slope_Left_Post)^2+AN21^2)^0.5+((AN21*Side_Slope_Right_Post)^2+AN21^2)^0.5)","v":2},0,{"$error":"#DIV/0!"},{"$error":"#DIV/0!"},{"$f":"AU21-q25post","v":{"$error":"#DIV/0!"}},{"$error":"#DIV/0!"}]
["% Imp. Area (NCDOT Contribution)",null,null,"Q50 =",{"$f":"IF(OR(c_composite_pre=0,i50pre=0,da_total_pre=0),\"\",c_composite_pre*i50pre*da_total_pre)","v":""},"cfs",null,"% Imp. Area (NCDOT Contribution)",null,"Q50 =",{"$f":"IF(OR(c_composite_post=0,i50post=0,da_total_post=0),\"\",c_composite_post*i50post*da_total_post)","v":""},"cfs",null,"Q50 =",{"$f":"IF(OR(q50post=\"\",q50pre=\"\"),\"\",(q50post/q50pre)-1)","v":""}]
[null,null,null,"V50 =",null,"ft./s",null,null,null,"V50 =",null,"ft./s",null,"V50 =",{"$f":"IF(OR(v50post=0,v50pre=0),\"\",(v50post/v50pre)-1)","v":""},null,null,null,null,null,null,null,null,null,null,null,{"$f":"Base_Width_Pre","v":0},1.7196104937144696,{"$f":"(Side_Slope_Left_Pre+Side_Slope_Right_Pre)/2","v":0},{"$f":"Slope_Pre","v":0},{"$f":"Roughness_Pre","v":0},0,{"$f":"AA23+((AB23*Side_Slope_Left_Pre)^2+AB23^2)^0.5+((AB23*Side_Slope_Right_Pre)^2+AB23^2)^0.5","v":3.4392209874289392},0,{"$error":"#DIV/0!"},{"$error":"#DIV/0!"},{"$f":"AI23-q50pre","v":{"$error":"#DIV/0!"}},{"$error":"#DIV/0!"},{"$f":"IF(Post_Const_Geometry_Selection=\"Geometry Same as Pre-Construction\",Base_Width_Pre,Base_Width_Post)","v":0},1,{"$f":"IF(Post_Const_Geometry_Selection=\"Geometry Same as Pre-Construction\",(Side_Slope_Left_Pre+Side_Slope_Right_Pre)/2,(Side_Slope_Left_Post+Side_Slope_Right_Post)/2)","v":0},{"$f":"IF(Post_Const_Geometry_Selection=\"Geometry Same as Pre-Construction\",Slope_Pre,Slope_Post)","v":0},{"$f":"IF(Post_Const_Geometry_Selection=\"Geometry Same as Pre-Construction\",Roughness_Pre,Roughness_Post)","v":0},{"$f":"AM23*AN23+AO23*AN23^2","v":0},{"$f":"IF(Post_Const_Geometry_Selection=\"Geometry Same as Pre-Construction\",AM23+((AN23*Side_Slope_Left_Pre)^2+AN23^2)^0.5+((AN23*Side_Slope_Right_Pre)^2+AN23^2)^0.5,AM23+((AN23*Side_Slope_Left_Post)^2+AN23^2)^0.5+((AN23*Side_Slope_Right_Post)^2+AN23^2)^0.5)","v":2},{"$f":"AR23/AS23","v":0},{"$f":"1.49/AQ23*AR23*AT23^0.667*AP23^0.5","v":{"$error":"#DIV/0!"}},{"$f":"1.49/AQ23*AT23^0.667*AP23^0.5","v":{"$error":"#DIV/0!"}},{"$f":"AU23-q50post","v":{"$error":"#DIV/0!"}},{"$error":"#DIV/0!"}]
[null,null,null,"D50 =",null,"ft.",null,null,null,"D50 =",null,"ft.",null,"D50 =",{"$f":"IF(OR(d50post=0,d50pre=0),\"\",(d50post/d50pre)-1)","v":""},null,null,null,null,null,null,null,null,null,null,null,{"$f":"Base_Width_Pre","v":0},1.7196104937144696,{"$f":"(Side_Slope_Left_Pre+Side_Slope_Right_Pre)/2","v":0},{"$f":"Slope_Pre","v":0},{"$f":"Roughness_Pre","v":0},{"$f":"AA24*AB24+AC24*AB24^2","v":0},{"$f":"AA24+((AB24*Side_Slope_Left_Pre)^2+AB24^2)^0.5+((AB24*Side_Slope_Right_Pre)^2+AB24^2)^0.5","v":3.4392209874289392},0,{"$f":"1.49/AE24*AF24*AH24^0.667*AD24^0.5","v":{"$error":"#DIV/0!"}},{"$error":"#DIV/0!"},{"$f":"AI24-q50pre","v":{"$error":"#DIV/0!"}},{"$error":"#DIV/0!"},{"$f":"IF(Post_Const_Geometry_Selection=\"Geometry Same as Pre-Construction\",Base_Width_Pre,Base_Width_Post)","v":0},1,{"$f":"IF(Post_Const_Geometry_Selection=\"Geometry Same as Pre-Construction\",(Side_Slope_Left_Pre+Side_Slope_Right_Pre)/2,(Side_Slope_Left_Post+Side_Slope_Right_Post)/2)","v":0},{"$f":"IF(Post_Const_Geometry_Selection=\"Geometry Same as Pre-Construction\",Slope_Pre,Slope_Post)","v":0},{"$f":"IF(Post_Const_Geometry_Selection=\"Geometry Same as Pre-Construction\",Roughness_Pre,Roughness_Post)","v":0},0,{"$f":"IF(Post_Const_Geometry_Selection=\"Geometry Same as Pre-Construction\",AM24+((AN24*Side_Slope_Left_Pre)^2+AN24^2)^0.5+((AN24*Side_Slope_Right_Pre)^2+AN24^2)^0.5,AM24+((AN24*Side_Slope_Left_Post)^2+AN24^2)^0.5+((AN24*Side_Slope_Right_Post)^2+AN24^2)^0.5)","v":2},0,{"$error":"#DIV/0!"},{"$error":"#DIV/0!"},{"$f":"AU24-q50post","v":{"$error":"#DIV/0!"}},{"$error":"#DIV/0!"}]
["I100 (in/hr) = ",{"$f":"IF(Tc_R_Pre=0,\"ENTER T.O.C\",IF(Name_R=\"\",\"PICK COUNTY\",AT58))","v":"ENTER T.O.C"},null,"Q100 =",{"$f":"IF(OR(c_composite_pre=0,i100pre=0,da_total_pre=0),\"\",c_composite_pre*i100pre*da_total_pre)","v":""},"cfs",null,"I100 (in/hr) = ",{"$f":"IF(Tc_R_Post=0,\"ENTER T.O.C\",IF(Name_R=\"\",\"PICK COUNTY\",AT86))","v":"ENTER T.O.C"},"Q100 =",{"$f":"IF(OR(c_composite_post=0,i100post=0,da_total_post=0),\"\",c_composite_post*i100post*da_total_post)","v":""},"cfs",null,"Q100 =",{"$f":"IF(OR(q100post=\"\",q100pre=\"\"),\"\",(q100post/q100pre)-1)","v":""}]
[null,null,null,"V100 =",null,"ft./s",null,null,null,"V100 =",null,"ft./s",null,"V100 =",{"$f":"IF(OR(v100post=0,v100pre=0),\"\",(v100post/v100pre)-1)","v":""},null,null,null,null,null,null,null,null,null,null,null,{"$f":"Base_Width_Pre","v":0},1.7196104937144696,{"$f":"(Side_Slope_Left_Pre+Side_Slope_Right_Pre)/2","v":0},{"$f":"Slope_Pre","v":0},{"$f":"Roughness_Pre","v":0},{"$f":"AA26*AB26+AC26*AB26^2","v":0},{"$f":"AA26+((AB26*Side_Slope_Left_Pre)^2+AB26^2)^0.5+((AB26*Side_Slope_Right_Pre)^2+AB26^2)^0.5","v":3.4392209874289392},{"$f":"AF26/AG26","v":0},{"$f":"1.49/AE26*AF26*AH26^0.667*AD26^0.5","v":{"$error":"#DIV/0!"}},{"$f":"1.49/AE26*AH26^0.667*AD26^0.5","v":{"$error":"#DIV/0!"}},{"$f":"AI26-q100pre","v":{"$error":"#DIV/0!"}},{"$f":"ROUND(AK26,1)","v":{"$error":"#DIV/0!"}},{"$f":"IF(Post_Const_Geometry_Selection=\"Geometry Same as Pre-Construction\",Base_Width_Pre,Base_Width_Post)","v":0},1,{"$f":"IF(Post_Const_Geometry_Selection=\"Geometry Same as Pre-Construction\",(Side_Slope_Left_Pre+Side_Slope_Right_Pre)/2,(Side_Slope_Left_Post+Side_Slope_Right_Post)/2)","v":0},{"$f":"IF(Post_Const_Geometry_Selection=\"Geometry Same as Pre-Construction\",Slope_Pre,Slope_Post)","v":0},{"$f":"IF(Post_Const_Geometry_Selection=\"Geometry Same as Pre-Construction\",Roughness_Pre,Roughness_Post)","v":0},{"$f":"AM26*AN26+AO26*AN26^2","v":0},{"$f":"IF(Post_Const_Geometry_Selection=\"Geometry Same as Pre-Construction\",AM26+((AN26*Side_Slope_Left_Pre)^2+AN26^2)^0.5+((AN26*Side_Slope_Right_Pre)^2+AN26^2)^0.5,AM26+((AN26*Side_Slope_Left_Post)^2+AN26^2)^0.5+((AN26*Side_Slope_Right_Post)^2+AN26^2)^0.5)","v":2},{"$f":"AR26/AS26","v":0},{"$f":"1.49/AQ26*AR26*AT26^0.667*AP26^0.5","v":{"$error":"#DIV/0!"}},{"$f":"1.49/AQ26*AT26^0.667*AP26^0.5","v":{"$error":"#DIV/0!"}},{"$f":"AU26-q100post","v":{"$error":"#DIV/0!"}},{"$f":"ROUND(AW26,1)","v":{"$error":"#DIV/0!"}}]
[null,null,null,"D100 =",null,"ft.",null,null,null,"D100 =",null,"ft.",null,"D100 =",{"$f":"IF(OR(d100post=0,d100pre=0),\"\",(d100post/d100pre)-1)","v":""},null,null,null,null,null,null,null,null,null,null,null,{"$f":"Base_Width_Pre","v":0},1.7196104937144696,{"$f":"(Side_Slope_Left_Pre+Side_Slope_Right_Pre)/2","v":0},{"$f":"Slope_Pre","v":0},{"$f":"Roughness_Pre","v":0},{"$f":"AA27*AB27+AC27*AB27^2","v":0},{"$f":"AA27+((AB27*Side_Slope_Left_Pre)^2+AB27^2)^0.5+((AB27*Side_Slope_Right_Pre)^2+AB27^2)^0.5","v":3.4392209874289392},0,{"$f":"1.49/AE27*AF27*AH27^0.667*AD27^0.5","v":{"$error":"#DIV/0!"}},{"$error":"#DIV/0!"},{"$f":"AI27-q100pre","v":{"$error":"#DIV/0!"}},{"$f":"ROUND(AK27,1)","v":{"$error":"#DIV/0!"}},{"$f":"IF(Post_Const_Geometry_Selection=\"Geometry Same as Pre-Construction\",Base_Width_Pre,Base_Width_Post)","v":0},1,{"$f":"IF(Post_Const_Geometry_Selection=\"Geometry Same as Pre-Construction\",(Side_Slope_Left_Pre+Side_Slope_Right_Pre)/2,(Side_Slope_Left_Post+Side_Slope_Right_Post)/2)","v":0},{"$f":"IF(Post_Const_Geometry_Selection=\"Geometry Same as Pre-Construction\",Slope_Pre,Slope_Post)","v":0},{"$f":"IF(Post_Const_Geometry_Selection=\"Geometry Same as Pre-Construction\",Roughness_Pre,Roughness_Post)","v":0},0,{"$f":"IF(Post_Const_Geometry_Selection=\"Geometry Same as Pre-Construction\",AM27+((AN27*Side_Slope_Left_Pre)^2+AN27^2)^0.5+((AN27*Side_Slope_Right_Pre)^2+AN27^2)^0.5,AM27+((AN27*Side_Slope_Left_Post)^2+AN27^2)^0.5+((AN27*Side_Slope_Right_Post)^2+AN27^2)^0.5)","v":2},0,{"$f":"1.49/AQ27*AR27*AT27^0.667*AP27^0.5","v":{"$error":"#DIV/0!"}},{"$f":"1.49/AQ27*AT27^0.667*AP27^0.5","v":{"$error":"#DIV/0!"}},{"$f":"AU27-q100post","v":{"$error":"#DIV/0!"}},{"$error":"#DIV/0!"}]
[null,null,null,null,null,null,null,null,null,null,null,null,null,"DAtotal=",{"$f":"IF(OR(da_total_post=0,da_total_post=\"\",da_total_pre=0),\"\",(da_total_post/da_total_pre)-1)","v":""}]
["Railroad / 100-YR Design? ",null,null,"Existing Erosion / Potential Future Erosion?",null,null,null,"Post Const. D/S Channel liner type",null,null,null,null,null,"DA imp R/W = ",{"$f":"IF(OR(da_pre_imp=\"\",da_post_imp=\"\"),\"\",da_post_imp-da_pre_imp)","v":""}]
[null,null,null,null,null,null,null,null,null,null,{"$f":"IF(J30=\"\",\"\",IF(d10post=\"\",\"Calc D10\",IF(AND(Post_Const_Geometry_Selection=\"Geometry Same as Pre-Construction\",Slope_Pre=\"\"),\"Enter Slope\",IF(AND(Slope_Post=\"\",Post_Const_Geometry_Selection<>\"Geometry Same as Pre-Construction\"),\"Enter Slope\",IF(Post_Const_Geometry_Selection=\"Geometry Same as Pre-Construction\",Slope_Pre*d10post*62.4,Slope_Post*d10post*62.4)))))","v":""},null,null,"% imp Area = ",{"$f":"IF(OR(percent_imp_pre_total=\"\",percent_imp_post_total=\"\"),\"\",percent_imp_post_total-percent_imp_pre_total)","v":""},null,null,null,null,null,null,null,null,null,null,null,null,null,null,null,null,null,{"$f":"_xlfn.TEXTJOIN(\"\",TRUE,\"OA-\",B1,\"-\",UID_hidden)","v":"OA-0-"}]
[]
[]
[]
["LINER TYPE","Select Liner Type Above To Generate List",null,null,null,null,null,"PRE-CONSTRUCTION OUTLET GEOMETRY"]
[]
["V10 Permissible",{"$f":"IF($I$30=\"N/A\",\"N/A\",IF(Soil_Type=\"Permanent Matting Product (stable)\",\"User to Define\",IF($J$30<>\"\",\"N/A\",IF($I$30=\"Soil\",#REF!,IF($I$30=\"Non-Soil\",$AD$43,\"\")))))","v":""},null,{"$f":"IF(Soil_Type='PICK LISTS'!E14,\"N/A\",IF(A34=\"LINER TYPE\",AF62,AD60))","v":""},null,null,null,"POST-CONSTRUCTION OUTLET GEOMETRY"]
["τ10 Permissible",{"$f":"IF($A$34=\"SOIL TYPE\",\"N/A\",IF(Soil_Type=\"Grass / Dense Veg. (no bare soil spots)\",\"N/A\",IF($J$30<>\"\",$AD$43,\"\")))","v":""},null,null,null,null,null,null,null,null,null,null,null,null,null,null,null,null,null,null,null,null,null,null,null,null,null,"Hydrology Method:",null,"Rational Method"]
[]
["PRE-CONSTRUCTION OUTLET GEOMETRY",null,null,null,null,null,null,null,"POST-CONSTRUCTION OUTLET GEOMETRY"]
[null,null,null,null,null,null,null,null,null,null,null,null,null,null,null,null,null,null,null,null,null,null,null,null,null,null,null,null,null,null,null,"allowable shear stress",null,{"$f":"AD43","v":""}]
[null,null,null,null,null,null,null,null,null,null,null,null,null,null,null,null,null,null,null,null,null,null,null,null,null,null,null,"v_permissible soil",null,{"$f":"IF(Soil_Type='PICK LISTS'!E2,'PICK LISTS'!F2,IF(Soil_Type='PICK LISTS'!E3,'PICK LISTS'!F3,IF(Soil_Type='PICK LISTS'!E4,'PICK LISTS'!F4, IF(Soil_Type='PICK LISTS'!E5,'PICK LISTS'!F5, IF(Soil_Type='PICK LISTS'!E6,'PICK LISTS'!F6,IF(Soil_Type='PICK LISTS'!E7,'PICK LISTS'!F7,IF(Soil_Type='PICK LISTS'!E8,'PICK LISTS'!F8,IF(Soil_Type='PICK LISTS'!E9,'PICK LISTS'!F9,IF(Soil_Type='PICK LISTS'!E10,'PICK LISTS'!F10,IF(Soil_Type='PICK LISTS'!E11,'PICK LISTS'!F11,IF(Soil_Type='PICK LISTS'!E12,'PICK LISTS'!F12,IF(Soil_Type='PICK LISTS'!E13,'PICK LISTS'!F13,IF(Soil_Type=\"N/A (Pipe System or Non-Channel)\",\"N/A\",\"\")))))))))))))","v":""},null,"riprap permissible velocity",null,null,{"$f":"IF(v10post=\"\",\"\",(1.49/(Roughness_Pre*SQRT(62.4*d10pre)))*(AH18^(0.1666666))*(AH40^0.5))","v":""},null,null,null,"PRE"]
[null,null,null,null,null,null,null,null,null,null,null,null,null,null,null,null,null,null,null,null,null,null,null,null,null,null,null,null,null,null,null,null,null,null,null,null,null,null,null,"Intensity Calcs"]
[null,null,null,null,null,null,null,null,null,null,null,null,null,null,null,null,null,null,null,null,null,null,null,null,null,null,null,"shear/v_perm non-soil",null,{"$f":"IF(Soil_Type='PICK LISTS'!H18,'PICK LISTS'!I18,IF(Soil_Type='PICK LISTS'!H19,'PICK LISTS'!I19,IF(Soil_Type='PICK LISTS'!H20,'PICK LISTS'!I20,IF(Soil_Type='PICK LISTS'!H21,'PICK LISTS'!I21,IF(Soil_Type='PICK LISTS'!H22,'PICK LISTS'!I22,IF(Soil_Type='PICK LISTS'!H23,'PICK LISTS'!I23,\"\"))))))","v":""},null,"Is it riprap lined?",null,{"$f":"IF(OR(Soil_Type=\"CL-A Riprap (d50 = 4 in.)\",Soil_Type=\"CL-B Riprap (d50 = 8 in.)\",Soil_Type=\"CL-I Riprap (d50 = 10 in.)\",Soil_Type=\"CL-II Riprap (d50 = 12 in.)\"),\"YES\",\"NO\")","v":"NO"}]
[null,null,null,null,null,null,null,null,null,null,null,null,null,null,null,null,null,null,null,null,null,null,null,null,null,null,null,null,null,null,null,null,null,null,null,null,null,null,null,null,2,5,10,25,50,100]
[null,null,null,null,null,null,null,null,null,null,null,null,null,null,null,null,null,null,null,null,null,null,null,null,null,null,null,"Increase or Decrease in Velocity",null,null,null,null,null,null,null,null,null,null,null,{"$f":"IF(custom_IDF=\"YES\",INDIRECT(\"Z_CUSTOM_IDF\"),IF(county_for_this_outlet=\"New Hanover\", INDIRECT(\"NewHanover\"),INDIRECT(county_for_this_outlet)))","v":{"$error":"#REF!"}}]
[null,null,null,null,null,null,null,null,null,null,null,null,null,null,null,null,null,null,null,null,null,null,null,null,null,null,null,{"$f":"IF(OR(v10pre=\"\",v10post=\"\",Soil_Type=\"\",Soil_Type=\"Select Liner Type Above To Generate List\"),\"\",IF(v10post>v10pre,\"Increase\",IF(v10post<=v10pre,\"Decrease\",\"\")))","v":""}]
[]
[null,null,null,null,null,null,null,null,null,null,null,null,null,null,null,null,null,null,null,null,null,null,null,null,null,null,null,"Vpost > Vsoil_permissible?"]
[]
[]
[{"$f":"_xlfn.CONCAT(\"SUMMARY - \",_xlnm.sheet_title)","v":"SUMMARY - PSH # OUTLET #"},null,null,null,null,null,null,null,null,null,null,null,null,null,null,null,null,null,null,null,null,null,null,null,null,null,null,{"$f":"IF(I30=\"Soil\",IF(v10post>AD41,\"YES\",\"NO\"),IF(AH43=\"YES\",IF(K30>AD43,\"YES\",\"NO\"),IF(v10post>AD43,\"YES\",\"NO\")))","v":"NO"}]
["Please provide a summary of the outlet analysis here. Directions/guidance are provided by clicking on the \"i\" button above."]
[null,null,null,null,null,null,null,null,null,null,null,null,null,null,null,null,null,null,null,null,null,null,null,null,null,null,null,"Vpost increase > 10%?",null,null,null,null,null,null,null,null,null,null,null,"5-10",{"$f":"_xlfn.FORECAST.LINEAR(Tc_R_Pre,AO45:AO46,$AN45:$AN46)","v":{"$error":"#REF!"}},{"$f":"_xlfn.FORECAST.LINEAR(Tc_R_Pre,AP45:AP46,$AN45:$AN46)","v":{"$error":"#REF!"}},{"$error":"#REF!"},{"$error":"#REF!"},{"$error":"#REF!"},{"$error":"#REF!"}]
[null,null,null,null,null,null,null,null,null,null,null,null,null,null,null,null,null,null,null,null,null,null,null,null,null,null,null,{"$f":"IF(O17>0.1,\"YES\",\"NO\")","v":"YES"},null,null,null,null,null,null,null,null,null,null,null,"10-15",{"$f":"_xlfn.FORECAST.LINEAR(Tc_R_Pre,AO46:AO47,$AN46:$AN47)","v":{"$error":"#DIV/0!"}},{"$error":"#DIV/0!"},{"$error":"#DIV/0!"},{"$error":"#DIV/0!"},{"$error":"#DIV/0!"},{"$error":"#DIV/0!"}]
[null,null,null,null,null,null,null,null,null,null,null,null,null,null,null,null,null,null,null,null,null,null,null,null,null,null,null,null,null,null,null,null,null,null,null,null,null,null,null,"15-30",{"$error":"#DIV/0!"},{"$error":"#DIV/0!"},{"$error":"#DIV/0!"},{"$error":"#DIV/0!"},{"$error":"#DIV/0!"},{"$error":"#DIV/0!"}]
[null,null,null,null,null,null,null,null,null,null,null,null,null,null,null,null,null,null,null,null,null,null,null,null,null,null,null,null,null,null,null,null,null,null,null,null,null,null,null,"30-60",{"$error":"#DIV/0!"},{"$error":"#DIV/0!"},{"$error":"#DIV/0!"},{"$error":"#DIV/0!"},{"$error":"#DIV/0!"},{"$error":"#DIV/0!"}]
[]
[null,null,null,null,null,null,null,null,null,null,null,null,null,null,null,null,null,null,null,null,null,null,null,null,null,null,null,null,null,null,null,null,null,null,null,null,null,null,null,null,{"$f":"IF(OR(Tc_R_Pre>60, Tc_R_Pre<5), \"Error\", IF(AND(Tc_R_Pre>=5,Tc_R_Pre<=10),AO53, IF(AND(Tc_R_Pre>10,Tc_R_Pre<=15), AO54, IF(AND(Tc_R_Pre>15, Tc_R_Pre<=30), AO55, IF(AND(Tc_R_Pre>30, Tc_R_Pre<=60), AO56, VLOOKUP(Tc_R_Pre, INDIRECT(Name_R), 2))))))","v":"Error"},{"$f":"IF(OR(Tc_R_Pre>60, Tc_R_Pre<5), \"Error\", IF(AND(Tc_R_Pre>=5,Tc_R_Pre<=10),AP53, IF(AND(Tc_R_Pre>10,Tc_R_Pre<=15), AP54, IF(AND(Tc_R_Pre>15, Tc_R_Pre<=30), AP55, IF(AND(Tc_R_Pre>30, Tc_R_Pre<=60), AP56, VLOOKUP(Tc_R_Pre, INDIRECT(Name_R), 2))))))","v":"Error"},"Error","Error","Error","Error"]
[null,null,null,null,null,null,null,null,null,null,null,null,null,null,null,null,null,null,"NUMBER OF OUTLET PHOTO PAGES",null,1,null,null,null,null,null,null,null,"Applies?","Which case is it?",null,"non-soil"]
[null,null,null,null,null,null,null,null,null,null,null,null,null,null,null,null,null,null,null,null,null,null,null,null,null,null,null,"Case 1",{"$f":"IF(AND(OR(F30=\"None\",F30=\"Potential\"),AB46=\"Decrease\",AB51=\"NO\"),\"YES\",\"\")","v":""},{"$f":"IF(AC60<>\"\",AB60,IF(AC61<>\"\",AB61,IF(AC62<>\"\",AB62,IF(AC63<>\"\",AB63,IF(AC64<>\"\",AB64,IF(AC65<>\"\",AB65,IF(AC66<>\"\",AB66,IF(AC67<>\"\",AB67,IF(AC68<>\"\",AB68,IF(AC69<>\"\",AB69,\"\"))))))))))","v":""}]
[null,null,null,null,null,null,null,null,null,null,null,null,null,null,null,null,null,null,null,null,null,null,null,null,null,null,null,"Case 1A",{"$f":"IF(AND(OR(F30=\"Existing\",F30=\"Both\"),AB46=\"Decrease\",AB51=\"NO\"),\"YES\",\"\")","v":""}]
[null,null,null,null,null,null,null,null,null,null,null,null,null,null,null,null,null,null,null,null,null,null,null,null,null,null,null,"Case 2",{"$f":"IF(AND(OR(F30=\"None\",F30=\"Potential\"),AB46=\"Decrease\",AB51=\"YES\"),\"YES\",\"\")","v":""},null,null,{"$f":"IF(AD60=\"\",\"\",\"Non-Soil, see Note 1 & 2 of Case Table\")","v":""}]
[null,null,null,null,null,null,null,null,null,null,null,null,null,null,null,null,null,null,null,null,null,null,null,null,null,null,null,"Case 2A",{"$f":"IF(AND(OR(F30=\"Existing\",F30=\"Both\"),AB46=\"Decrease\",AB51=\"YES\"),\"YES\",\"\")","v":""},null,null,null,null,null,null,null,null,null,null,"pre-const geometry type"]
[null,null,null,null,null,null,null,null,null,null,null,null,null,null,null,null,null,null,null,null,null,null,null,null,null,null,null,"Case 3",{"$f":"IF(AND(OR(F30=\"None\",F30=\"Potential\"),AB46=\"Increase\",AB51=\"NO\"),\"YES\",\"\")","v":""}]
[null,null,null,null,null,null,null,null,null,null,null,null,null,null,null,null,null,null,null,null,null,null,null,null,null,null,null,"Case 3A",{"$f":"IF(AND(OR(F30=\"Existing\",F30=\"Both\"),AB46=\"Increase\",AB51=\"NO\"),\"YES\",\"\")","v":""},null,null,null,null,null,null,null,null,null,null,"post-const geometry type",null,null,null,"railroad design?"]
[null,null,null,null,null,null,null,null,null,null,null,null,null,null,null,null,null,null,null,null,null,null,null,null,null,null,null,"Case 4",{"$f":"IF(AND(OR(F30=\"None\",F30=\"Potential\"),AB46=\"Increase\",AB51=\"YES\",O17<=0.1),\"YES\",\"\")","v":""}]
[null,null,null,null,null,null,null,null,null,null,null,null,null,null,null,null,null,null,null,null,null,null,null,null,null,null,null,"Case 4A",{"$f":"IF(AND(OR(F30=\"Existing\",F30=\"Both\"),AB46=\"Increase\",AB51=\"YES\",O17<=0.1),\"YES\",\"\")","v":""}]
[null,null,null,null,null,null,null,null,null,null,null,null,null,null,null,null,null,null,null,null,null,null,null,null,null,null,null,"Case 5",{"$f":"IF(AND(OR(F30=\"None\",F30=\"Potential\"),AB46=\"Increase\",AB51=\"YES\",O17>0.1),\"YES\",\"\")","v":""}]
[null,null,null,null,null,null,null,null,null,null,null,null,null,null,null,null,null,null,null,null,null,null,null,null,null,null,null,"Case 5A",{"$f":"IF(AND(OR(F30=\"Existing\",F30=\"Both\"),AB46=\"Increase\",AB51=\"YES\",O17>0.1),\"YES\",\"\")","v":""},null,null,null,null,null,null,null,null,null,"POST"]
[null,null,null,null,null,null,null,null,null,null,null,null,null,null,null,null,null,null,null,null,null,null,null,null,null,null,null,null,null,null,null,null,null,null,null,null,null,null,null,"Intensity Calcs"]
[]
["OUTLET SITE PHOTOS PAGE 1",null,null,null,null,null,null,null,null,null,null,null,null,null,null,null,null,null,null,null,null,null,null,null,null,null,null,null,null,null,null,null,null,null,null,null,null,null,null,null,2,5,10,25,50,100]
[null,null,null,null,null,null,null,null,null,null,null,null,null,null,null,null,null,null,null,null,null,null,null,null,null,null,null,null,null,null,null,null,null,null,null,null,null,null,null,{"$f":"IF(custom_IDF=\"YES\",INDIRECT(\"Z_CUSTOM_IDF\"),IF(county_for_this_outlet=\"New Hanover\", INDIRECT(\"NewHanover\"),INDIRECT(county_for_this_outlet)))","v":{"$error":"#REF!"}}]
["Photo Description Here",null,null,null,null,null,null,null,"Photo Description Here"]
[]
[]
[]
[]
[]
[]
[null,null,null,null,null,null,null,null,null,null,null,null,null,null,null,null,null,null,null,null,null,null,null,null,null,null,null,null,null,null,null,null,null,null,null,null,null,null,null,"5-10",{"$f":"_xlfn.FORECAST.LINEAR(Tc_R_Post,AO73:AO74,$AN73:$AN74)","v":{"$error":"#REF!"}},{"$error":"#REF!"},{"$error":"#REF!"},{"$error":"#REF!"},{"$error":"#REF!"},{"$error":"#REF!"}]
[null,null,null,null,null,null,null,null,null,null,null,null,null,null,null,null,null,null,null,null,null,null,null,null,null,null,null,null,null,null,null,null,null,null,null,null,null,null,null,"10-15",{"$error":"#DIV/0!"},{"$error":"#DIV/0!"},{"$error":"#DIV/0!"},{"$error":"#DIV/0!"},{"$error":"#DIV/0!"},{"$error":"#DIV/0!"}]
[null,null,null,null,null,null,null,null,null,null,null,null,null,null,null,null,null,null,null,null,null,null,null,null,null,null,null,null,null,null,null,null,null,null,null,null,null,null,null,"15-30",{"$error":"#DIV/0!"},{"$error":"#DIV/0!"},{"$error":"#DIV/0!"},{"$error":"#DIV/0!"},{"$error":"#DIV/0!"},{"$error":"#DIV/0!"}]
[null,null,null,null,null,null,null,null,null,null,null,null,null,null,null,null,null,null,null,null,null,null,null,null,null,null,null,null,null,null,null,null,null,null,null,null,null,null,null,"30-60",{"$error":"#DIV/0!"},{"$error":"#DIV/0!"},{"$error":"#DIV/0!"},{"$error":"#DIV/0!"},{"$error":"#DIV/0!"},{"$error":"#DIV/0!"}]
[]
[null,null,null,null,null,null,null,null,null,null,null,null,null,null,null,null,null,null,null,null,null,null,null,null,null,null,null,null,null,null,null,null,null,null,null,null,null,null,null,null,{"$f":"IF(OR(Tc_R_Post>60, Tc_R_Post<5), \"Error\", IF(AND(Tc_R_Post>=5,Tc_R_Post<=10),AO81, IF(AND(Tc_R_Post>10, Tc_R_Post<=15), AO82, IF(AND(Tc_R_Post>15, Tc_R_Post<=30), AO83, IF(AND(Tc_R_Post>30, Tc_R_Post<=60), AO84, VLOOKUP(Tc_R_Post, INDIRECT(Name_R), 2))))))","v":"Error"},"Error","Error","Error","Error","Error"]
[]
[]
[null,null,null,null,null,null,null,null,null,null,null,null,null,null,null,null,null,null,null,null,null,null,null,null,null,null,null,null,null,null,null,null,null,null,null,null,null,null,null,null,null,null,null,null,null,null,null,null,null,null,null,null,null,null,"template for 1 page of photos just copies the formatting from this cell below"]
[null,null,null,null,null,null,null,null,null,null,null,null,null,null,null,null,null,null,null,null,null,null,null,null,null,null,null,null,null,null,null,null,null,null,null,null,null,null,null,null,null,null,null,null,null,null,null,null,null,null,null,null,null,"---->"]
[]
[]
[]
[]
[]
[null,null,null,null,null,null,null,null,null,null,null,null,null,null,null,null,null,null,null,null,null,null,null,null,null,null,null,null,null,null,null,null,null,null,null,null,null,null,null,null,null,null,null,null,null,null,null,null,null,null,null,null,null,null,"TEMPLATE FOR 2 PHOTO PAGES",null,null,null,null,null,null,null,null,null,null,null,null,null,null,null,null,null,"TEMPLATE FOR 3 PHOTO PAGES",null,null,null,null,null,null,null,null,null,null,null,null,null,null,null,null,null,"TEMPLATE FOR 4 PHOTO PAGES",null,null,null,null,null,null,null,null,null,null,null,null,null,null,null,null,null,"TEMPLATE FOR 5 PHOTO PAGES"]
[{"$f":"_xlfn.CONCAT( _xlnm.sheet_title,\" SITE PHOTOS - PAGE 2\")","v":"PSH # OUTLET # SITE PHOTOS - PAGE 2"},null,null,null,null,null,null,null,null,null,null,null,null,null,null,null,null,null,null,null,null,null,null,null,null,null,null,null,null,null,null,null,null,null,null,null,null,null,null,null,null,null,null,null,null,null,null,null,null,null,null,null,null,null,"OUTLET SITE PHOTOS PAGE 2",null,null,null,null,null,null,null,null,null,null,null,null,null,null,null,null,null,"OUTLET SITE PHOTOS PAGE 2",null,null,null,null,null,null,null,null,null,null,null,null,null,null,null,null,null,"OUTLET SITE PHOTOS PAGE 2",null,null,null,null,null,null,null,null,null,null,null,null,null,null,null,null,null,"OUTLET SITE PHOTOS PAGE 2"]
["Photo Description Here",null,null,null,null,null,null,null,"Photo Description Here",null,null,null,null,null,null,null,null,null,null,null,null,null,null,null,null,null,null,null,null,null,null,null,null,null,null,null,null,null,null,null,null,null,null,null,null,null,null,null,null,null,null,null,null,null,"Photo Description Here",null,null,null,null,null,null,null,"Photo Description Here",null,null,null,null,null,null,null,null,null,"Photo Description Here",null,null,null,null,null,null,null,"Photo Description Here",null,null,null,null,null,null,null,null,null,"Photo Description Here",null,null,null,null,null,null,null,"Photo Description Here",null,null,null,null,null,null,null,null,null,"Photo Description Here",null,null,null,null,null,null,null,"Photo Description Here"]
[]
[]
[]
[null,null,null,null,null,null,null,null,null,null,null,null,null,null,null,null,null,null,null,null,null,null,null,null,null,null,null,null,null,null,null,null,null,null,null,null,null,null,null,{"$f":"INDIRECT(New_Hanover)","v":{"$error":"#NAME?"}}]
[]
[]
[null,null,null,null,null,null,null,null,null,null,null,null,null,null,null,null,null,null,null,null,null,null,null,null,null,null,null,null,null,null,null,null,null,null,"hidden da and c pre field values for this sheet",null,null,null,"hidden da and c post field values for this sheet"]
[]
[null,null,null,null,null,null,null,null,null,null,null,null,null,null,null,null,null,null,null,null,null,null,null,null,null,null,null,null,null,null,null,null,null,null,"0.00",0.9,null,null,"0.00",0.9]
[null,null,null,null,null,null,null,null,null,null,null,null,null,null,null,null,null,null,null,null,null,null,null,null,null,null,null,null,null,null,null,null,null,null,"0.00",null,null,null,"0.00"]
[null,null,null,null,null,null,null,null,null,null,null,null,null,null,null,null,null,null,null,null,null,null,null,null,null,null,null,null,null,null,null,null,null,null,"0.00",0.3,null,null,"0.00",0.3]
[null,null,null,null,null,null,null,null,null,null,null,null,null,null,null,null,null,null,null,null,null,null,null,null,null,null,null,null,null,null,null,null,null,null,"0.00",null,null,null,"0.00"]
[null,null,null,null,null,null,null,null,null,null,null,null,null,null,null,null,null,null,null,null,null,null,null,null,null,null,null,null,null,null,null,null,null,null,"0.00",0.2,null,null,"0.00",0.2]
[null,null,null,null,null,null,null,null,null,null,null,null,null,null,null,null,null,null,null,null,null,null,null,null,null,null,null,null,null,null,null,null,null,null,"0.00",null,null,null,"0.00"]
[null,null,null,null,null,null,null,null,null,null,null,null,null,null,null,null,null,null,null,null,null,null,null,null,null,null,null,null,null,null,null,null,null,null,"0.00",0,null,null,"0.00",0]
["Photo Description Here",null,null,null,null,null,null,null,"Photo Description Here",null,null,null,null,null,null,null,null,null,null,null,null,null,null,null,null,null,null,null,null,null,null,null,null,null,"0.00",null,null,null,"0.00",null,null,null,null,null,null,null,null,null,null,null,null,null,null,null,"Photo Description Here",null,null,null,null,null,null,null,"Photo Description Here",null,null,null,null,null,null,null,null,null,"Photo Description Here",null,null,null,null,null,null,null,"Photo Description Here",null,null,null,null,null,null,null,null,null,"Photo Description Here",null,null,null,null,null,null,null,"Photo Description Here",null,null,null,null,null,null,null,null,null,"Photo Description Here",null,null,null,null,null,null,null,"Photo Description Here"]
[null,null,null,null,null,null,null,null,null,null,null,null,null,null,null,null,null,null,null,null,null,null,null,null,null,null,null,null,null,null,null,null,null,null,"0.00",0,null,null,"0.00",0]
[null,null,null,null,null,null,null,null,null,null,null,null,null,null,null,null,null,null,null,null,null,null,null,null,null,null,null,null,null,null,null,null,null,null,"0.00",null,null,null,"0.00"]
[null,null,null,null,null,null,null,null,null,null,null,null,null,null,null,null,null,null,null,null,null,null,null,null,null,null,null,null,null,null,null,null,null,null,"0.00",0,null,null,"0.00",0]
[null,null,null,null,null,null,null,null,null,null,null,null,null,null,null,null,null,null,null,null,null,null,null,null,null,null,null,null,null,null,null,null,null,null,"0.00",null,null,null,"0.00"]
[]
[]
[]
[]
[]
[]
[]
[]
[]
[]
[]
[]
[{"$f":"_xlfn.CONCAT( _xlnm.sheet_title,\" SITE PHOTOS - PAGE 3\")","v":"PSH # OUTLET # SITE PHOTOS - PAGE 3"},null,null,null,null,null,null,null,null,null,null,null,null,null,null,null,null,null,null,null,null,null,null,null,null,null,null,null,null,null,null,null,null,null,null,null,null,null,null,null,null,null,null,null,null,null,null,null,null,null,null,null,null,null,null,null,null,null,null,null,null,null,null,null,null,null,null,null,null,null,null,null,"OUTLET SITE PHOTOS PAGE 3",null,null,null,null,null,null,null,null,null,null,null,null,null,null,null,null,null,"OUTLET SITE PHOTOS PAGE 3",null,null,null,null,null,null,null,null,null,null,null,null,null,null,null,null,null,"OUTLET SITE PHOTOS PAGE 3"]
["Photo Description Here",null,null,null,null,null,null,null,"Photo Description Here",null,null,null,null,null,null,null,null,null,null,null,null,null,null,null,null,null,null,null,null,null,null,null,null,null,null,null,null,null,null,null,null,null,null,null,null,null,null,null,null,null,null,null,null,null,null,null,null,null,null,null,null,null,null,null,null,null,null,null,null,null,null,null,"Photo Description Here",null,null,null,null,null,null,null,"Photo Description Here",null,null,null,null,null,null,null,null,null,"Photo Description Here",null,null,null,null,null,null,null,"Photo Description Here",null,null,null,null,null,null,null,null,null,"Photo Description Here",null,null,null,null,null,null,null,"Photo Description Here"]
[]
[]
[]
[]
[]
[]
[]
[]
[]
[]
[]
[]
[]
[]
[]
["Photo Description Here",null,null,null,null,null,null,null,"Photo Description Here",null,null,null,null,null,null,null,null,null,null,null,null,null,null,null,null,null,null,null,null,null,null,null,null,null,null,null,null,null,null,null,null,null,null,null,null,null,null,null,null,null,null,null,null,null,null,null,null,null,null,null,null,null,null,null,null,null,null,null,null,null,null,null,"Photo Description Here",null,null,null,null,null,null,null,"Photo Description Here",null,null,null,null,null,null,null,null,null,"Photo Description Here",null,null,null,null,null,null,null,"Photo Description Here",null,null,null,null,null,null,null,null,null,"Photo Description Here",null,null,null,null,null,null,null,"Photo Description Here"]
[]
[]
[]
[]
[]
[]
[]
[]
[]
[]
[]
[]
[]
[]
[]
[]
[{"$f":"_xlfn.CONCAT( _xlnm.sheet_title,\" SITE PHOTOS - PAGE 4\")","v":"PSH # OUTLET # SITE PHOTOS - PAGE 4"},null,null,null,null,null,null,null,null,null,null,null,null,null,null,null,null,null,null,null,null,null,null,null,null,null,null,null,null,null,null,null,null,null,null,null,null,null,null,null,null,null,null,null,null,null,null,null,null,null,null,null,null,null,null,null,null,null,null,null,null,null,null,null,null,null,null,null,null,null,null,null,null,null,null,null,null,null,null,null,null,null,null,null,null,null,null,null,null,null,"OUTLET SITE PHOTOS PAGE 4",null,null,null,null,null,null,null,null,null,null,null,null,null,null,null,null,null,"OUTLET SITE PHOTOS PAGE 4"]
["Photo Description Here",null,null,null,null,null,null,null,"Photo Description Here",null,null,null,null,null,null,null,null,null,null,null,null,null,null,null,null,null,null,null,null,null,null,null,null,null,null,null,null,null,null,null,null,null,null,null,null,null,null,null,null,null,null,null,null,null,null,null,null,null,null,null,null,null,null,null,null,null,null,null,null,null,null,null,null,null,null,null,null,null,null,null,null,null,null,null,null,null,null,null,null,null,"Photo Description Here",null,null,null,null,null,null,null,"Photo Description Here",null,null,null,null,null,null,null,null,null,"Photo Description Here",null,null,null,null,null,null,null,"Photo Description Here"]
[]
[]
[]
[]
[]
[]
[]
[]
[]
[]
[]
[]
[]
[]
[]
["Photo Description Here",null,null,null,null,null,null,null,"Photo Description Here",null,null,null,null,null,null,null,null,null,null,null,null,null,null,null,null,null,null,null,null,null,null,null,null,null,null,null,null,null,null,null,null,null,null,null,null,null,null,null,null,null,null,null,null,null,null,null,null,null,null,null,null,null,null,null,null,null,null,null,null,null,null,null,null,null,null,null,null,null,null,null,null,null,null,null,null,null,null,null,null,null,"Photo Description Here",null,null,null,null,null,null,null,"Photo Description Here",null,null,null,null,null,null,null,null,null,"Photo Description Here",null,null,null,null,null,null,null,"Photo Description Here"]
[]
[]
[]
[]
[]
[]
[]
[]
[]
[]
[]
[]
[]
[]
[]
[]
[{"$f":"_xlfn.CONCAT( _xlnm.sheet_title,\" SITE PHOTOS - PAGE 5\")","v":"PSH # OUTLET # SITE PHOTOS - PAGE 5"},null,null,null,null,null,null,null,null,null,null,null,null,null,null,null,null,null,null,null,null,null,null,null,null,null,null,null,null,null,null,null,null,null,null,null,null,null,null,null,null,null,null,null,null,null,null,null,null,null,null,null,null,null,null,null,null,null,null,null,null,null,null,null,null,null,null,null,null,null,null,null,null,null,null,null,null,null,null,null,null,null,null,null,null,null,null,null,null,null,null,null,null,null,null,null,null,null,null,null,null,null,null,null,null,null,null,null,"OUTLET SITE PHOTOS PAGE 5"]
["Photo Description Here",null,null,null,null,null,null,null,"Photo Description Here",null,null,null,null,null,null,null,null,null,null,null,null,null,null,null,null,null,null,null,null,null,null,null,null,null,null,null,null,null,null,null,null,null,null,null,null,null,null,null,null,null,null,null,null,null,null,null,null,null,null,null,null,null,null,null,null,null,null,null,null,null,null,null,null,null,null,null,null,null,null,null,null,null,null,null,null,null,null,null,null,null,null,null,null,null,null,null,null,null,null,null,null,null,null,null,null,null,null,null,"Photo Description Here",null,null,null,null,null,null,null,"Photo Description Here"]
[]
[]
[]
[]
[]
[]
[]
[]
[]
[]
[]
[]
[]
[]
[]
["Photo Description Here",null,null,null,null,null,null,null,"Photo Description Here",null,null,null,null,null,null,null,null,null,null,null,null,null,null,null,null,null,null,null,null,null,null,null,null,null,null,null,null,null,null,null,null,null,null,null,null,null,null,null,null,null,null,null,null,null,null,null,null,null,null,null,null,null,null,null,null,null,null,null,null,null,null,null,null,null,null,null,null,null,null,null,null,null,null,null,null,null,null,null,null,null,null,null,null,null,null,null,null,null,null,null,null,null,null,null,null,null,null,null,"Photo Description Here",null,null,null,null,null,null,null,"Photo Description Here"]
[]
[]
[]
[]
[]
[]
[]
[]
[]
[]
[]
[]
[]
[]
[]
[]
[]
[]
[{"$f":"_xlfn.CONCAT(\"ADDITIONAL INFORMATION - LAND USE BREAKDOWN SUMMARY - \",_xlnm.sheet_title)","v":"ADDITIONAL INFORMATION - LAND USE BREAKDOWN SUMMARY - PSH # OUTLET #"}]
[]
["PRE-CONSTRUCTION",null,null,null,null,null,null,null,"POST-CONSTRUCTION"]
[]
["LAND USE",null,"C-VALUE",null,null,"ACRES",null,null,"LAND USE",null,null,"C-VALUE",null,null,"ACRES"]
["IMPERVIOUS AREA WITHIN RIGHT OF WAY / EASEMENT / NCDOT CONTRIBUTION",null,{"$f":"VALUE(c_imp_pre_field)","v":0.9},null,null,{"$f":"IF(VALUE(da_imp_onsite_pre_field)=0,\"-\",VALUE(da_imp_onsite_pre_field))","v":"-"},null,null,"IMPERVIOUS AREA WITHIN RIGHT OF WAY / EASEMENT / NCDOT CONTRIBUTION (ACRES)",null,null,{"$f":"VALUE(c_imp_post_field)","v":0.9},null,null,{"$f":"IF(VALUE(da_imp_onsite_post_field)=0,\"-\",VALUE(da_imp_onsite_post_field))","v":"-"}]
[]
[]
["IMPERVIOUS AREA OUTSIDE RIGHT OF WAY / EASEMENT (ACRES)",null,null,null,null,{"$f":"IF(VALUE(da_imp_offsite_pre_field)=0,\"-\",VALUE(da_imp_offsite_pre_field))","v":"-"},null,null,"IMPERVIOUS AREA OUTSIDE RIGHT OF WAY / EASEMENT (ACRES)",null,null,null,null,null,{"$f":"IF(VALUE(da_imp_offsite_post_field)=0,\"-\",VALUE(da_imp_offsite_post_field))","v":"-"}]
[]
[]
["GRASS AREA WITHIN RIGHT OF WAY / EASEMENT / NCDOT CONTRIBUTION (ACRES)",null,{"$f":"VALUE(c_grass_pre_field)","v":0.3},null,null,{"$f":"IF(VALUE(da_grass_onsite_pre_field)=0,\"-\",VALUE(da_grass_onsite_pre_field))","v":"-"},null,null,"GRASS AREA WITHIN RIGHT OF WAY / EASEMENT / NCDOT CONTRIBUTION (ACRES)",null,null,{"$f":"VALUE(c_grass_post_field)","v":0.3},null,null,{"$f":"IF(VALUE(da_grass_onsite_post_field)=0,\"-\",VALUE(da_grass_onsite_post_field))","v":"-"}]
[]
[]
["GRASS AREA OUTSIDE RIGHT OF WAY / EASEMENT (ACRES)",null,null,null,null,{"$f":"IF(VALUE(da_grass_offsite_pre_field)=0,\"-\",VALUE(da_grass_offsite_pre_field))","v":"-"},null,null,"GRASS AREA OUTSIDE RIGHT OF WAY / EASEMENT (ACRES)",null,null,null,null,null,{"$f":"IF(VALUE(da_grass_offsite_post_field)=0,\"-\",VALUE(da_grass_offsite_post_field))","v":"-"}]
[]
[]
["WOODS AREA WITHIN RIGHT OF WAY / EASEMENT / NCDOT CONTRIBUTION (ACRES)",null,{"$f":"VALUE(c_woods_pre_field)","v":0.2},null,null,{"$f":"IF(VALUE(da_woods_onsite_pre_field)=0,\"-\",VALUE(da_woods_onsite_pre_field))","v":"-"},null,null,"WOODS AREA WITHIN RIGHT OF WAY / EASEMENT / NCDOT CONTRIBUTION (ACRES)",null,null,{"$f":"VALUE(c_woods_post_field)","v":0.2},null,null,{"$f":"IF(VALUE(da_woods_onsite_post_field)=0,\"-\",VALUE(da_woods_onsite_post_field))","v":"-"}]
[]
[]
["WOODS AREA OUTSIDE RIGHT OF WAY / EASEMENT (ACRES)",null,null,null,null,{"$f":"IF(VALUE(da_woods_offsite_pre_field)=0,\"-\",VALUE(da_woods_offsite_pre_field))","v":"-"},null,null,"WOODS AREA OUTSIDE RIGHT OF WAY / EASEMENT (ACRES)",null,null,null,null,null,{"$f":"IF(VALUE(da_woods_offsite_post_field)=0,\"-\",VALUE(da_woods_offsite_post_field))","v":"-"}]
[]
[]
["OTHER LAND USE #1 WITHIN RIGHT OF WAY / EASEMENT / NCDOT CONTRIBUTION (ACRES)",null,{"$f":"IF(VALUE(c_other1_pre_field)=0,\"-\",VALUE(c_other1_pre_field))","v":"-"},null,null,{"$f":"IF(VALUE(da_other1_onsite_pre_field)=0,\"-\",VALUE(da_other1_onsite_pre_field))","v":"-"},null,null,"OTHER LAND USE #1 WITHIN RIGHT OF WAY / EASEMENT / NCDOT CONTRIBUTION (ACRES)",null,null,{"$f":"IF(VALUE(c_other1_post_field)=0,\"-\",VALUE(c_other1_post_field))","v":"-"},null,null,{"$f":"IF(VALUE(da_other1_onsite_post_field)=0,\"-\",VALUE(da_other1_onsite_post_field))","v":"-"}]
[]
[]
["OTHER LAND USE #1 OUTSIDE RIGHT OF WAY / EASEMENT (ACRES)",null,null,null,null,{"$f":"IF(VALUE(da_other1_offsite_pre_field)=0,\"-\",VALUE(da_other1_offsite_pre_field))","v":"-"},null,null,"OTHER LAND USE #1 OUTSIDE RIGHT OF WAY / EASEMENT (ACRES)",null,null,null,null,null,{"$f":"IF(VALUE(da_other1_offsite_post_field)=0,\"-\",VALUE(da_other1_offsite_post_field))","v":"-"}]
[]
[]
["OTHER LAND USE #2 WITHIN RIGHT OF WAY / EASEMENT / NCDOT CONTRIBUTION (ACRES)",null,{"$f":"IF(VALUE(c_other2_pre_field)=0,\"-\",VALUE(c_other2_pre_field))","v":"-"},null,null,{"$f":"IF(VALUE(da_other2_onsite_pre_field)=0,\"-\",VALUE(da_other2_onsite_pre_field))","v":"-"},null,null,"OTHER LAND USE #1 WITHIN RIGHT OF WAY / EASEMENT / NCDOT CONTRIBUTION (ACRES)",null,null,{"$f":"IF(VALUE(c_other2_post_field)=0,\"-\",VALUE(c_other2_post_field))","v":"-"},null,null,{"$f":"IF(VALUE(da_other2_onsite_post_field)=0,\"-\",VALUE(da_other2_onsite_post_field))","v":"-"}]
[]
[]
["OTHER LAND USE #2 OUTSIDE RIGHT OF WAY / EASEMENT (ACRES)",null,null,null,null,{"$f":"IF(VALUE(da_other2_offsite_pre_field)=0,\"-\",VALUE(da_other2_offsite_pre_field))","v":"-"},null,null,"OTHER LAND USE #1 OUTSIDE RIGHT OF WAY / EASEMENT (ACRES)",null,null,null,null,null,{"$f":"IF(VALUE(da_other2_offsite_post_field)=0,\"-\",VALUE(da_other2_offsite_post_field))","v":"-"}]
[]
[]
["OTHER LAND USE #3 WITHIN RIGHT OF WAY / EASEMENT / NCDOT CONTRIBUTION (ACRES)",null,{"$f":"IF(VALUE(c_other3_pre_field)=0,\"-\",VALUE(c_other3_pre_field))","v":"-"},null,null,{"$f":"IF(VALUE(da_other3_onsite_pre_field)=0,\"-\",VALUE(da_other3_onsite_pre_field))","v":"-"},null,null,"OTHER LAND USE #1 WITHIN RIGHT OF WAY / EASEMENT / NCDOT CONTRIBUTION (ACRES)",null,null,{"$f":"IF(VALUE(c_other3_post_field)=0,\"-\",VALUE(c_other3_post_field))","v":"-"},null,null,{"$f":"IF(VALUE(da_other3_onsite_post_field)=0,\"-\",VALUE(da_other3_onsite_post_field))","v":"-"}]
[]
[]
["OTHER LAND USE #3 OUTSIDE RIGHT OF WAY / EASEMENT (ACRES)",null,null,null,null,{"$f":"IF(VALUE(da_other3_offsite_pre_field)=0,\"-\",VALUE(da_other3_offsite_pre_field))","v":"-"},null,null,"OTHER LAND USE #1 OUTSIDE RIGHT OF WAY / EASEMENT (ACRES)",null,null,null,null,null,{"$f":"IF(VALUE(da_other3_offsite_post_field)=0,\"-\",VALUE(da_other3_offsite_post_field))","v":"-"}]
[]
[]
[null,null,null,null,null,null,null,null,null,null,null,null,null,null,null,null,null,null,null,null,null,null,null,null,null,null,null,null,null,null,null,null,null,null,"τ10 Post = "]
[]
[]
["ROWS HOLDING CELL DATA BELOW TO BE HIDDEN (CELLS HOLD DATA+FORMATTING FOR MACROS AND CALCULATIONS)"]
[]
[]
["hidden formatting for triangular / trapezoidal macros DO NOT TOUCH",null,null,null,null,null,null,null,"hidden formatting for triangular / trapezoidal macros DO NOT TOUCH"]
["Depth (ft) =",null,null,null,"H:V (Lt) = ",null,null,null,"Depth (ft) =",null,"H:V (Lt) ="]
["Slope (ft/ft) = ",null,null,null,"H:V (Rt) = ",null,null,null,"Slope (ft/ft) = ",null,"H:V (Rt) ="]
["Manning's N =",null,null,null,"Base Width (ft.) =",0,null,null,"Manning's N =",null,"Base Width ="]
["Notes (lining, condition, etc.): ",null,null,null,null,null,null,null,"Notes (lining, condition, etc.): "]
[]
[]
[]
[]
[]
["hidden formatting for irregular channel macro DO NOT TOUCH",null,null,null,null,null,null,null,"hidden formatting for irregular channel macro DO NOT TOUCH"]
[]
[{"$f":"IF(AND($J$30<>\"\",Post_Const_Geometry_Selection=\"Geometry Same as Pre-Construction\"),\"Slope (ft/ft) = \",\"\")","v":""},null,null,null,null,null,null,null,{"$f":"IF($J$30<>\"\",\"Slope (ft/ft) = \",\"\")","v":""}]
["Notes:",null,null,null,null,null,null,null,"Notes:"]
[]
[]
[]
[]
[]
["hidden formatting for pipe macros DO NOT TOUCH",null,null,null,null,null,null,null,"hidden formatting for pipe macros DO NOT TOUCH",null,null,null,null,null,null,null,null,null,null,"hidden formatting for blank DO NOT TOUCH"]
["Diameter (in) =",null,null,null,"QCapacity (cfs) =",{"$f":"IF(OR(B302=\"\",B303=\"\"),\"\",IFERROR(MIN((SQRT(B303)/D304)*((B302/16)^(8/3)),VLOOKUP(B302,'PICK LISTS'!$E$44:$F$54,2,FALSE)),(SQRT(B303)/D304)*((B302/16)^(8/3))))","v":""},null,null,"Diameter (in) =",null,null,"QCapacity (cfs) = ",null,{"$f":"IF(OR(J302=\"\",J303=\"\"),\"\",IFERROR(MIN((SQRT(J303)/K304)*((J302/16)^(8/3)),VLOOKUP(J302,'PICK LISTS'!$E$44:$F$54,2,FALSE)),(SQRT(J303)/K304)*((J302/16)^(8/3))))","v":""},{"$f":"IF(OR(N302=\"\",N303=\"\"),\"\",IF(N303>N302,\"NOTE: Q10 > Qfull\",\"Q10 < Qfull\"))","v":""},null,null,null,null,"Notes:"]
["Slope (ft/ft) = ",null,null,null,"Q10pre (cfs) =",{"$f":"$E$16","v":""},null,null,"Slope (ft/ft) = ",null,null,"Q10 Post (cfs) = ",null,{"$f":"$K$16","v":""}]
["Pipe Material =","RCP",null,{"$f":"VLOOKUP(B304,'PICK LISTS'!$E$29:$F$33, 2,FALSE)","v":1.2E-2},null,null,null,null,"Pipe Material =","RCP",{"$f":"VLOOKUP(J304,'PICK LISTS'!$E$29:$F$33, 2,FALSE)","v":1.2E-2}]
["Notes:",null,null,null,null,null,null,null,"Notes:"]
[]
[]
[]
[]
[null,null,null,null,null,null,null,null,"hidden formatting for same as pre const. ds rec pipe macro DO NOT TOUCH"]
[]
[null,null,null,null,null,null,null,null,null,null,"Qfull (cfs) = ",{"$f":"F311","v":0},null,{"$f":"IF(OR(L312=\"\",L313=\"\"),\"\",IF(L313>L312,\"NOTE: Q10 > Qfull\",\"Q10 < Qfull\"))","v":""}]
[null,null,null,null,null,null,null,null,null,null,"Q10 Post (cfs) = ",{"$f":"IF($K$16=0,\"\",$K$16)","v":""}]
[]
[]
[]
[]
[]
[]
[]
["SOIL TYPE"]
[]
["LINER TYPE"]
[]
[]
[]
[null,{"$f":"IF($I$30=\"N/A\",\"N/A\",IF(Soil_Type=\"Permanent Matting Product (stable)\",\"User to Define\",IF($J$30<>\"\",\"N/A\",IF($I$30=\"Soil\",$AD$41,IF($I$30=\"Non-Soil\",$AD$43,\"\")))))","v":""}]
[null,{"$f":"IF($A$34=\"SOIL TYPE\",\"N/A\",IF(Soil_Type=\"Grass / Dense Veg. (no bare soil spots)\",\"N/A\",IF($J$30<>\"\",$AD$43,\"\")))","v":""}]

{"sheet":"TR-55 TAB TEMPLATE","index":4,"n_rows":328,"n_cols":117,"rows_kept":328,"cut":false,"hidden":true,"merged":[[18,1,19,1],[18,8,19,8],[322,1,322,4],[301,14,303,15],[301,19,305,24],[304,0,305,5],[304,8,305,15],[311,13,313,14],[320,1,320,4],[283,10,283,12],[284,10,284,12],[285,0,286,5],[285,8,286,15],[294,0,296,5],[294,8,296,15],[215,0,231,7],[215,8,231,16],[181,0,197,7],[181,8,197,16],[38,0,38,5],[38,8,38,15],[40,0,41,5],[130,0,130,16],[40,8,41,14],[215,108,231,115],[215,116,231,124],[278,0,280,24],[282,10,282,12],[198,0,198,16],[198,108,198,124],[199,0,214,7],[199,8,214,16],[199,108,214,115],[199,116,214,124],[234,0,234,16],[236,0,236,7],[236,8,236,16],[238,5,238,7],[238,14,238,16],[239,5,241,7],[239,14,241,16],[242,5,244,7],[242,14,244,16],[245,5,247,7],[245,14,247,16],[248,5,250,7],[248,14,250,16],[260,5,262,7],[181,90,197,97],[181,98,197,106],[181,108,197,115],[181,116,197,124],[164,0,164,16],[164,90,164,106],[164,108,164,124],[165,0,180,7],[165,8,180,16],[165,90,180,97],[165,98,180,106],[165,108,180,115],[165,116,180,124],[130,72,130,88],[130,90,130,106],[130,108,130,124],[131,108,146,115],[131,116,146,124],[147,0,163,7],[147,8,163,16],[147,72,163,79],[147,80,163,88],[147,90,163,97],[147,98,163,106],[147,108,163,115],[147,116,163,124],[131,0,146,7],[131,8,146,16],[131,72,146,79],[131,80,146,88],[131,90,146,97],[131,98,146,106],[97,90,112,97],[97,98,112,106],[97,108,112,115],[97,116,112,124],[104,34,105,34],[113,0,129,7],[113,8,129,16],[113,54,129,61],[113,62,129,70],[113,72,129,79],[97,0,112,7],[97,8,112,16],[97,54,112,61],[97,62,112,70],[97,72,112,79],[97,80,112,88],[113,80,129,88],[113,90,129,97],[113,98,129,106],[113,108,129,115],[113,116,129,124],[104,38,105,38],[95,54,95,70],[95,72,95,88],[95,90,95,106],[95,108,95,124],[96,0,96,16],[96,54,96,70],[96,72,96,88],[96,90,96,106],[96,108,96,124],[58,31,60,32],[59,29,68,30],[61,31,68,32],[71,0,72,16],[73,0,95,7],[73,8,95,16],[50,0,50,16],[51,0,70,16],[51,19,53,20],[58,18,59,19],[58,20,59,20],[58,29,58,30],[40,18,41,23],[43,0,47,5],[43,8,47,15],[33,1,33,4],[33,7,33,9],[33,10,33,15],[33,27,33,28],[35,3,36,5],[35,7,35,9],[35,10,35,15],[36,27,36,28],[16,18,29,23],[28,0,29,0],[28,3,30,4],[28,7,30,7],[29,5,29,6],[7,44,8,44],[7,45,8,45],[7,46,8,46],[7,47,8,47],[15,18,15,23],[7,38,8,38],[7,39,8,39],[7,40,8,40],[7,41,8,41],[7,42,8,42],[7,43,8,43],[7,31,8,31],[7,32,8,32],[7,33,8,33],[7,34,8,34],[7,35,8,35],[7,36,8,36],[18,0,19,0],[18,7,19,7],[0,52,3,75],[0,76,3,99],[0,100,3,125],[1,11,1,16],[2,1,4,4],[2,11,2,16],[3,5,3,9],[3,11,3,16],[1,7,1,8],[2,5,2,9],[0,11,0,16],[0,25,3,51],[5,4,5,5],[5,11,5,13],[5,14,5,15],[5,26,6,36],[5,38,6,48],[7,0,7,5],[7,7,7,11],[7,13,7,15],[7,26,8,26],[7,27,8,27],[7,28,8,28],[7,29,8,29],[7,30,8,30],[7,48,8,48],[5,1,5,3],[260,14,262,16],[257,0,259,4],[260,0,262,4],[251,5,253,7],[251,14,253,16],[254,5,256,7],[254,14,256,16],[254,0,256,4],[239,0,241,4],[239,8,241,13],[242,8,244,13],[245,8,247,13],[248,8,250,13],[251,8,253,13],[254,8,256,13],[257,8,259,13],[260,8,262,13],[238,0,238,4],[242,0,244,4],[245,0,247,4],[248,0,250,4],[251,0,253,4],[269,5,271,7],[269,14,271,16],[272,5,274,7],[272,14,274,16],[269,0,271,4],[272,0,274,4],[269,8,271,13],[272,8,274,13],[263,5,265,7],[263,14,265,16],[266,5,268,7],[266,14,268,16],[263,0,265,4],[266,0,268,4],[263,8,265,13],[266,8,268,13],[257,5,259,7],[257,14,259,16],[238,8,238,13]]}
["TIP Project:",{"$f":"TIP_number_MAIN_tab","v":0},null,null,null,null,null,null,null,null,"Date:",{"$f":"Date_MAIN_tab","v":"00:00:00"},null,null,null,null,null,null,null,null,null,null,null,null,null,"COLUMNS HOLDING CELLS BELOW TO BE HIDDEN (CELLS HOLD BACKGROUND DATA FOR MACROS AND CALCULATIONS)",null,null,null,null,null,null,null,null,null,null,null,null,null,null,null,null,null,null,null,null,null,null,null,null,null,null,"COLUMNS HOLDING CELLS BELOW TO BE HIDDEN (CELLS HOLD BACKGROUND DATA FOR MACROS AND CALCULATIONS)",null,null,null,null,null,null,null,null,null,null,null,null,null,null,null,null,null,null,null,null,null,null,null,"COLUMNS HOLDING CELLS BELOW TO BE HIDDEN (CELLS HOLD BACKGROUND DATA FOR MACROS AND CALCULATIONS)",null,null,null,null,null,null,null,null,null,null,null,null,null,null,null,null,null,null,null,null,null,null,null,"COLUMNS HOLDING CELLS BELOW TO BE HIDDEN (CELLS HOLD BACKGROUND DATA FOR MACROS AND CALCULATIONS)"]
["County:",null,null,null,null,null,null,"PSH # OUTLET #",null,null,"  Design Firm:",{"$f":"design_firm_MAIN_tab","v":0}]
["Description:",{"$f":"IF(project_description_MAIN_tab=\"\",\"\",project_description_MAIN_tab)","v":""},null,null,null,null,null,"PSH # OUTLET #",null,null,"  Designed By:",{"$f":"designer_MAIN_tab","v":0}]
[null,null,null,null,null,"Input Alignment, Station, Offset Here",null,null,null,null,"Reviewed By:"]
[]
[{"$f":"MAIN!A37","v":"Version 1.0"},"Outlet UID Number:",null,null,{"$f":"IF(TIP_number_MAIN_tab=0,\"ENTER TIP OR PROJ #\",AG30)","v":"ENTER TIP OR PROJ #"},null,null,"Latitude:",null,null,"Longitude:",null,null,null,"Google Maps",null,null,null,null,null,null,null,null,null,null,null,"PRE CONST. MANNING'S EQUATION OPEN CHANNEL",null,null,null,null,null,null,null,null,null,null,null,"POST CONST. MANNING'S EQUATION OPEN CHANNEL"]
[]
["PRE-CONSTRUCTION (TR-55 METHOD)",null,null,null,null,null,null,"POST-CONSTRUCTION (TR-55 METHOD)",null,null,null,null,null,"CHANGE",null,null,null,null,null,null,null,null,null,null,null,null,"B (ft)","norm. depth (ft)","avg sideslope","S (ft/ft)","N val","A (sq.ft.)","P (ft.)","R (ft.)","Q (cfs)","Vc (ft/s)","Q Compare Check: Make sure = 0 (set to 0 by changing y in data>what if> goal seek)",null,"B (ft)","norm. depth (ft)","avg sideslope","S (ft/ft)","N val","A (sq.ft.)","P (ft.)","R (ft.)","Q (cfs)","Vc (ft/s)","Q Compare Check: Make sure = 0 (set to 0 by changing y in data>what if> goal seek)"]
[]
[null,null,null,"Q2 =",null,"cfs",null,null,null,"Q2 =",null,"cfs",null,"Q2 =",{"$f":"IF(OR(q2post=\"\",q2pre=\"\"),\"\",(q2post/q2pre)-1)","v":""}]
[null,null,null,"V2 =",null,"ft./s",null,null,null,"V2 =",null,"ft./s",null,"V2 =",{"$f":"IF(OR(v2post=0,v2pre=0),\"\",(v2post/v2pre)-1)","v":""},null,null,null,"Green = Calculated / up to date (color 210,255,210)",null,null,null,null,null,null,null,{"$f":"Base_Width_Pre","v":0},1.4727991030475791,{"$f":"(Side_Slope_Left_Pre+Side_Slope_Right_Pre)/2","v":0},{"$f":"Slope_Pre","v":0},{"$f":"Roughness_Pre","v":0},{"$f":"AA11*AB11+AC11*AB11^2","v":0},{"$f":"AA11+((AB11*Side_Slope_Left_Pre)^2+AB11^2)^0.5+((AB11*Side_Slope_Right_Pre)^2+AB11^2)^0.5","v":2.9455982060951582},{"$f":"AF11/AG11","v":0},{"$f":"1.49/AE11*AF11*AH11^0.667*AD11^0.5","v":{"$error":"#DIV/0!"}},{"$f":"1.49/AE11*AH11^0.667*AD11^0.5","v":{"$error":"#DIV/0!"}},{"$f":"AI11-q2pre","v":{"$error":"#DIV/0!"}},{"$f":"ROUND(AK11,1)","v":{"$error":"#DIV/0!"}},{"$f":"IF(Post_Const_Geometry_Selection=\"Geometry Same as Pre-Construction\",Base_Width_Pre,Base_Width_Post)","v":0},1,{"$f":"IF(Post_Const_Geometry_Selection=\"Geometry Same as Pre-Construction\",(Side_Slope_Left_Pre+Side_Slope_Right_Pre)/2,(Side_Slope_Left_Post+Side_Slope_Right_Post)/2)","v":0},{"$f":"IF(Post_Const_Geometry_Selection=\"Geometry Same as Pre-Construction\",Slope_Pre,Slope_Post)","v":0},{"$f":"IF(Post_Const_Geometry_Selection=\"Geometry Same as Pre-Construction\",Roughness_Pre,Roughness_Post)","v":0},{"$f":"AM11*AN11+AO11*AN11^2","v":0},{"$f":"IF(Post_Const_Geometry_Selection=\"Geometry Same as Pre-Construction\",AM11+((AN11*Side_Slope_Left_Pre)^2+AN11^2)^0.5+((AN11*Side_Slope_Right_Pre)^2+AN11^2)^0.5,AM11+((AN11*Side_Slope_Left_Post)^2+AN11^2)^0.5+((AN11*Side_Slope_Right_Post)^2+AN11^2)^0.5)","v":2},{"$f":"AR11/AS11","v":0},{"$f":"1.49/AQ11*AR11*AT11^0.667*AP11^0.5","v":{"$error":"#DIV/0!"}},{"$f":"1.49/AQ11*AT11^0.667*AP11^0.5","v":{"$error":"#DIV/0!"}},{"$f":"AU11-q2post","v":{"$error":"#DIV/0!"}},{"$f":"ROUND(AW11,1)","v":{"$error":"#DIV/0!"}}]
["CNcomposite = ",null,null,"D2 =",null,"ft.",null,"CNcomposite = ",null,"D2 =",null,"ft.",null,"D2 =",{"$f":"IF(OR(d2post=0,d2pre=0),\"\",(d2post/d2pre)-1)","v":""},null,null,null,"Red = Calculated, incorrect, or not up to date (color 255,165,165)",null,null,null,null,null,null,null,{"$f":"Base_Width_Pre","v":0},1.4727991030475791,{"$f":"(Side_Slope_Left_Pre+Side_Slope_Right_Pre)/2","v":0},{"$f":"Slope_Pre","v":0},{"$f":"Roughness_Pre","v":0},{"$f":"AA12*AB12+AC12*AB12^2","v":0},{"$f":"AA12+((AB12*Side_Slope_Left_Pre)^2+AB12^2)^0.5+((AB12*Side_Slope_Right_Pre)^2+AB12^2)^0.5","v":2.9455982060951582},{"$f":"AF12/AG12","v":0},{"$f":"1.49/AE12*AF12*AH12^0.667*AD12^0.5","v":{"$error":"#DIV/0!"}},{"$f":"1.49/AE12*AH12^0.667*AD12^0.5","v":{"$error":"#DIV/0!"}},{"$f":"AI12-q2pre","v":{"$error":"#DIV/0!"}},{"$f":"ROUND(AK12,1)","v":{"$error":"#DIV/0!"}},{"$f":"IF(Post_Const_Geometry_Selection=\"Geometry Same as Pre-Construction\",Base_Width_Pre,Base_Width_Post)","v":0},1,{"$f":"IF(Post_Const_Geometry_Selection=\"Geometry Same as Pre-Construction\",(Side_Slope_Left_Pre+Side_Slope_Right_Pre)/2,(Side_Slope_Left_Post+Side_Slope_Right_Post)/2)","v":0},{"$f":"IF(Post_Const_Geometry_Selection=\"Geometry Same as Pre-Construction\",Slope_Pre,Slope_Post)","v":0},{"$f":"IF(Post_Const_Geometry_Selection=\"Geometry Same as Pre-Construction\",Roughness_Pre,Roughness_Post)","v":0},{"$f":"AM12*AN12+AO12*AN12^2","v":0},{"$f":"IF(Post_Const_Geometry_Selection=\"Geometry Same as Pre-Construction\",AM12+((AN12*Side_Slope_Left_Pre)^2+AN12^2)^0.5+((AN12*Side_Slope_Right_Pre)^2+AN12^2)^0.5,AM12+((AN12*Side_Slope_Left_Post)^2+AN12^2)^0.5+((AN12*Side_Slope_Right_Post)^2+AN12^2)^0.5)","v":2},{"$f":"AR12/AS12","v":0},{"$f":"1.49/AQ12*AR12*AT12^0.667*AP12^0.5","v":{"$error":"#DIV/0!"}},{"$f":"1.49/AQ12*AT12^0.667*AP12^0.5","v":{"$error":"#DIV/0!"}},{"$f":"AU12-q2post","v":{"$error":"#DIV/0!"}},{"$f":"ROUND(AW12,1)","v":{"$error":"#DIV/0!"}}]
["T.O.C (min.)",null,null,"Q5 =",null,"cfs",null,"T.O.C (min.)",null,"Q5 =",null,"cfs",null,"Q5 =",{"$f":"IF(OR(q5post=\"\",q5pre=\"\"),\"\",(q5post/q5pre)-1)","v":""},null,null,null,"light blue = user iput (cells unlocked) (color 190,240,240)"]
["DA imp in R/W = ",null,null,"V5 =",null,"ft./s",null,"DA imp in R/W = ",null,"V5 =",null,"ft./s",null,"V5 =",{"$f":"IF(OR(v5post=0,v5pre=0),\"\",(v5post/v5pre)-1)","v":""},null,null,null,"Yellow = Warning / Caution           (color 255,255,100)",null,null,null,null,null,null,null,{"$f":"Base_Width_Pre","v":0},1.5647239205356298,{"$f":"(Side_Slope_Left_Pre+Side_Slope_Right_Pre)/2","v":0},{"$f":"Slope_Pre","v":0},{"$f":"Roughness_Pre","v":0},{"$f":"AA14*AB14+AC14*AB14^2","v":0},{"$f":"AA14+((AB14*Side_Slope_Left_Pre)^2+AB14^2)^0.5+((AB14*Side_Slope_Right_Pre)^2+AB14^2)^0.5","v":3.1294478410712596},{"$f":"AF14/AG14","v":0},{"$f":"1.49/AE14*AF14*AH14^0.667*AD14^0.5","v":{"$error":"#DIV/0!"}},{"$f":"1.49/AE14*AH14^0.667*AD14^0.5","v":{"$error":"#DIV/0!"}},{"$f":"AI14-q5pre","v":{"$error":"#DIV/0!"}},{"$f":"ROUND(AK14,1)","v":{"$error":"#DIV/0!"}},{"$f":"IF(Post_Const_Geometry_Selection=\"Geometry Same as Pre-Construction\",Base_Width_Pre,Base_Width_Post)","v":0},1,{"$f":"IF(Post_Const_Geometry_Selection=\"Geometry Same as Pre-Construction\",(Side_Slope_Left_Pre+Side_Slope_Right_Pre)/2,(Side_Slope_Left_Post+Side_Slope_Right_Post)/2)","v":0},{"$f":"IF(Post_Const_Geometry_Selection=\"Geometry Same as Pre-Construction\",Slope_Pre,Slope_Post)","v":0},{"$f":"IF(Post_Const_Geometry_Selection=\"Geometry Same as Pre-Construction\",Roughness_Pre,Roughness_Post)","v":0},{"$f":"AM14*AN14+AO14*AN14^2","v":0},{"$f":"IF(Post_Const_Geometry_Selection=\"Geometry Same as Pre-Construction\",AM14+((AN14*Side_Slope_Left_Pre)^2+AN14^2)^0.5+((AN14*Side_Slope_Right_Pre)^2+AN14^2)^0.5,AM14+((AN14*Side_Slope_Left_Post)^2+AN14^2)^0.5+((AN14*Side_Slope_Right_Post)^2+AN14^2)^0.5)","v":2},{"$f":"AR14/AS14","v":0},{"$f":"1.49/AQ14*AR14*AT14^0.667*AP14^0.5","v":{"$error":"#DIV/0!"}},{"$f":"1.49/AQ14*AT14^0.667*AP14^0.5","v":{"$error":"#DIV/0!"}},{"$f":"AU14-q5post","v":{"$error":"#DIV/0!"}},{"$f":"ROUND(AW14,1)","v":{"$error":"#DIV/0!"}}]
["DAtotal  =",null,null,"D5 =",null,"ft.",null,"DAtotal  =",null,"D5 =",null,"ft.",null,"D5 =",{"$f":"IF(OR(d5post=0,d5pre=0),\"\",(d5post/d5pre)-1)","v":""},null,null,null,null,null,null,null,null,null,null,null,{"$f":"Base_Width_Pre","v":0},1.5647239205356298,{"$f":"(Side_Slope_Left_Pre+Side_Slope_Right_Pre)/2","v":0},{"$f":"Slope_Pre","v":0},{"$f":"Roughness_Pre","v":0},0,{"$f":"AA15+((AB15*Side_Slope_Left_Pre)^2+AB15^2)^0.5+((AB15*Side_Slope_Right_Pre)^2+AB15^2)^0.5","v":3.1294478410712596},0,{"$error":"#DIV/0!"},{"$error":"#DIV/0!"},{"$f":"AI15-q5pre","v":{"$error":"#DIV/0!"}},{"$error":"#DIV/0!"},{"$f":"IF(Post_Const_Geometry_Selection=\"Geometry Same as Pre-Construction\",Base_Width_Pre,Base_Width_Post)","v":0},1,{"$f":"IF(Post_Const_Geometry_Selection=\"Geometry Same as Pre-Construction\",(Side_Slope_Left_Pre+Side_Slope_Right_Pre)/2,(Side_Slope_Left_Post+Side_Slope_Right_Post)/2)","v":0},{"$f":"IF(Post_Const_Geometry_Selection=\"Geometry Same as Pre-Construction\",Slope_Pre,Slope_Post)","v":0},{"$f":"IF(Post_Const_Geometry_Selection=\"Geometry Same as Pre-Construction\",Roughness_Pre,Roughness_Post)","v":0},0,{"$f":"IF(Post_Const_Geometry_Selection=\"Geometry Same as Pre-Construction\",AM15+((AN15*Side_Slope_Left_Pre)^2+AN15^2)^0.5+((AN15*Side_Slope_Right_Pre)^2+AN15^2)^0.5,AM15+((AN15*Side_Slope_Left_Post)^2+AN15^2)^0.5+((AN15*Side_Slope_Right_Post)^2+AN15^2)^0.5)","v":2},0,{"$error":"#DIV/0!"},{"$error":"#DIV/0!"},{"$f":"AU15-q5post","v":{"$error":"#DIV/0!"}},{"$error":"#DIV/0!"}]
[null,null,null,"Q10 =",null,"cfs",null,null,null,"Q10 =",null,"cfs",null,"Q10 =",{"$f":"IF(OR(q10post=\"\",q10pre=\"\"),\"\",(q10post/q10pre)-1)","v":""},null,null,null,"User Notes (will not be printed)",null,null,null,null,null,null,null,null,null,null,null,null,null,null,null,null,null,null,0]
["% Imp. Area (Total)",null,null,"V10 =",null,"ft./s",null,"% Imp. Area (Total)",null,"V10 =",null,"ft./s",null,"V10 =",{"$f":"IF(OR(v10post=0,v10pre=0),\"\",(v10post/v10pre)-1)","v":""},null,null,null,null,null,null,null,null,null,null,null,{"$f":"Base_Width_Pre","v":0},1.6213254592941764,{"$f":"(Side_Slope_Left_Pre+Side_Slope_Right_Pre)/2","v":0},{"$f":"Slope_Pre","v":0},{"$f":"Roughness_Pre","v":0},0,{"$f":"AA17+((AB17*Side_Slope_Left_Pre)^2+AB17^2)^0.5+((AB17*Side_Slope_Right_Pre)^2+AB17^2)^0.5","v":3.2426509185883527},0,{"$error":"#DIV/0!"},{"$error":"#DIV/0!"},{"$f":"AI17-q10pre","v":{"$error":"#DIV/0!"}},{"$error":"#DIV/0!"},{"$f":"IF(Post_Const_Geometry_Selection=\"Geometry Same as Pre-Construction\",Base_Width_Pre,Base_Width_Post)","v":0},1,{"$f":"IF(Post_Const_Geometry_Selection=\"Geometry Same as Pre-Construction\",(Side_Slope_Left_Pre+Side_Slope_Right_Pre)/2,(Side_Slope_Left_Post+Side_Slope_Right_Post)/2)","v":0},{"$f":"IF(Post_Const_Geometry_Selection=\"Geometry Same as Pre-Construction\",Slope_Pre,Slope_Post)","v":0},{"$f":"IF(Post_Const_Geometry_Selection=\"Geometry Same as Pre-Construction\",Roughness_Pre,Roughness_Post)","v":0},{"$f":"AM17*AN17+AO17*AN17^2","v":0},{"$f":"IF(Post_Const_Geometry_Selection=\"Geometry Same as Pre-Construction\",AM17+((AN17*Side_Slope_Left_Pre)^2+AN17^2)^0.5+((AN17*Side_Slope_Right_Pre)^2+AN17^2)^0.5,AM17+((AN17*Side_Slope_Left_Post)^2+AN17^2)^0.5+((AN17*Side_Slope_Right_Post)^2+AN17^2)^0.5)","v":2},{"$f":"AR17/AS17","v":0},{"$f":"1.49/AQ17*AR17*AT17^0.667*AP17^0.5","v":{"$error":"#DIV/0!"}},{"$f":"1.49/AQ17*AT17^0.667*AP17^0.5","v":{"$error":"#DIV/0!"}},{"$f":"AU17-q10post","v":{"$error":"#DIV/0!"}},{"$error":"#DIV/0!"}]
[null,null,null,"D10 =",null,"ft.",null,null,null,"D10 =",null,"ft.",null,"D10 =",{"$f":"IF(OR(d10post=0,d10pre=0),\"\",(d10post/d10pre)-1)","v":""},null,null,null,null,null,null,null,null,null,null,null,{"$f":"Base_Width_Pre","v":0},1.6213254592941764,{"$f":"(Side_Slope_Left_Pre+Side_Slope_Right_Pre)/2","v":0},{"$f":"Slope_Pre","v":0},{"$f":"Roughness_Pre","v":0},0,{"$f":"AA18+((AB18*Side_Slope_Left_Pre)^2+AB18^2)^0.5+((AB18*Side_Slope_Right_Pre)^2+AB18^2)^0.5","v":3.2426509185883527},0,{"$error":"#DIV/0!"},{"$error":"#DIV/0!"},{"$f":"AI18-q10pre","v":{"$error":"#DIV/0!"}},{"$error":"#DIV/0!"},{"$f":"IF(Post_Const_Geometry_Selection=\"Geometry Same as Pre-Construction\",Base_Width_Pre,Base_Width_Post)","v":0},1,{"$f":"IF(Post_Const_Geometry_Selection=\"Geometry Same as Pre-Construction\",(Side_Slope_Left_Pre+Side_Slope_Right_Pre)/2,(Side_Slope_Left_Post+Side_Slope_Right_Post)/2)","v":0},{"$f":"IF(Post_Const_Geometry_Selection=\"Geometry Same as Pre-Construction\",Slope_Pre,Slope_Post)","v":0},{"$f":"IF(Post_Const_Geometry_Selection=\"Geometry Same as Pre-Construction\",Roughness_Pre,Roughness_Post)","v":0},0,{"$f":"IF(Post_Const_Geometry_Selection=\"Geometry Same as Pre-Construction\",AM18+((AN18*Side_Slope_Left_Pre)^2+AN18^2)^0.5+((AN18*Side_Slope_Right_Pre)^2+AN18^2)^0.5,AM18+((AN18*Side_Slope_Left_Post)^2+AN18^2)^0.5+((AN18*Side_Slope_Right_Post)^2+AN18^2)^0.5)","v":2},0,{"$error":"#DIV/0!"},{"$error":"#DIV/0!"},{"$f":"AU18-q10post","v":{"$error":"#DIV/0!"}},{"$error":"#DIV/0!"}]
["% Imp. Area (NCDOT Contribution)",null,null,"Q25 =",null,"cfs",null,"% Imp. Area (NCDOT Contribution)",null,"Q25 =",null,"cfs",null,"Q25 =",{"$f":"IF(OR(q25post=\"\",q25pre=\"\"),\"\",(q25post/q25pre)-1)","v":""}]
[null,null,null,"V25 =",null,"ft./s",null,null,null,"V25 =",null,"ft./s",null,"V25 =",{"$f":"IF(OR(v25post=0,v25pre=0),\"\",(v25post/v25pre)-1)","v":""},null,null,null,null,null,null,null,null,null,null,null,{"$f":"Base_Width_Pre","v":0},1.682068068069611,{"$f":"(Side_Slope_Left_Pre+Side_Slope_Right_Pre)/2","v":0},{"$f":"Slope_Pre","v":0},{"$f":"Roughness_Pre","v":0},{"$f":"AA20*AB20+AC20*AB20^2","v":0},{"$f":"AA20+((AB20*Side_Slope_Left_Pre)^2+AB20^2)^0.5+((AB20*Side_Slope_Right_Pre)^2+AB20^2)^0.5","v":3.3641361361392219},0,{"$error":"#DIV/0!"},{"$error":"#DIV/0!"},{"$f":"AI20-q25pre","v":{"$error":"#DIV/0!"}},{"$error":"#DIV/0!"},{"$f":"IF(Post_Const_Geometry_Selection=\"Geometry Same as Pre-Construction\",Base_Width_Pre,Base_Width_Post)","v":0},1,{"$f":"IF(Post_Const_Geometry_Selection=\"Geometry Same as Pre-Construction\",(Side_Slope_Left_Pre+Side_Slope_Right_Pre)/2,(Side_Slope_Left_Post+Side_Slope_Right_Post)/2)","v":0},{"$f":"IF(Post_Const_Geometry_Selection=\"Geometry Same as Pre-Construction\",Slope_Pre,Slope_Post)","v":0},{"$f":"IF(Post_Const_Geometry_Selection=\"Geometry Same as Pre-Construction\",Roughness_Pre,Roughness_Post)","v":0},{"$f":"AM20*AN20+AO20*AN20^2","v":0},{"$f":"IF(Post_Const_Geometry_Selection=\"Geometry Same as Pre-Construction\",AM20+((AN20*Side_Slope_Left_Pre)^2+AN20^2)^0.5+((AN20*Side_Slope_Right_Pre)^2+AN20^2)^0.5,AM20+((AN20*Side_Slope_Left_Post)^2+AN20^2)^0.5+((AN20*Side_Slope_Right_Post)^2+AN20^2)^0.5)","v":2},{"$f":"AR20/AS20","v":0},{"$f":"1.49/AQ20*AR20*AT20^0.667*AP20^0.5","v":{"$error":"#DIV/0!"}},{"$f":"1.49/AQ20*AT20^0.667*AP20^0.5","v":{"$error":"#DIV/0!"}},{"$f":"AU20-q25post","v":{"$error":"#DIV/0!"}},{"$error":"#DIV/0!"}]
[null,null,null,"D25 =",null,"ft.",null,null,null,"D25 =",null,"ft.",null,"D25 =",{"$f":"IF(OR(d25post=0,d25pre=0),\"\",(d25post/d25pre)-1)","v":""},null,null,null,null,null,null,null,null,null,null,null,{"$f":"Base_Width_Pre","v":0},1.682068068069611,{"$f":"(Side_Slope_Left_Pre+Side_Slope_Right_Pre)/2","v":0},{"$f":"Slope_Pre","v":0},{"$f":"Roughness_Pre","v":0},0,{"$f":"AA21+((AB21*Side_Slope_Left_Pre)^2+AB21^2)^0.5+((AB21*Side_Slope_Right_Pre)^2+AB21^2)^0.5","v":3.3641361361392219},0,{"$error":"#DIV/0!"},{"$error":"#DIV/0!"},{"$f":"AI21-q25pre","v":{"$error":"#DIV/0!"}},{"$error":"#DIV/0!"},{"$f":"IF(Post_Const_Geometry_Selection=\"Geometry Same as Pre-Construction\",Base_Width_Pre,Base_Width_Post)","v":0},1,{"$f":"IF(Post_Const_Geometry_Selection=\"Geometry Same as Pre-Construction\",(Side_Slope_Left_Pre+Side_Slope_Right_Pre)/2,(Side_Slope_Left_Post+Side_Slope_Right_Post)/2)","v":0},{"$f":"IF(Post_Const_Geometry_Selection=\"Geometry Same as Pre-Construction\",Slope_Pre,Slope_Post)","v":0},{"$f":"IF(Post_Const_Geometry_Selection=\"Geometry Same as Pre-Construction\",Roughness_Pre,Roughness_Post)","v":0},{"$f":"AM21*AN21+AO21*AN21^2","v":0},{"$f":"IF(Post_Const_Geometry_Selection=\"Geometry Same as Pre-Construction\",AM21+((AN21*Side_Slope_Left_Pre)^2+AN21^2)^0.5+((AN21*Side_Slope_Right_Pre)^2+AN21^2)^0.5,AM21+((AN21*Side_Slope_Left_Post)^2+AN21^2)^0.5+((AN21*Side_Slope_Right_Post)^2+AN21^2)^0.5)","v":2},0,{"$error":"#DIV/0!"},{"$error":"#DIV/0!"},{"$f":"AU21-q25post","v":{"$error":"#DIV/0!"}},{"$error":"#DIV/0!"}]
[null,null,null,"Q50 =",null,"cfs",null,null,null,"Q50 =",null,"cfs",null,"Q50 =",{"$f":"IF(OR(q50post=\"\",q50pre=\"\"),\"\",(q50post/q50pre)-1)","v":""}]
[null,null,null,"V50 =",null,"ft./s",null,null,null,"V50 =",null,"ft./s",null,"V50 =",{"$f":"IF(OR(v50post=0,v50pre=0),\"\",(v50post/v50pre)-1)","v":""},null,null,null,null,null,null,null,null,null,null,null,{"$f":"Base_Width_Pre","v":0},1.7196104937144696,{"$f":"(Side_Slope_Left_Pre+Side_Slope_Right_Pre)/2","v":0},{"$f":"Slope_Pre","v":0},{"$f":"Roughness_Pre","v":0},0,{"$f":"AA23+((AB23*Side_Slope_Left_Pre)^2+AB23^2)^0.5+((AB23*Side_Slope_Right_Pre)^2+AB23^2)^0.5","v":3.4392209874289392},0,{"$error":"#DIV/0!"},{"$error":"#DIV/0!"},{"$f":"AI23-q50pre","v":{"$error":"#DIV/0!"}},{"$error":"#DIV/0!"},{"$f":"IF(Post_Const_Geometry_Selection=\"Geometry Same as Pre-Construction\",Base_Width_Pre,Base_Width_Post)","v":0},1,{"$f":"IF(Post_Const_Geometry_Selection=\"Geometry Same as Pre-Construction\",(Side_Slope_Left_Pre+Side_Slope_Right_Pre)/2,(Side_Slope_Left_Post+Side_Slope_Right_Post)/2)","v":0},{"$f":"IF(Post_Const_Geometry_Selection=\"Geometry Same as Pre-Construction\",Slope_Pre,Slope_Post)","v":0},{"$f":"IF(Post_Const_Geometry_Selection=\"Geometry Same as Pre-Construction\",Roughness_Pre,Roughness_Post)","v":0},{"$f":"AM23*AN23+AO23*AN23^2","v":0},{"$f":"IF(Post_Const_Geometry_Selection=\"Geometry Same as Pre-Construction\",AM23+((AN23*Side_Slope_Left_Pre)^2+AN23^2)^0.5+((AN23*Side_Slope_Right_Pre)^2+AN23^2)^0.5,AM23+((AN23*Side_Slope_Left_Post)^2+AN23^2)^0.5+((AN23*Side_Slope_Right_Post)^2+AN23^2)^0.5)","v":2},{"$f":"AR23/AS23","v":0},{"$f":"1.49/AQ23*AR23*AT23^0.667*AP23^0.5","v":{"$error":"#DIV/0!"}},{"$f":"1.49/AQ23*AT23^0.667*AP23^0.5","v":{"$error":"#DIV/0!"}},{"$f":"AU23-q50post","v":{"$error":"#DIV/0!"}},{"$error":"#DIV/0!"}]
[null,null,null,"D50 =",null,"ft.",null,null,null,"D50 =",null,"ft.",null,"D50 =",{"$f":"IF(OR(d50post=0,d50pre=0),\"\",(d50post/d50pre)-1)","v":""},null,null,null,null,null,null,null,null,null,null,null,{"$f":"Base_Width_Pre","v":0},1.7196104937144696,{"$f":"(Side_Slope_Left_Pre+Side_Slope_Right_Pre)/2","v":0},{"$f":"Slope_Pre","v":0},{"$f":"Roughness_Pre","v":0},{"$f":"AA24*AB24+AC24*AB24^2","v":0},{"$f":"AA24+((AB24*Side_Slope_Left_Pre)^2+AB24^2)^0.5+((AB24*Side_Slope_Right_Pre)^2+AB24^2)^0.5","v":3.4392209874289392},0,{"$f":"1.49/AE24*AF24*AH24^0.667*AD24^0.5","v":{"$error":"#DIV/0!"}},{"$error":"#DIV/0!"},{"$f":"AI24-q50pre","v":{"$error":"#DIV/0!"}},{"$error":"#DIV/0!"},{"$f":"IF(Post_Const_Geometry_Selection=\"Geometry Same as Pre-Construction\",Base_Width_Pre,Base_Width_Post)","v":0},1,{"$f":"IF(Post_Const_Geometry_Selection=\"Geometry Same as Pre-Construction\",(Side_Slope_Left_Pre+Side_Slope_Right_Pre)/2,(Side_Slope_Left_Post+Side_Slope_Right_Post)/2)","v":0},{"$f":"IF(Post_Const_Geometry_Selection=\"Geometry Same as Pre-Construction\",Slope_Pre,Slope_Post)","v":0},{"$f":"IF(Post_Const_Geometry_Selection=\"Geometry Same as Pre-Construction\",Roughness_Pre,Roughness_Post)","v":0},0,{"$f":"IF(Post_Const_Geometry_Selection=\"Geometry Same as Pre-Construction\",AM24+((AN24*Side_Slope_Left_Pre)^2+AN24^2)^0.5+((AN24*Side_Slope_Right_Pre)^2+AN24^2)^0.5,AM24+((AN24*Side_Slope_Left_Post)^2+AN24^2)^0.5+((AN24*Side_Slope_Right_Post)^2+AN24^2)^0.5)","v":2},0,{"$error":"#DIV/0!"},{"$error":"#DIV/0!"},{"$f":"AU24-q50post","v":{"$error":"#DIV/0!"}},{"$error":"#DIV/0!"}]
[null,null,null,"Q100 =",null,"cfs",null,null,null,"Q100 =",null,"cfs",null,"Q100 =",{"$f":"IF(OR(q100post=\"\",q100pre=\"\"),\"\",(q100post/q100pre)-1)","v":""}]
[null,null,null,"V100 =",null,"ft./s",null,null,null,"V100 =",null,"ft./s",null,"V100 =",{"$f":"IF(OR(v100post=0,v100pre=0),\"\",(v100post/v100pre)-1)","v":""},null,null,null,null,null,null,null,null,null,null,null,{"$f":"Base_Width_Pre","v":0},1.7196104937144696,{"$f":"(Side_Slope_Left_Pre+Side_Slope_Right_Pre)/2","v":0},{"$f":"Slope_Pre","v":0},{"$f":"Roughness_Pre","v":0},{"$f":"AA26*AB26+AC26*AB26^2","v":0},{"$f":"AA26+((AB26*Side_Slope_Left_Pre)^2+AB26^2)^0.5+((AB26*Side_Slope_Right_Pre)^2+AB26^2)^0.5","v":3.4392209874289392},{"$f":"AF26/AG26","v":0},{"$f":"1.49/AE26*AF26*AH26^0.667*AD26^0.5","v":{"$error":"#DIV/0!"}},{"$f":"1.49/AE26*AH26^0.667*AD26^0.5","v":{"$error":"#DIV/0!"}},{"$f":"AI26-q100pre","v":{"$error":"#DIV/0!"}},{"$f":"ROUND(AK26,1)","v":{"$error":"#DIV/0!"}},{"$f":"IF(Post_Const_Geometry_Selection=\"Geometry Same as Pre-Construction\",Base_Width_Pre,Base_Width_Post)","v":0},1,{"$f":"IF(Post_Const_Geometry_Selection=\"Geometry Same as Pre-Construction\",(Side_Slope_Left_Pre+Side_Slope_Right_Pre)/2,(Side_Slope_Left_Post+Side_Slope_Right_Post)/2)","v":0},{"$f":"IF(Post_Const_Geometry_Selection=\"Geometry Same as Pre-Construction\",Slope_Pre,Slope_Post)","v":0},{"$f":"IF(Post_Const_Geometry_Selection=\"Geometry Same as Pre-Construction\",Roughness_Pre,Roughness_Post)","v":0},{"$f":"AM26*AN26+AO26*AN26^2","v":0},{"$f":"IF(Post_Const_Geometry_Selection=\"Geometry Same as Pre-Construction\",AM26+((AN26*Side_Slope_Left_Pre)^2+AN26^2)^0.5+((AN26*Side_Slope_Right_Pre)^2+AN26^2)^0.5,AM26+((AN26*Side_Slope_Left_Post)^2+AN26^2)^0.5+((AN26*Side_Slope_Right_Post)^2+AN26^2)^0.5)","v":2},{"$f":"AR26/AS26","v":0},{"$f":"1.49/AQ26*AR26*AT26^0.667*AP26^0.5","v":{"$error":"#DIV/0!"}},{"$f":"1.49/AQ26*AT26^0.667*AP26^0.5","v":{"$error":"#DIV/0!"}},{"$f":"AU26-q100post","v":{"$error":"#DIV/0!"}},{"$f":"ROUND(AW26,1)","v":{"$error":"#DIV/0!"}}]
[null,null,null,"D100 =",null,"ft.",null,null,null,"D100 =",null,"ft.",null,"D100 =",{"$f":"IF(OR(d100post=0,d100pre=0),\"\",(d100post/d100pre)-1)","v":""},null,null,null,null,null,null,null,null,null,null,null,{"$f":"Base_Width_Pre","v":0},1.7196104937144696,{"$f":"(Side_Slope_Left_Pre+Side_Slope_Right_Pre)/2","v":0},{"$f":"Slope_Pre","v":0},{"$f":"Roughness_Pre","v":0},{"$f":"AA27*AB27+AC27*AB27^2","v":0},{"$f":"AA27+((AB27*Side_Slope_Left_Pre)^2+AB27^2)^0.5+((AB27*Side_Slope_Right_Pre)^2+AB27^2)^0.5","v":3.4392209874289392},0,{"$f":"1.49/AE27*AF27*AH27^0.667*AD27^0.5","v":{"$error":"#DIV/0!"}},{"$error":"#DIV/0!"},{"$f":"AI27-q100pre","v":{"$error":"#DIV/0!"}},{"$f":"ROUND(AK27,1)","v":{"$error":"#DIV/0!"}},{"$f":"IF(Post_Const_Geometry_Selection=\"Geometry Same as Pre-Construction\",Base_Width_Pre,Base_Width_Post)","v":0},1,{"$f":"IF(Post_Const_Geometry_Selection=\"Geometry Same as Pre-Construction\",(Side_Slope_Left_Pre+Side_Slope_Right_Pre)/2,(Side_Slope_Left_Post+Side_Slope_Right_Post)/2)","v":0},{"$f":"IF(Post_Const_Geometry_Selection=\"Geometry Same as Pre-Construction\",Slope_Pre,Slope_Post)","v":0},{"$f":"IF(Post_Const_Geometry_Selection=\"Geometry Same as Pre-Construction\",Roughness_Pre,Roughness_Post)","v":0},0,{"$f":"IF(Post_Const_Geometry_Selection=\"Geometry Same as Pre-Construction\",AM27+((AN27*Side_Slope_Left_Pre)^2+AN27^2)^0.5+((AN27*Side_Slope_Right_Pre)^2+AN27^2)^0.5,AM27+((AN27*Side_Slope_Left_Post)^2+AN27^2)^0.5+((AN27*Side_Slope_Right_Post)^2+AN27^2)^0.5)","v":2},0,{"$f":"1.49/AQ27*AR27*AT27^0.667*AP27^0.5","v":{"$error":"#DIV/0!"}},{"$f":"1.49/AQ27*AT27^0.667*AP27^0.5","v":{"$error":"#DIV/0!"}},{"$f":"AU27-q100post","v":{"$error":"#DIV/0!"}},{"$error":"#DIV/0!"}]
[null,null,null,null,null,null,null,null,null,null,null,null,null,"DAtotal=",{"$f":"IF(OR(da_total_post=0,da_total_post=\"\",da_total_pre=0),\"\",(da_total_post/da_total_pre)-1)","v":""}]
["Railroad / 100-YR Design? ",null,null,"Existing Erosion / Potential Future Erosion?",null,null,null,"Post Const. D/S Channel liner type",null,null,null,null,null,"DA imp R/W = ",{"$f":"IF(OR(da_pre_imp=\"\",da_post_imp=\"\"),\"\",da_post_imp-da_pre_imp)","v":""}]
[null,null,null,null,null,null,null,null,null,null,{"$f":"IF(J30=\"\",\"\",IF(d10post=\"\",\"Calc D10\",IF(AND(Post_Const_Geometry_Selection=\"Geometry Same as Pre-Construction\",Slope_Pre=\"\"),\"Enter Slope\",IF(AND(Slope_Post=\"\",Post_Const_Geometry_Selection<>\"Geometry Same as Pre-Construction\"),\"Enter Slope\",IF(Post_Const_Geometry_Selection=\"Geometry Same as Pre-Construction\",Slope_Pre*d10post*62.4,Slope_Post*d10post*62.4)))))","v":""},null,null,"% imp Area = ",{"$f":"IF(OR(percent_imp_pre_total=\"\",percent_imp_post_total=\"\"),\"\",percent_imp_post_total-percent_imp_pre_total)","v":""},null,null,null,null,null,null,null,null,null,null,null,null,null,null,null,null,null,{"$f":"_xlfn.TEXTJOIN(\"\",TRUE,\"OA-\",B1,\"-\",UID_hidden)","v":"OA-0-"}]
[]
[]
[]
["LINER TYPE","Select Liner Type Above To Generate List",null,null,null,null,null,"PRE-CONSTRUCTION OUTLET GEOMETRY"]
[]
["V10 Permissible",{"$f":"IF(I30=\"N/A\",\"N/A\",IF(Soil_Type=\"Permanent Matting Product (stable)\",\"User to Define\",IF(J30<>\"\",\"N/A\",IF(I30=\"Soil\",AD41,IF(I30=\"Non-Soil\",AD43,\"\")))))","v":""},null,{"$f":"IF(Soil_Type='PICK LISTS'!E14,\"N/A\",IF(A34=\"LINER TYPE\",AF62,AD60))","v":""},null,null,null,"POST-CONSTRUCTION OUTLET GEOMETRY"]
["τ10 Permissible",{"$f":"IF(A34=\"SOIL TYPE\",\"N/A\",IF(Soil_Type=\"Grass / Dense Veg. (no bare soil spots)\",\"N/A\",IF(J30<>\"\",AD43,\"\")))","v":""},null,null,null,null,null,null,null,null,null,null,null,null,null,null,null,null,null,null,null,null,null,null,null,null,null,"Hydrology Method:",null,"TR-55 Method"]
[]
["PRE-CONSTRUCTION OUTLET GEOMETRY",null,null,null,null,null,null,null,"POST-CONSTRUCTION OUTLET GEOMETRY"]
[null,null,null,null,null,null,null,null,null,null,null,null,null,null,null,null,null,null,null,null,null,null,null,null,null,null,null,null,null,null,null,"allowable shear stress",null,{"$f":"AD43","v":""}]
[null,null,null,null,null,null,null,null,null,null,null,null,null,null,null,null,null,null,null,null,null,null,null,null,null,null,null,"v_permissible soil",null,{"$f":"IF(Soil_Type='PICK LISTS'!E2,'PICK LISTS'!F2,IF(Soil_Type='PICK LISTS'!E3,'PICK LISTS'!F3,IF(Soil_Type='PICK LISTS'!E4,'PICK LISTS'!F4, IF(Soil_Type='PICK LISTS'!E5,'PICK LISTS'!F5, IF(Soil_Type='PICK LISTS'!E6,'PICK LISTS'!F6,IF(Soil_Type='PICK LISTS'!E7,'PICK LISTS'!F7,IF(Soil_Type='PICK LISTS'!E8,'PICK LISTS'!F8,IF(Soil_Type='PICK LISTS'!E9,'PICK LISTS'!F9,IF(Soil_Type='PICK LISTS'!E10,'PICK LISTS'!F10,IF(Soil_Type='PICK LISTS'!E11,'PICK LISTS'!F11,IF(Soil_Type='PICK LISTS'!E12,'PICK LISTS'!F12,IF(Soil_Type='PICK LISTS'!E13,'PICK LISTS'!F13,IF(Soil_Type=\"N/A (Pipe System or Non-Channel)\",\"N/A\",\"\")))))))))))))","v":""},null,"riprap permissible velocity",null,null,{"$f":"IF(v10post=\"\",\"\",(1.49/(Roughness_Pre*SQRT(62.4*d10pre)))*(AH18^(0.1666666))*(AH40^0.5))","v":""},null,null,null,"PRE"]
[null,null,null,null,null,null,null,null,null,null,null,null,null,null,null,null,null,null,null,null,null,null,null,null,null,null,null,null,null,null,null,null,null,null,null,null,null,null,null,"Intensity Calcs"]
[null,null,null,null,null,null,null,null,null,null,null,null,null,null,null,null,null,null,null,null,null,null,null,null,null,null,null,"shear/v_perm non-soil",null,{"$f":"IF(Soil_Type='PICK LISTS'!H18,'PICK LISTS'!I18,IF(Soil_Type='PICK LISTS'!H19,'PICK LISTS'!I19,IF(Soil_Type='PICK LISTS'!H20,'PICK LISTS'!I20,IF(Soil_Type='PICK LISTS'!H21,'PICK LISTS'!I21,IF(Soil_Type='PICK LISTS'!H22,'PICK LISTS'!I22,IF(Soil_Type='PICK LISTS'!H23,'PICK LISTS'!I23,\"\"))))))","v":""},null,"Is it riprap lined?",null,{"$f":"IF(OR(Soil_Type=\"CL-A Riprap (d50 = 4 in.)\",Soil_Type=\"CL-B Riprap (d50 = 8 in.)\",Soil_Type=\"CL-I Riprap (d50 = 10 in.)\",Soil_Type=\"CL-II Riprap (d50 = 12 in.)\"),\"YES\",\"NO\")","v":"NO"}]
[null,null,null,null,null,null,null,null,null,null,null,null,null,null,null,null,null,null,null,null,null,null,null,null,null,null,null,null,null,null,null,null,null,null,null,null,null,null,null,null,2,5,10,25,50,100]
[null,null,null,null,null,null,null,null,null,null,null,null,null,null,null,null,null,null,null,null,null,null,null,null,null,null,null,"Increase or Decrease in Velocity",null,null,null,null,null,null,null,null,null,null,null,{"$f":"IF(custom_IDF=\"YES\",INDIRECT(\"Z_CUSTOM_IDF\"),IF(county_for_this_outlet=\"New Hanover\", INDIRECT(\"NewHanover\"),INDIRECT(county_for_this_outlet)))","v":{"$error":"#REF!"}}]
[null,null,null,null,null,null,null,null,null,null,null,null,null,null,null,null,null,null,null,null,null,null,null,null,null,null,null,{"$f":"IF(OR(v10pre=\"\",v10post=\"\",Soil_Type=\"\",Soil_Type=\"Select Liner Type Above To Generate List\"),\"\",IF(v10post>v10pre,\"Increase\",IF(v10post<=v10pre,\"Decrease\",\"\")))","v":""}]
[]
[null,null,null,null,null,null,null,null,null,null,null,null,null,null,null,null,null,null,null,null,null,null,null,null,null,null,null,"Vpost > Vsoil_permissible?"]
[]
[]
[{"$f":"_xlfn.CONCAT(\"SUMMARY - \",_xlnm.sheet_title)","v":"SUMMARY - PSH # OUTLET #"},null,null,null,null,null,null,null,null,null,null,null,null,null,null,null,null,null,null,null,null,null,null,null,null,null,null,{"$f":"IF(I30=\"Soil\",IF(v10post>AD41,\"YES\",\"NO\"),IF(AH43=\"YES\",IF(K30>AD43,\"YES\",\"NO\"),IF(v10post>AD43,\"YES\",\"NO\")))","v":"NO"}]
["Please provide a summary of the outlet analysis here. Directions/guidance are provided by clicking on the \"i\" button above."]
[null,null,null,null,null,null,null,null,null,null,null,null,null,null,null,null,null,null,null,null,null,null,null,null,null,null,null,"Vpost increase > 10%?",null,null,null,null,null,null,null,null,null,null,null,"5-10",{"$f":"_xlfn.FORECAST.LINEAR(Tc_R_Pre,AO45:AO46,$AN45:$AN46)","v":{"$error":"#REF!"}},{"$f":"_xlfn.FORECAST.LINEAR(Tc_R_Pre,AP45:AP46,$AN45:$AN46)","v":{"$error":"#REF!"}},{"$error":"#REF!"},{"$error":"#REF!"},{"$error":"#REF!"},{"$error":"#REF!"}]
[null,null,null,null,null,null,null,null,null,null,null,null,null,null,null,null,null,null,null,null,null,null,null,null,null,null,null,{"$f":"IF(O17>0.1,\"YES\",\"NO\")","v":"YES"},null,null,null,null,null,null,null,null,null,null,null,"10-15",{"$f":"_xlfn.FORECAST.LINEAR(Tc_R_Pre,AO46:AO47,$AN46:$AN47)","v":{"$error":"#DIV/0!"}},{"$error":"#DIV/0!"},{"$error":"#DIV/0!"},{"$error":"#DIV/0!"},{"$error":"#DIV/0!"},{"$error":"#DIV/0!"}]
[null,null,null,null,null,null,null,null,null,null,null,null,null,null,null,null,null,null,null,null,null,null,null,null,null,null,null,null,null,null,null,null,null,null,null,null,null,null,null,"15-30",{"$error":"#DIV/0!"},{"$error":"#DIV/0!"},{"$error":"#DIV/0!"},{"$error":"#DIV/0!"},{"$error":"#DIV/0!"},{"$error":"#DIV/0!"}]
[null,null,null,null,null,null,null,null,null,null,null,null,null,null,null,null,null,null,null,null,null,null,null,null,null,null,null,null,null,null,null,null,null,null,null,null,null,null,null,"30-60",{"$error":"#DIV/0!"},{"$error":"#DIV/0!"},{"$error":"#DIV/0!"},{"$error":"#DIV/0!"},{"$error":"#DIV/0!"},{"$error":"#DIV/0!"}]
[]
[null,null,null,null,null,null,null,null,null,null,null,null,null,null,null,null,null,null,null,null,null,null,null,null,null,null,null,null,null,null,null,null,null,null,null,null,null,null,null,null,{"$f":"IF(OR(Tc_R_Pre>60, Tc_R_Pre<5), \"Error\", IF(AND(Tc_R_Pre>=5,Tc_R_Pre<=10),AO53, IF(AND(Tc_R_Pre>10,Tc_R_Pre<=15), AO54, IF(AND(Tc_R_Pre>15, Tc_R_Pre<=30), AO55, IF(AND(Tc_R_Pre>30, Tc_R_Pre<=60), AO56, VLOOKUP(Tc_R_Pre, INDIRECT(Name_R), 2))))))","v":"Error"},{"$f":"IF(OR(Tc_R_Pre>60, Tc_R_Pre<5), \"Error\", IF(AND(Tc_R_Pre>=5,Tc_R_Pre<=10),AP53, IF(AND(Tc_R_Pre>10,Tc_R_Pre<=15), AP54, IF(AND(Tc_R_Pre>15, Tc_R_Pre<=30), AP55, IF(AND(Tc_R_Pre>30, Tc_R_Pre<=60), AP56, VLOOKUP(Tc_R_Pre, INDIRECT(Name_R), 2))))))","v":"Error"},"Error","Error","Error","Error"]
[null,null,null,null,null,null,null,null,null,null,null,null,null,null,null,null,null,null,"NUMBER OF OUTLET PHOTO PAGES",null,1,null,null,null,null,null,null,null,"Applies?","Which case is it?",null,"non-soil"]
[null,null,null,null,null,null,null,null,null,null,null,null,null,null,null,null,null,null,null,null,null,null,null,null,null,null,null,"Case 1",{"$f":"IF(AND(OR(F30=\"None\",F30=\"Potential\"),AB46=\"Decrease\",AB51=\"NO\"),\"YES\",\"\")","v":""},{"$f":"IF(AC60<>\"\",AB60,IF(AC61<>\"\",AB61,IF(AC62<>\"\",AB62,IF(AC63<>\"\",AB63,IF(AC64<>\"\",AB64,IF(AC65<>\"\",AB65,IF(AC66<>\"\",AB66,IF(AC67<>\"\",AB67,IF(AC68<>\"\",AB68,IF(AC69<>\"\",AB69,\"\"))))))))))","v":""}]
[null,null,null,null,null,null,null,null,null,null,null,null,null,null,null,null,null,null,null,null,null,null,null,null,null,null,null,"Case 1A",{"$f":"IF(AND(OR(F30=\"Existing\",F30=\"Both\"),AB46=\"Decrease\",AB51=\"NO\"),\"YES\",\"\")","v":""}]
[null,null,null,null,null,null,null,null,null,null,null,null,null,null,null,null,null,null,null,null,null,null,null,null,null,null,null,"Case 2",{"$f":"IF(AND(OR(F30=\"None\",F30=\"Potential\"),AB46=\"Decrease\",AB51=\"YES\"),\"YES\",\"\")","v":""},null,null,{"$f":"IF(AD60=\"\",\"\",\"Non-Soil, see Note 1 & 2 of Case Table\")","v":""}]
[null,null,null,null,null,null,null,null,null,null,null,null,null,null,null,null,null,null,null,null,null,null,null,null,null,null,null,"Case 2A",{"$f":"IF(AND(OR(F30=\"Existing\",F30=\"Both\"),AB46=\"Decrease\",AB51=\"YES\"),\"YES\",\"\")","v":""},null,null,null,null,null,null,null,null,null,null,"pre-const geometry type"]
[null,null,null,null,null,null,null,null,null,null,null,null,null,null,null,null,null,null,null,null,null,null,null,null,null,null,null,"Case 3",{"$f":"IF(AND(OR(F30=\"None\",F30=\"Potential\"),AB46=\"Increase\",AB51=\"NO\"),\"YES\",\"\")","v":""}]
[null,null,null,null,null,null,null,null,null,null,null,null,null,null,null,null,null,null,null,null,null,null,null,null,null,null,null,"Case 3A",{"$f":"IF(AND(OR(F30=\"Existing\",F30=\"Both\"),AB46=\"Increase\",AB51=\"NO\"),\"YES\",\"\")","v":""},null,null,null,null,null,null,null,null,null,null,"post-const geometry type",null,null,null,"railroad design?"]
[null,null,null,null,null,null,null,null,null,null,null,null,null,null,null,null,null,null,null,null,null,null,null,null,null,null,null,"Case 4",{"$f":"IF(AND(OR(F30=\"None\",F30=\"Potential\"),AB46=\"Increase\",AB51=\"YES\",O17<=0.1),\"YES\",\"\")","v":""}]
[null,null,null,null,null,null,null,null,null,null,null,null,null,null,null,null,null,null,null,null,null,null,null,null,null,null,null,"Case 4A",{"$f":"IF(AND(OR(F30=\"Existing\",F30=\"Both\"),AB46=\"Increase\",AB51=\"YES\",O17<=0.1),\"YES\",\"\")","v":""}]
[null,null,null,null,null,null,null,null,null,null,null,null,null,null,null,null,null,null,null,null,null,null,null,null,null,null,null,"Case 5",{"$f":"IF(AND(OR(F30=\"None\",F30=\"Potential\"),AB46=\"Increase\",AB51=\"YES\",O17>0.1),\"YES\",\"\")","v":""}]
[null,null,null,null,null,null,null,null,null,null,null,null,null,null,null,null,null,null,null,null,null,null,null,null,null,null,null,"Case 5A",{"$f":"IF(AND(OR(F30=\"Existing\",F30=\"Both\"),AB46=\"Increase\",AB51=\"YES\",O17>0.1),\"YES\",\"\")","v":""},null,null,null,null,null,null,null,null,null,"POST"]
[null,null,null,null,null,null,null,null,null,null,null,null,null,null,null,null,null,null,null,null,null,null,null,null,null,null,null,null,null,null,null,null,null,null,null,null,null,null,null,"Intensity Calcs"]
[]
["OUTLET SITE PHOTOS PAGE 1",null,null,null,null,null,null,null,null,null,null,null,null,null,null,null,null,null,null,null,null,null,null,null,null,null,null,null,null,null,null,null,null,null,null,null,null,null,null,null,2,5,10,25,50,100]
[null,null,null,null,null,null,null,null,null,null,null,null,null,null,null,null,null,null,null,null,null,null,null,null,null,null,null,null,null,null,null,null,null,null,null,null,null,null,null,{"$f":"IF(custom_IDF=\"YES\",INDIRECT(\"Z_CUSTOM_IDF\"),IF(county_for_this_outlet=\"New Hanover\", INDIRECT(\"NewHanover\"),INDIRECT(county_for_this_outlet)))","v":{"$error":"#REF!"}}]
["Photo Description Here",null,null,null,null,null,null,null,"Photo Description Here"]
[]
[]
[]
[]
[]
[]
[null,null,null,null,null,null,null,null,null,null,null,null,null,null,null,null,null,null,null,null,null,null,null,null,null,null,null,null,null,null,null,null,null,null,null,null,null,null,null,"5-10",{"$f":"_xlfn.FORECAST.LINEAR(Tc_R_Post,AO73:AO74,$AN73:$AN74)","v":{"$error":"#REF!"}},{"$error":"#REF!"},{"$error":"#REF!"},{"$error":"#REF!"},{"$error":"#REF!"},{"$error":"#REF!"}]
[null,null,null,null,null,null,null,null,null,null,null,null,null,null,null,null,null,null,null,null,null,null,null,null,null,null,null,null,null,null,null,null,null,null,null,null,null,null,null,"10-15",{"$error":"#DIV/0!"},{"$error":"#DIV/0!"},{"$error":"#DIV/0!"},{"$error":"#DIV/0!"},{"$error":"#DIV/0!"},{"$error":"#DIV/0!"}]
[null,null,null,null,null,null,null,null,null,null,null,null,null,null,null,null,null,null,null,null,null,null,null,null,null,null,null,null,null,null,null,null,null,null,null,null,null,null,null,"15-30",{"$error":"#DIV/0!"},{"$error":"#DIV/0!"},{"$error":"#DIV/0!"},{"$error":"#DIV/0!"},{"$error":"#DIV/0!"},{"$error":"#DIV/0!"}]
[null,null,null,null,null,null,null,null,null,null,null,null,null,null,null,null,null,null,null,null,null,null,null,null,null,null,null,null,null,null,null,null,null,null,null,null,null,null,null,"30-60",{"$error":"#DIV/0!"},{"$error":"#DIV/0!"},{"$error":"#DIV/0!"},{"$error":"#DIV/0!"},{"$error":"#DIV/0!"},{"$error":"#DIV/0!"}]
[]
[null,null,null,null,null,null,null,null,null,null,null,null,null,null,null,null,null,null,null,null,null,null,null,null,null,null,null,null,null,null,null,null,null,null,null,null,null,null,null,null,{"$f":"IF(OR(Tc_R_Post>60, Tc_R_Post<5), \"Error\", IF(AND(Tc_R_Post>=5,Tc_R_Post<=10),AO81, IF(AND(Tc_R_Post>10, Tc_R_Post<=15), AO82, IF(AND(Tc_R_Post>15, Tc_R_Post<=30), AO83, IF(AND(Tc_R_Post>30, Tc_R_Post<=60), AO84, VLOOKUP(Tc_R_Post, INDIRECT(Name_R), 2))))))","v":"Error"},"Error","Error","Error","Error","Error"]
[]
[]
[null,null,null,null,null,null,null,null,null,null,null,null,null,null,null,null,null,null,null,null,null,null,null,null,null,null,null,null,null,null,null,null,null,null,null,null,null,null,null,null,null,null,null,null,null,null,null,null,null,null,null,null,null,null,"template for 1 page of photos just copies the formatting from this cell below"]
[null,null,null,null,null,null,null,null,null,null,null,null,null,null,null,null,null,null,null,null,null,null,null,null,null,null,null,null,null,null,null,null,null,null,null,null,null,null,null,null,null,null,null,null,null,null,null,null,null,null,null,null,null,"---->"]
[]
[]
[]
[]
[]
[null,null,null,null,null,null,null,null,null,null,null,null,null,null,null,null,null,null,null,null,null,null,null,null,null,null,null,null,null,null,null,null,null,null,null,null,null,null,null,null,null,null,null,null,null,null,null,null,null,null,null,null,null,null,"TEMPLATE FOR 2 PHOTO PAGES",null,null,null,null,null,null,null,null,null,null,null,null,null,null,null,null,null,"TEMPLATE FOR 3 PHOTO PAGES",null,null,null,null,null,null,null,null,null,null,null,null,null,null,null,null,null,"TEMPLATE FOR 4 PHOTO PAGES",null,null,null,null,null,null,null,null,null,null,null,null,null,null,null,null,null,"TEMPLATE FOR 5 PHOTO PAGES"]
[{"$f":"_xlfn.CONCAT( _xlnm.sheet_title,\" SITE PHOTOS - PAGE 2\")","v":"PSH # OUTLET # SITE PHOTOS - PAGE 2"},null,null,null,null,null,null,null,null,null,null,null,null,null,null,null,null,null,null,null,null,null,null,null,null,null,null,null,null,null,null,null,null,null,null,null,null,null,null,null,null,null,null,null,null,null,null,null,null,null,null,null,null,null,"OUTLET SITE PHOTOS PAGE 2",null,null,null,null,null,null,null,null,null,null,null,null,null,null,null,null,null,"OUTLET SITE PHOTOS PAGE 2",null,null,null,null,null,null,null,null,null,null,null,null,null,null,null,null,null,"OUTLET SITE PHOTOS PAGE 2",null,null,null,null,null,null,null,null,null,null,null,null,null,null,null,null,null,"OUTLET SITE PHOTOS PAGE 2"]
["Photo Description Here",null,null,null,null,null,null,null,"Photo Description Here",null,null,null,null,null,null,null,null,null,null,null,null,null,null,null,null,null,null,null,null,null,null,null,null,null,null,null,null,null,null,null,null,null,null,null,null,null,null,null,null,null,null,null,null,null,"Photo Description Here",null,null,null,null,null,null,null,"Photo Description Here",null,null,null,null,null,null,null,null,null,"Photo Description Here",null,null,null,null,null,null,null,"Photo Description Here",null,null,null,null,null,null,null,null,null,"Photo Description Here",null,null,null,null,null,null,null,"Photo Description Here",null,null,null,null,null,null,null,null,null,"Photo Description Here",null,null,null,null,null,null,null,"Photo Description Here"]
[]
[]
[]
[null,null,null,null,null,null,null,null,null,null,null,null,null,null,null,null,null,null,null,null,null,null,null,null,null,null,null,null,null,null,null,null,null,null,null,null,null,null,null,{"$f":"INDIRECT(New_Hanover)","v":{"$error":"#NAME?"}}]
[]
[]
[null,null,null,null,null,null,null,null,null,null,null,null,null,null,null,null,null,null,null,null,null,null,null,null,null,null,null,null,null,null,null,null,null,null,"hidden da and c pre field values for this sheet",null,null,null,"hidden da and c post field values for this sheet"]
[]
[null,null,null,null,null,null,null,null,null,null,null,null,null,null,null,null,null,null,null,null,null,null,null,null,null,null,null,null,null,null,null,null,null,null,0,null,null,null,0]
[null,null,null,null,null,null,null,null,null,null,null,null,null,null,null,null,null,null,null,null,null,null,null,null,null,null,null,null,null,null,null,null,null,null,0,null,null,null,0]
[null,null,null,null,null,null,null,null,null,null,null,null,null,null,null,null,null,null,null,null,null,null,null,null,null,null,null,null,null,null,null,null,null,null,0,null,null,null,0]
[null,null,null,null,null,null,null,null,null,null,null,null,null,null,null,null,null,null,null,null,null,null,null,null,null,null,null,null,null,null,null,null,null,null,0,null,null,null,0]
[null,null,null,null,null,null,null,null,null,null,null,null,null,null,null,null,null,null,null,null,null,null,null,null,null,null,null,null,null,null,null,null,null,null,0,null,null,null,0]
[null,null,null,null,null,null,null,null,null,null,null,null,null,null,null,null,null,null,null,null,null,null,null,null,null,null,null,null,null,null,null,null,null,null,0,null,null,null,0]
[null,null,null,null,null,null,null,null,null,null,null,null,null,null,null,null,null,null,null,null,null,null,null,null,null,null,null,null,null,null,null,null,null,null,0,null,null,null,0]
["Photo Description Here",null,null,null,null,null,null,null,"Photo Description Here",null,null,null,null,null,null,null,null,null,null,null,null,null,null,null,null,null,null,null,null,null,null,null,null,null,0,null,null,null,0,null,null,null,null,null,null,null,null,null,null,null,null,null,null,null,"Photo Description Here",null,null,null,null,null,null,null,"Photo Description Here",null,null,null,null,null,null,null,null,null,"Photo Description Here",null,null,null,null,null,null,null,"Photo Description Here",null,null,null,null,null,null,null,null,null,"Photo Description Here",null,null,null,null,null,null,null,"Photo Description Here",null,null,null,null,null,null,null,null,null,"Photo Description Here",null,null,null,null,null,null,null,"Photo Description Here"]
[null,null,null,null,null,null,null,null,null,null,null,null,null,null,null,null,null,null,null,null,null,null,null,null,null,null,null,null,null,null,null,null,null,null,0,null,null,null,0]
[null,null,null,null,null,null,null,null,null,null,null,null,null,null,null,null,null,null,null,null,null,null,null,null,null,null,null,null,null,null,null,null,null,null,0,null,null,null,0]
[null,null,null,null,null,null,null,null,null,null,null,null,null,null,null,null,null,null,null,null,null,null,null,null,null,null,null,null,null,null,null,null,null,null,0,null,null,null,0]
[null,null,null,null,null,null,null,null,null,null,null,null,null,null,null,null,null,null,null,null,null,null,null,null,null,null,null,null,null,null,null,null,null,null,0,null,null,null,0]
[]
[]
[]
[]
[]
[]
[]
[]
[]
[]
[]
[]
[{"$f":"_xlfn.CONCAT( _xlnm.sheet_title,\" SITE PHOTOS - PAGE 3\")","v":"PSH # OUTLET # SITE PHOTOS - PAGE 3"},null,null,null,null,null,null,null,null,null,null,null,null,null,null,null,null,null,null,null,null,null,null,null,null,null,null,null,null,null,null,null,null,null,null,null,null,null,null,null,null,null,null,null,null,null,null,null,null,null,null,null,null,null,null,null,null,null,null,null,null,null,null,null,null,null,null,null,null,null,null,null,"OUTLET SITE PHOTOS PAGE 3",null,null,null,null,null,null,null,null,null,null,null,null,null,null,null,null,null,"OUTLET SITE PHOTOS PAGE 3",null,null,null,null,null,null,null,null,null,null,null,null,null,null,null,null,null,"OUTLET SITE PHOTOS PAGE 3"]
["Photo Description Here",null,null,null,null,null,null,null,"Photo Description Here",null,null,null,null,null,null,null,null,null,null,null,null,null,null,null,null,null,null,null,null,null,null,null,null,null,null,null,null,null,null,null,null,null,null,null,null,null,null,null,null,null,null,null,null,null,null,null,null,null,null,null,null,null,null,null,null,null,null,null,null,null,null,null,"Photo Description Here",null,null,null,null,null,null,null,"Photo Description Here",null,null,null,null,null,null,null,null,null,"Photo Description Here",null,null,null,null,null,null,null,"Photo Description Here",null,null,null,null,null,null,null,null,null,"Photo Description Here",null,null,null,null,null,null,null,"Photo Description Here"]
[]
[]
[]
[]
[]
[]
[]
[]
[]
[]
[]
[]
[]
[]
[]
["Photo Description Here",null,null,null,null,null,null,null,"Photo Description Here",null,null,null,null,null,null,null,null,null,null,null,null,null,null,null,null,null,null,null,null,null,null,null,null,null,null,null,null,null,null,null,null,null,null,null,null,null,null,null,null,null,null,null,null,null,null,null,null,null,null,null,null,null,null,null,null,null,null,null,null,null,null,null,"Photo Description Here",null,null,null,null,null,null,null,"Photo Description Here",null,null,null,null,null,null,null,null,null,"Photo Description Here",null,null,null,null,null,null,null,"Photo Description Here",null,null,null,null,null,null,null,null,null,"Photo Description Here",null,null,null,null,null,null,null,"Photo Description Here"]
[]
[]
[]
[]
[]
[]
[]
[]
[]
[]
[]
[]
[]
[]
[]
[]
[{"$f":"_xlfn.CONCAT( _xlnm.sheet_title,\" SITE PHOTOS - PAGE 4\")","v":"PSH # OUTLET # SITE PHOTOS - PAGE 4"},null,null,null,null,null,null,null,null,null,null,null,null,null,null,null,null,null,null,null,null,null,null,null,null,null,null,null,null,null,null,null,null,null,null,null,null,null,null,null,null,null,null,null,null,null,null,null,null,null,null,null,null,null,null,null,null,null,null,null,null,null,null,null,null,null,null,null,null,null,null,null,null,null,null,null,null,null,null,null,null,null,null,null,null,null,null,null,null,null,"OUTLET SITE PHOTOS PAGE 4",null,null,null,null,null,null,null,null,null,null,null,null,null,null,null,null,null,"OUTLET SITE PHOTOS PAGE 4"]
["Photo Description Here",null,null,null,null,null,null,null,"Photo Description Here",null,null,null,null,null,null,null,null,null,null,null,null,null,null,null,null,null,null,null,null,null,null,null,null,null,null,null,null,null,null,null,null,null,null,null,null,null,null,null,null,null,null,null,null,null,null,null,null,null,null,null,null,null,null,null,null,null,null,null,null,null,null,null,null,null,null,null,null,null,null,null,null,null,null,null,null,null,null,null,null,null,"Photo Description Here",null,null,null,null,null,null,null,"Photo Description Here",null,null,null,null,null,null,null,null,null,"Photo Description Here",null,null,null,null,null,null,null,"Photo Description Here"]
[]
[]
[]
[]
[]
[]
[]
[]
[]
[]
[]
[]
[]
[]
[]
["Photo Description Here",null,null,null,null,null,null,null,"Photo Description Here",null,null,null,null,null,null,null,null,null,null,null,null,null,null,null,null,null,null,null,null,null,null,null,null,null,null,null,null,null,null,null,null,null,null,null,null,null,null,null,null,null,null,null,null,null,null,null,null,null,null,null,null,null,null,null,null,null,null,null,null,null,null,null,null,null,null,null,null,null,null,null,null,null,null,null,null,null,null,null,null,null,"Photo Description Here",null,null,null,null,null,null,null,"Photo Description Here",null,null,null,null,null,null,null,null,null,"Photo Description Here",null,null,null,null,null,null,null,"Photo Description Here"]
[]
[]
[]
[]
[]
[]
[]
[]
[]
[]
[]
[]
[]
[]
[]
[]
[{"$f":"_xlfn.CONCAT( _xlnm.sheet_title,\" SITE PHOTOS - PAGE 5\")","v":"PSH # OUTLET # SITE PHOTOS - PAGE 5"},null,null,null,null,null,null,null,null,null,null,null,null,null,null,null,null,null,null,null,null,null,null,null,null,null,null,null,null,null,null,null,null,null,null,null,null,null,null,null,null,null,null,null,null,null,null,null,null,null,null,null,null,null,null,null,null,null,null,null,null,null,null,null,null,null,null,null,null,null,null,null,null,null,null,null,null,null,null,null,null,null,null,null,null,null,null,null,null,null,null,null,null,null,null,null,null,null,null,null,null,null,null,null,null,null,null,null,"OUTLET SITE PHOTOS PAGE 5"]
["Photo Description Here",null,null,null,null,null,null,null,"Photo Description Here",null,null,null,null,null,null,null,null,null,null,null,null,null,null,null,null,null,null,null,null,null,null,null,null,null,null,null,null,null,null,null,null,null,null,null,null,null,null,null,null,null,null,null,null,null,null,null,null,null,null,null,null,null,null,null,null,null,null,null,null,null,null,null,null,null,null,null,null,null,null,null,null,null,null,null,null,null,null,null,null,null,null,null,null,null,null,null,null,null,null,null,null,null,null,null,null,null,null,null,"Photo Description Here",null,null,null,null,null,null,null,"Photo Description Here"]
[]
[]
[]
[]
[]
[]
[]
[]
[]
[]
[]
[]
[]
[]
[]
["Photo Description Here",null,null,null,null,null,null,null,"Photo Description Here",null,null,null,null,null,null,null,null,null,null,null,null,null,null,null,null,null,null,null,null,null,null,null,null,null,null,null,null,null,null,null,null,null,null,null,null,null,null,null,null,null,null,null,null,null,null,null,null,null,null,null,null,null,null,null,null,null,null,null,null,null,null,null,null,null,null,null,null,null,null,null,null,null,null,null,null,null,null,null,null,null,null,null,null,null,null,null,null,null,null,null,null,null,null,null,null,null,null,null,"Photo Description Here",null,null,null,null,null,null,null,"Photo Description Here"]
[]
[]
[]
[]
[]
[]
[]
[]
[]
[]
[]
[]
[]
[]
[]
[]
[]
[]
[{"$f":"_xlfn.CONCAT(\"ADDITIONAL INFORMATION - LAND USE BREAKDOWN SUMMARY - \",_xlnm.sheet_title)","v":"ADDITIONAL INFORMATION - LAND USE BREAKDOWN SUMMARY - PSH # OUTLET #"}]
[]
["PRE-CONSTRUCTION",null,null,null,null,null,null,null,"POST-CONSTRUCTION"]
[]
["LAND USE",null,null,null,null,"ACRES",null,null,"LAND USE",null,null,null,null,null,"ACRES"]
["IMPERVIOUS AREA WITHIN RIGHT OF WAY / EASEMENT / NCDOT CONTRIBUTION",null,null,null,null,{"$f":"IF(VALUE(da_imp_onsite_pre_field)=0,\"-\",VALUE(da_imp_onsite_pre_field))","v":"-"},null,null,"IMPERVIOUS AREA WITHIN RIGHT OF WAY / EASEMENT / NCDOT CONTRIBUTION (ACRES)",null,null,null,null,null,{"$f":"IF(VALUE(da_imp_onsite_post_field)=0,\"-\",VALUE(da_imp_onsite_post_field))","v":"-"}]
[]
[]
["IMPERVIOUS AREA OUTSIDE RIGHT OF WAY / EASEMENT (ACRES)",null,null,null,null,{"$f":"IF(VALUE(da_imp_offsite_pre_field)=0,\"-\",VALUE(da_imp_offsite_pre_field))","v":"-"},null,null,"IMPERVIOUS AREA OUTSIDE RIGHT OF WAY / EASEMENT (ACRES)",null,null,null,null,null,{"$f":"IF(VALUE(da_imp_offsite_post_field)=0,\"-\",VALUE(da_imp_offsite_post_field))","v":"-"}]
[]
[]
["GRASS AREA WITHIN RIGHT OF WAY / EASEMENT / NCDOT CONTRIBUTION (ACRES)",null,null,null,null,{"$f":"IF(VALUE(da_grass_onsite_pre_field)=0,\"-\",VALUE(da_grass_onsite_pre_field))","v":"-"},null,null,"GRASS AREA WITHIN RIGHT OF WAY / EASEMENT / NCDOT CONTRIBUTION (ACRES)",null,null,null,null,null,{"$f":"IF(VALUE(da_grass_onsite_post_field)=0,\"-\",VALUE(da_grass_onsite_post_field))","v":"-"}]
[]
[]
["GRASS AREA OUTSIDE RIGHT OF WAY / EASEMENT (ACRES)",null,null,null,null,{"$f":"IF(VALUE(da_grass_offsite_pre_field)=0,\"-\",VALUE(da_grass_offsite_pre_field))","v":"-"},null,null,"GRASS AREA OUTSIDE RIGHT OF WAY / EASEMENT (ACRES)",null,null,null,null,null,{"$f":"IF(VALUE(da_grass_offsite_post_field)=0,\"-\",VALUE(da_grass_offsite_post_field))","v":"-"}]
[]
[]
["WOODS AREA WITHIN RIGHT OF WAY / EASEMENT / NCDOT CONTRIBUTION (ACRES)",null,null,null,null,{"$f":"IF(VALUE(da_woods_onsite_pre_field)=0,\"-\",VALUE(da_woods_onsite_pre_field))","v":"-"},null,null,"WOODS AREA WITHIN RIGHT OF WAY / EASEMENT / NCDOT CONTRIBUTION (ACRES)",null,null,null,null,null,{"$f":"IF(VALUE(da_woods_onsite_post_field)=0,\"-\",VALUE(da_woods_onsite_post_field))","v":"-"}]
[]
[]
["WOODS AREA OUTSIDE RIGHT OF WAY / EASEMENT (ACRES)",null,null,null,null,{"$f":"IF(VALUE(da_woods_offsite_pre_field)=0,\"-\",VALUE(da_woods_offsite_pre_field))","v":"-"},null,null,"WOODS AREA OUTSIDE RIGHT OF WAY / EASEMENT (ACRES)",null,null,null,null,null,{"$f":"IF(VALUE(da_woods_offsite_post_field)=0,\"-\",VALUE(da_woods_offsite_post_field))","v":"-"}]
[]
[]
["OTHER LAND USE #1 WITHIN RIGHT OF WAY / EASEMENT / NCDOT CONTRIBUTION (ACRES)",null,null,null,null,{"$f":"IF(VALUE(da_other1_onsite_pre_field)=0,\"-\",VALUE(da_other1_onsite_pre_field))","v":"-"},null,null,"OTHER LAND USE #1 WITHIN RIGHT OF WAY / EASEMENT / NCDOT CONTRIBUTION (ACRES)",null,null,null,null,null,{"$f":"IF(VALUE(da_other1_onsite_post_field)=0,\"-\",VALUE(da_other1_onsite_post_field))","v":"-"}]
[]
[]
["OTHER LAND USE #1 OUTSIDE RIGHT OF WAY / EASEMENT (ACRES)",null,null,null,null,{"$f":"IF(VALUE(da_other1_offsite_pre_field)=0,\"-\",VALUE(da_other1_offsite_pre_field))","v":"-"},null,null,"OTHER LAND USE #1 OUTSIDE RIGHT OF WAY / EASEMENT (ACRES)",null,null,null,null,null,{"$f":"IF(VALUE(da_other1_offsite_post_field)=0,\"-\",VALUE(da_other1_offsite_post_field))","v":"-"}]
[]
[]
["OTHER LAND USE #2 WITHIN RIGHT OF WAY / EASEMENT / NCDOT CONTRIBUTION (ACRES)",null,null,null,null,{"$f":"IF(VALUE(da_other2_onsite_pre_field)=0,\"-\",VALUE(da_other2_onsite_pre_field))","v":"-"},null,null,"OTHER LAND USE #1 WITHIN RIGHT OF WAY / EASEMENT / NCDOT CONTRIBUTION (ACRES)",null,null,null,null,null,{"$f":"IF(VALUE(da_other2_onsite_post_field)=0,\"-\",VALUE(da_other2_onsite_post_field))","v":"-"}]
[]
[]
["OTHER LAND USE #2 OUTSIDE RIGHT OF WAY / EASEMENT (ACRES)",null,null,null,null,{"$f":"IF(VALUE(da_other2_offsite_pre_field)=0,\"-\",VALUE(da_other2_offsite_pre_field))","v":"-"},null,null,"OTHER LAND USE #1 OUTSIDE RIGHT OF WAY / EASEMENT (ACRES)",null,null,null,null,null,{"$f":"IF(VALUE(da_other2_offsite_post_field)=0,\"-\",VALUE(da_other2_offsite_post_field))","v":"-"}]
[]
[]
["OTHER LAND USE #3 WITHIN RIGHT OF WAY / EASEMENT / NCDOT CONTRIBUTION (ACRES)",null,null,null,null,{"$f":"IF(VALUE(da_other3_onsite_pre_field)=0,\"-\",VALUE(da_other3_onsite_pre_field))","v":"-"},null,null,"OTHER LAND USE #1 WITHIN RIGHT OF WAY / EASEMENT / NCDOT CONTRIBUTION (ACRES)",null,null,null,null,null,{"$f":"IF(VALUE(da_other3_onsite_post_field)=0,\"-\",VALUE(da_other3_onsite_post_field))","v":"-"}]
[]
[]
["OTHER LAND USE #3 OUTSIDE RIGHT OF WAY / EASEMENT (ACRES)",null,null,null,null,{"$f":"IF(VALUE(da_other3_offsite_pre_field)=0,\"-\",VALUE(da_other3_offsite_pre_field))","v":"-"},null,null,"OTHER LAND USE #1 OUTSIDE RIGHT OF WAY / EASEMENT (ACRES)",null,null,null,null,null,{"$f":"IF(VALUE(da_other3_offsite_post_field)=0,\"-\",VALUE(da_other3_offsite_post_field))","v":"-"},null,null,null,null,null,null,null,null,null,null,null,null,null,null,null,null,null,null,null,"τ10 Post = "]
[]
[]
[]
[]
[]
["ROWS HOLDING CELL DATA BELOW TO BE HIDDEN (CELLS HOLD DATA+FORMATTING FOR MACROS AND CALCULATIONS)"]
[]
[]
["hidden formatting for triangular / trapezoidal macros DO NOT TOUCH",null,null,null,null,null,null,null,"hidden formatting for triangular / trapezoidal macros DO NOT TOUCH"]
["Depth (ft) =",null,null,null,"H:V (Lt) = ",null,null,null,"Depth (ft) =",null,"H:V (Lt) ="]
["Slope (ft/ft) = ",null,null,null,"H:V (Rt) = ",null,null,null,"Slope (ft/ft) = ",null,"H:V (Rt) ="]
["Manning's N =",null,null,null,"Base Width (ft.) =",0,null,null,"Manning's N =",null,"Base Width ="]
["Notes (lining, condition, etc.): ",null,null,null,null,null,null,null,"Notes (lining, condition, etc.): "]
[]
[]
[]
[]
[]
["hidden formatting for irregular channel macro DO NOT TOUCH",null,null,null,null,null,null,null,"hidden formatting for irregular channel macro DO NOT TOUCH"]
[]
[{"$f":"IF(AND($J$30<>\"\",Post_Const_Geometry_Selection=\"Geometry Same as Pre-Construction\"),\"Slope (ft/ft) = \",\"\")","v":""},null,null,null,null,null,null,null,{"$f":"IF($J$30<>\"\",\"Slope (ft/ft) = \",\"\")","v":""}]
["Notes:",null,null,null,null,null,null,null,"Notes:"]
[]
[]
[]
[]
[]
["hidden formatting for pipe macros DO NOT TOUCH",null,null,null,null,null,null,null,"hidden formatting for pipe macros DO NOT TOUCH",null,null,null,null,null,null,null,null,null,null,"hidden formatting for blank DO NOT TOUCH"]
["Diameter (in) =",null,null,null,"QCapacity (cfs) =",{"$f":"IF(OR(B302=\"\",B303=\"\"),\"\",IFERROR(MIN((SQRT(B303)/D304)*((B302/16)^(8/3)),VLOOKUP(B302,'PICK LISTS'!$E$44:$F$54,2,FALSE)),(SQRT(B303)/D304)*((B302/16)^(8/3))))","v":""},null,null,"Diameter (in) =",null,null,"QCapacity (cfs) = ",null,{"$f":"IF(OR(J302=\"\",J303=\"\"),\"\",IFERROR(MIN((SQRT(J303)/K304)*((J302/16)^(8/3)),VLOOKUP(J302,'PICK LISTS'!$E$44:$F$54,2,FALSE)),(SQRT(J303)/K304)*((J302/16)^(8/3))))","v":""},{"$f":"IF(OR(N302=\"\",N303=\"\"),\"\",IF(N303>N302,\"NOTE: Q10 > Qfull\",\"Q10 < Qfull\"))","v":""},null,null,null,null,"Notes:"]
["Slope (ft/ft) = ",null,null,null,"Q10pre (cfs) =",{"$f":"$E$16","v":0},null,null,"Slope (ft/ft) = ",null,null,"Q10 Post (cfs) = ",null,{"$f":"$K$16","v":0}]
["Pipe Material =","RCP",null,{"$f":"VLOOKUP(B304,'PICK LISTS'!$E$29:$F$33, 2,FALSE)","v":1.2E-2},null,null,null,null,"Pipe Material =","RCP",{"$f":"VLOOKUP(J304,'PICK LISTS'!$E$29:$F$33, 2,FALSE)","v":1.2E-2}]
["Notes:",null,null,null,null,null,null,null,"Notes:"]
[]
[]
[]
[]
[null,null,null,null,null,null,null,null,"hidden formatting for same as pre const. ds rec pipe macro DO NOT TOUCH"]
[]
[null,null,null,null,null,null,null,null,null,null,"Qfull (cfs) = ",{"$f":"F311","v":0},null,{"$f":"IF(OR(L312=\"\",L313=\"\"),\"\",IF(L313>L312,\"NOTE: Q10 > Qfull\",\"Q10 < Qfull\"))","v":""}]
[null,null,null,null,null,null,null,null,null,null,"Q10 Post (cfs) = ",{"$f":"IF($K$16=0,\"\",$K$16)","v":""}]
[]
[]
[]
[]
[]
[]
[]
["SOIL TYPE"]
[]
["LINER TYPE"]
[]
[]
[]
[null,{"$f":"IF($I$30=\"N/A\",\"N/A\",IF(Soil_Type=\"Permanent Matting Product (stable)\",\"User to Define\",IF($J$30<>\"\",\"N/A\",IF($I$30=\"Soil\",$AD$41,IF($I$30=\"Non-Soil\",$AD$43,\"\")))))","v":""}]
[null,{"$f":"IF($A$34=\"SOIL TYPE\",\"N/A\",IF(Soil_Type=\"Grass / Dense Veg. (no bare soil spots)\",\"N/A\",IF($J$30<>\"\",$AD$43,\"\")))","v":""}]

{"sheet":"USGS-5030 TAB TEMPLATE","index":5,"n_rows":299,"n_cols":117,"rows_kept":299,"cut":false,"hidden":true,"merged":[[291,1,291,4],[293,1,293,4],[35,3,36,5],[58,29,58,30],[58,31,60,32],[59,29,68,30],[61,31,68,32],[164,0,164,16],[165,0,180,7],[165,8,180,16],[181,0,197,7],[181,8,197,16],[198,0,198,16],[199,0,214,7],[199,8,214,16],[215,0,231,7],[215,8,231,16],[97,0,112,7],[97,8,112,16],[113,0,129,7],[113,8,129,16],[130,0,130,16],[131,0,146,7],[131,8,146,16],[282,13,284,14],[256,0,257,5],[256,8,257,15],[272,14,274,15],[35,7,35,9],[35,10,35,15],[5,4,5,5],[265,0,267,5],[265,8,267,15],[12,0,13,0],[12,7,13,7],[5,1,5,3],[7,0,7,5],[7,7,7,11],[7,13,7,15],[272,19,276,24],[275,0,276,5],[275,8,276,15],[71,0,72,16],[73,0,95,7],[73,8,95,16],[40,0,41,5],[40,8,41,14],[43,0,47,5],[43,8,47,15],[50,0,50,16],[51,0,70,16],[96,0,96,16],[147,0,163,7],[147,8,163,16],[215,108,231,115],[215,116,231,124],[249,0,251,24],[253,10,253,12],[254,10,254,12],[255,10,255,12],[181,90,197,97],[181,98,197,106],[181,108,197,115],[181,116,197,124],[198,108,198,124],[199,108,214,115],[199,116,214,124],[164,90,164,106],[164,108,164,124],[165,90,180,97],[165,98,180,106],[165,108,180,115],[165,116,180,124],[147,72,163,79],[147,80,163,88],[147,90,163,97],[147,98,163,106],[147,108,163,115],[147,116,163,124],[130,72,130,88],[130,90,130,106],[130,108,130,124],[131,72,146,79],[131,80,146,88],[131,90,146,97],[131,98,146,106],[131,108,146,115],[131,116,146,124],[97,108,112,115],[97,116,112,124],[104,34,105,34],[113,54,129,61],[113,62,129,70],[113,72,129,79],[113,80,129,88],[113,90,129,97],[113,98,129,106],[113,108,129,115],[97,54,112,61],[97,62,112,70],[97,72,112,79],[97,80,112,88],[97,90,112,97],[97,98,112,106],[113,116,129,124],[95,72,95,88],[95,90,95,106],[95,108,95,124],[96,54,96,70],[96,72,96,88],[96,90,96,106],[96,108,96,124],[58,18,59,19],[58,20,59,20],[95,54,95,70],[36,27,36,28],[38,0,38,5],[38,8,38,15],[16,0,17,0],[16,1,17,1],[16,7,17,7],[16,8,17,8],[16,18,29,23],[33,1,33,4],[33,7,33,9],[33,10,33,15],[28,0,29,0],[28,3,30,4],[29,5,29,6],[28,7,30,7],[15,18,15,23],[7,38,8,38],[7,39,8,39],[7,40,8,40],[7,41,8,41],[7,42,8,42],[7,43,8,43],[7,31,8,31],[7,32,8,32],[7,33,8,33],[7,34,8,34],[7,35,8,35],[7,36,8,36],[7,26,8,26],[7,27,8,27],[7,28,8,28],[7,29,8,29],[7,30,8,30],[2,1,4,4],[1,7,1,8],[2,5,2,9],[0,11,0,16],[7,44,8,44],[7,45,8,45],[7,46,8,46],[7,47,8,47],[7,48,8,48],[0,25,3,51],[0,52,3,75],[0,76,3,99],[0,100,3,125],[1,11,1,16],[5,26,6,36],[5,38,6,48],[2,11,2,16],[3,5,3,9],[3,11,3,16],[5,11,5,13],[5,14,5,15]]}
["TIP Project:",{"$f":"TIP_number_MAIN_tab","v":0},null,null,null,null,null,null,null,null,"Date:",{"$f":"Date_MAIN_tab","v":"00:00:00"},null,null,null,null,null,null,null,null,null,null,null,null,null,"COLUMNS HOLDING CELLS BELOW TO BE HIDDEN (CELLS HOLD BACKGROUND DATA FOR MACROS AND CALCULATIONS)",null,null,null,null,null,null,null,null,null,null,null,null,null,null,null,null,null,null,null,null,null,null,null,null,null,null,"COLUMNS HOLDING CELLS BELOW TO BE HIDDEN (CELLS HOLD BACKGROUND DATA FOR MACROS AND CALCULATIONS)",null,null,null,null,null,null,null,null,null,null,null,null,null,null,null,null,null,null,null,null,null,null,null,"COLUMNS HOLDING CELLS BELOW TO BE HIDDEN (CELLS HOLD BACKGROUND DATA FOR MACROS AND CALCULATIONS)",null,null,null,null,null,null,null,null,null,null,null,null,null,null,null,null,null,null,null,null,null,null,null,"COLUMNS HOLDING CELLS BELOW TO BE HIDDEN (CELLS HOLD BACKGROUND DATA FOR MACROS AND CALCULATIONS)"]
["County:",null,null,null,null,null,null,"PSH # OUTLET #",null,null,"  Design Firm:",{"$f":"design_firm_MAIN_tab","v":0}]
["Description:",{"$f":"IF(project_description_MAIN_tab=\"\",\"\",project_description_MAIN_tab)","v":""},null,null,null,null,null,"PSH # OUTLET #",null,null,"  Designed By:",{"$f":"designer_MAIN_tab","v":0}]
[null,null,null,null,null,"Input Alignment, Station, Offset Here",null,null,null,null,"Reviewed By:"]
[]
[{"$f":"MAIN!A37","v":"Version 1.0"},"Outlet UID Number:",null,null,{"$f":"IF(TIP_number_MAIN_tab=0,\"ENTER TIP OR PROJ #\",AG30)","v":"ENTER TIP OR PROJ #"},null,null,"Latitude:",null,null,"Longitude:",null,null,null,"Google Maps",null,null,null,null,null,null,null,null,null,null,null,"PRE CONST. MANNING'S EQUATION OPEN CHANNEL",null,null,null,null,null,null,null,null,null,null,null,"POST CONST. MANNING'S EQUATION OPEN CHANNEL"]
[]
["PRE-CONSTRUCTION (USGS-5030 METHOD)",null,null,null,null,null,null,"POST-CONSTRUCTION (USGS-5030 METHOD)",null,null,null,null,null,"CHANGE",null,null,null,null,null,null,null,null,null,null,null,null,"B (ft)","norm. depth (ft)","avg sideslope","S (ft/ft)","N val","A (sq.ft.)","P (ft.)","R (ft.)","Q (cfs)","Vc (ft/s)","Q Compare Check: Make sure = 0 (set to 0 by changing y in data>what if> goal seek)",null,"B (ft)","norm. depth (ft)","avg sideslope","S (ft/ft)","N val","A (sq.ft.)","P (ft.)","R (ft.)","Q (cfs)","Vc (ft/s)","Q Compare Check: Make sure = 0 (set to 0 by changing y in data>what if> goal seek)"]
[]
[null,null,null,"Q2 =",null,"cfs",null,null,null,"Q2 =",null,"cfs",null,"Q2 =",{"$f":"IF(OR(q2post=\"\",q2pre=\"\"),\"\",(q2post/q2pre)-1)","v":""}]
["DA (SQ. MI.) = ",null,null,"V2 =",null,"ft./s",null,"DA (SQ. MI.) = ",null,"V2 =",null,"ft./s",null,"V2 =",{"$f":"IF(OR(v2post=0,v2pre=0),\"\",(v2post/v2pre)-1)","v":""},null,null,null,"Green = Calculated / up to date (color 210,255,210)",null,null,null,null,null,null,null,{"$f":"Base_Width_Pre","v":0},1.4727991030475791,{"$f":"(Side_Slope_Left_Pre+Side_Slope_Right_Pre)/2","v":0},{"$f":"Slope_Pre","v":0},{"$f":"Roughness_Pre","v":0},{"$f":"AA11*AB11+AC11*AB11^2","v":0},{"$f":"AA11+((AB11*Side_Slope_Left_Pre)^2+AB11^2)^0.5+((AB11*Side_Slope_Right_Pre)^2+AB11^2)^0.5","v":2.9455982060951582},{"$f":"AF11/AG11","v":0},{"$f":"1.49/AE11*AF11*AH11^0.667*AD11^0.5","v":{"$error":"#DIV/0!"}},{"$f":"1.49/AE11*AH11^0.667*AD11^0.5","v":{"$error":"#DIV/0!"}},{"$f":"AI11-q2pre","v":{"$error":"#DIV/0!"}},{"$f":"ROUND(AK11,1)","v":{"$error":"#DIV/0!"}},{"$f":"IF(Post_Const_Geometry_Selection=\"Geometry Same as Pre-Construction\",Base_Width_Pre,Base_Width_Post)","v":0},1,{"$f":"IF(Post_Const_Geometry_Selection=\"Geometry Same as Pre-Construction\",(Side_Slope_Left_Pre+Side_Slope_Right_Pre)/2,(Side_Slope_Left_Post+Side_Slope_Right_Post)/2)","v":0},{"$f":"IF(Post_Const_Geometry_Selection=\"Geometry Same as Pre-Construction\",Slope_Pre,Slope_Post)","v":0},{"$f":"IF(Post_Const_Geometry_Selection=\"Geometry Same as Pre-Construction\",Roughness_Pre,Roughness_Post)","v":0},{"$f":"AM11*AN11+AO11*AN11^2","v":0},{"$f":"IF(Post_Const_Geometry_Selection=\"Geometry Same as Pre-Construction\",AM11+((AN11*Side_Slope_Left_Pre)^2+AN11^2)^0.5+((AN11*Side_Slope_Right_Pre)^2+AN11^2)^0.5,AM11+((AN11*Side_Slope_Left_Post)^2+AN11^2)^0.5+((AN11*Side_Slope_Right_Post)^2+AN11^2)^0.5)","v":2},{"$f":"AR11/AS11","v":0},{"$f":"1.49/AQ11*AR11*AT11^0.667*AP11^0.5","v":{"$error":"#DIV/0!"}},{"$f":"1.49/AQ11*AT11^0.667*AP11^0.5","v":{"$error":"#DIV/0!"}},{"$f":"AU11-q2post","v":{"$error":"#DIV/0!"}},{"$f":"ROUND(AW11,1)","v":{"$error":"#DIV/0!"}}]
["Hyd. Region = ",null,null,"D2 =",null,"ft.",null,"Hyd. Region = ",{"$f":"IF(B12=\"\",\"\",B12)","v":""},"D2 =",null,"ft.",null,"D2 =",{"$f":"IF(OR(d2post=0,d2pre=0),\"\",(d2post/d2pre)-1)","v":""},null,null,null,"Red = Calculated, incorrect, or not up to date (color 255,165,165)",null,null,null,null,null,null,null,{"$f":"Base_Width_Pre","v":0},1.4727991030475791,{"$f":"(Side_Slope_Left_Pre+Side_Slope_Right_Pre)/2","v":0},{"$f":"Slope_Pre","v":0},{"$f":"Roughness_Pre","v":0},{"$f":"AA12*AB12+AC12*AB12^2","v":0},{"$f":"AA12+((AB12*Side_Slope_Left_Pre)^2+AB12^2)^0.5+((AB12*Side_Slope_Right_Pre)^2+AB12^2)^0.5","v":2.9455982060951582},{"$f":"AF12/AG12","v":0},{"$f":"1.49/AE12*AF12*AH12^0.667*AD12^0.5","v":{"$error":"#DIV/0!"}},{"$f":"1.49/AE12*AH12^0.667*AD12^0.5","v":{"$error":"#DIV/0!"}},{"$f":"AI12-q2pre","v":{"$error":"#DIV/0!"}},{"$f":"ROUND(AK12,1)","v":{"$error":"#DIV/0!"}},{"$f":"IF(Post_Const_Geometry_Selection=\"Geometry Same as Pre-Construction\",Base_Width_Pre,Base_Width_Post)","v":0},1,{"$f":"IF(Post_Const_Geometry_Selection=\"Geometry Same as Pre-Construction\",(Side_Slope_Left_Pre+Side_Slope_Right_Pre)/2,(Side_Slope_Left_Post+Side_Slope_Right_Post)/2)","v":0},{"$f":"IF(Post_Const_Geometry_Selection=\"Geometry Same as Pre-Construction\",Slope_Pre,Slope_Post)","v":0},{"$f":"IF(Post_Const_Geometry_Selection=\"Geometry Same as Pre-Construction\",Roughness_Pre,Roughness_Post)","v":0},{"$f":"AM12*AN12+AO12*AN12^2","v":0},{"$f":"IF(Post_Const_Geometry_Selection=\"Geometry Same as Pre-Construction\",AM12+((AN12*Side_Slope_Left_Pre)^2+AN12^2)^0.5+((AN12*Side_Slope_Right_Pre)^2+AN12^2)^0.5,AM12+((AN12*Side_Slope_Left_Post)^2+AN12^2)^0.5+((AN12*Side_Slope_Right_Post)^2+AN12^2)^0.5)","v":2},{"$f":"AR12/AS12","v":0},{"$f":"1.49/AQ12*AR12*AT12^0.667*AP12^0.5","v":{"$error":"#DIV/0!"}},{"$f":"1.49/AQ12*AT12^0.667*AP12^0.5","v":{"$error":"#DIV/0!"}},{"$f":"AU12-q2post","v":{"$error":"#DIV/0!"}},{"$f":"ROUND(AW12,1)","v":{"$error":"#DIV/0!"}}]
["% Imp. Area (Total) =",null,null,"Q5 =",null,"cfs",null,"% Imp. Area (Total) =",null,"Q5 =",null,"cfs",null,"Q5 =",{"$f":"IF(OR(q5post=\"\",q5pre=\"\"),\"\",(q5post/q5pre)-1)","v":""},null,null,null,"light blue = user iput (cells unlocked) (color 190,240,240)"]
[null,null,null,"V5 =",null,"ft./s",null,null,null,"V5 =",null,"ft./s",null,"V5 =",{"$f":"IF(OR(v5post=0,v5pre=0),\"\",(v5post/v5pre)-1)","v":""},null,null,null,"Yellow = Warning / Caution           (color 255,255,100)",null,null,null,null,null,null,null,{"$f":"Base_Width_Pre","v":0},1.5647239205356298,{"$f":"(Side_Slope_Left_Pre+Side_Slope_Right_Pre)/2","v":0},{"$f":"Slope_Pre","v":0},{"$f":"Roughness_Pre","v":0},{"$f":"AA14*AB14+AC14*AB14^2","v":0},{"$f":"AA14+((AB14*Side_Slope_Left_Pre)^2+AB14^2)^0.5+((AB14*Side_Slope_Right_Pre)^2+AB14^2)^0.5","v":3.1294478410712596},{"$f":"AF14/AG14","v":0},{"$f":"1.49/AE14*AF14*AH14^0.667*AD14^0.5","v":{"$error":"#DIV/0!"}},{"$f":"1.49/AE14*AH14^0.667*AD14^0.5","v":{"$error":"#DIV/0!"}},{"$f":"AI14-q5pre","v":{"$error":"#DIV/0!"}},{"$f":"ROUND(AK14,1)","v":{"$error":"#DIV/0!"}},{"$f":"IF(Post_Const_Geometry_Selection=\"Geometry Same as Pre-Construction\",Base_Width_Pre,Base_Width_Post)","v":0},1,{"$f":"IF(Post_Const_Geometry_Selection=\"Geometry Same as Pre-Construction\",(Side_Slope_Left_Pre+Side_Slope_Right_Pre)/2,(Side_Slope_Left_Post+Side_Slope_Right_Post)/2)","v":0},{"$f":"IF(Post_Const_Geometry_Selection=\"Geometry Same as Pre-Construction\",Slope_Pre,Slope_Post)","v":0},{"$f":"IF(Post_Const_Geometry_Selection=\"Geometry Same as Pre-Construction\",Roughness_Pre,Roughness_Post)","v":0},{"$f":"AM14*AN14+AO14*AN14^2","v":0},{"$f":"IF(Post_Const_Geometry_Selection=\"Geometry Same as Pre-Construction\",AM14+((AN14*Side_Slope_Left_Pre)^2+AN14^2)^0.5+((AN14*Side_Slope_Right_Pre)^2+AN14^2)^0.5,AM14+((AN14*Side_Slope_Left_Post)^2+AN14^2)^0.5+((AN14*Side_Slope_Right_Post)^2+AN14^2)^0.5)","v":2},{"$f":"AR14/AS14","v":0},{"$f":"1.49/AQ14*AR14*AT14^0.667*AP14^0.5","v":{"$error":"#DIV/0!"}},{"$f":"1.49/AQ14*AT14^0.667*AP14^0.5","v":{"$error":"#DIV/0!"}},{"$f":"AU14-q5post","v":{"$error":"#DIV/0!"}},{"$f":"ROUND(AW14,1)","v":{"$error":"#DIV/0!"}}]
["DA imp in R/W = ",null,null,"D5 =",null,"ft.",null,"DA imp in R/W = ",null,"D5 =",null,"ft.",null,"D5 =",{"$f":"IF(OR(d5post=0,d5pre=0),\"\",(d5post/d5pre)-1)","v":""},null,null,null,null,null,null,null,null,null,null,null,{"$f":"Base_Width_Pre","v":0},1.5647239205356298,{"$f":"(Side_Slope_Left_Pre+Side_Slope_Right_Pre)/2","v":0},{"$f":"Slope_Pre","v":0},{"$f":"Roughness_Pre","v":0},0,{"$f":"AA15+((AB15*Side_Slope_Left_Pre)^2+AB15^2)^0.5+((AB15*Side_Slope_Right_Pre)^2+AB15^2)^0.5","v":3.1294478410712596},0,{"$error":"#DIV/0!"},{"$error":"#DIV/0!"},{"$f":"AI15-q5pre","v":{"$error":"#DIV/0!"}},{"$error":"#DIV/0!"},{"$f":"IF(Post_Const_Geometry_Selection=\"Geometry Same as Pre-Construction\",Base_Width_Pre,Base_Width_Post)","v":0},1,{"$f":"IF(Post_Const_Geometry_Selection=\"Geometry Same as Pre-Construction\",(Side_Slope_Left_Pre+Side_Slope_Right_Pre)/2,(Side_Slope_Left_Post+Side_Slope_Right_Post)/2)","v":0},{"$f":"IF(Post_Const_Geometry_Selection=\"Geometry Same as Pre-Construction\",Slope_Pre,Slope_Post)","v":0},{"$f":"IF(Post_Const_Geometry_Selection=\"Geometry Same as Pre-Construction\",Roughness_Pre,Roughness_Post)","v":0},0,{"$f":"IF(Post_Const_Geometry_Selection=\"Geometry Same as Pre-Construction\",AM15+((AN15*Side_Slope_Left_Pre)^2+AN15^2)^0.5+((AN15*Side_Slope_Right_Pre)^2+AN15^2)^0.5,AM15+((AN15*Side_Slope_Left_Post)^2+AN15^2)^0.5+((AN15*Side_Slope_Right_Post)^2+AN15^2)^0.5)","v":2},0,{"$error":"#DIV/0!"},{"$error":"#DIV/0!"},{"$f":"AU15-q5post","v":{"$error":"#DIV/0!"}},{"$error":"#DIV/0!"}]
[null,null,null,"Q10 =",null,"cfs",null,null,null,"Q10 =",null,"cfs",null,"Q10 =",{"$f":"IF(OR(q10post=\"\",q10pre=\"\"),\"\",(q10post/q10pre)-1)","v":""},null,null,null,"User Notes (will not be printed)",null,null,null,null,null,null,null,null,null,null,null,null,null,null,null,null,null,null,0]
["% Imp. Area (NCDOT Contribution)",{"$f":"IF(OR(da_pre_imp=0,da_total_pre=0),\"\",(da_pre_imp/(da_total_pre*640)))","v":""},null,"V10 =",null,"ft./s",null,"% Imp. Area (NCDOT Contribution)",{"$f":"IF(OR(da_post_imp=0,da_total_post=0),\"\",(da_post_imp/(da_total_post*640)))","v":""},"V10 =",null,"ft./s",null,"V10 =",{"$f":"IF(OR(v10post=0,v10pre=0),\"\",(v10post/v10pre)-1)","v":""},null,null,null,null,null,null,null,null,null,null,null,{"$f":"Base_Width_Pre","v":0},1.6213254592941764,{"$f":"(Side_Slope_Left_Pre+Side_Slope_Right_Pre)/2","v":0},{"$f":"Slope_Pre","v":0},{"$f":"Roughness_Pre","v":0},0,{"$f":"AA17+((AB17*Side_Slope_Left_Pre)^2+AB17^2)^0.5+((AB17*Side_Slope_Right_Pre)^2+AB17^2)^0.5","v":3.2426509185883527},0,{"$error":"#DIV/0!"},{"$error":"#DIV/0!"},{"$f":"AI17-q10pre","v":{"$error":"#DIV/0!"}},{"$error":"#DIV/0!"},{"$f":"IF(Post_Const_Geometry_Selection=\"Geometry Same as Pre-Construction\",Base_Width_Pre,Base_Width_Post)","v":0},1,{"$f":"IF(Post_Const_Geometry_Selection=\"Geometry Same as Pre-Construction\",(Side_Slope_Left_Pre+Side_Slope_Right_Pre)/2,(Side_Slope_Left_Post+Side_Slope_Right_Post)/2)","v":0},{"$f":"IF(Post_Const_Geometry_Selection=\"Geometry Same as Pre-Construction\",Slope_Pre,Slope_Post)","v":0},{"$f":"IF(Post_Const_Geometry_Selection=\"Geometry Same as Pre-Construction\",Roughness_Pre,Roughness_Post)","v":0},{"$f":"AM17*AN17+AO17*AN17^2","v":0},{"$f":"IF(Post_Const_Geometry_Selection=\"Geometry Same as Pre-Construction\",AM17+((AN17*Side_Slope_Left_Pre)^2+AN17^2)^0.5+((AN17*Side_Slope_Right_Pre)^2+AN17^2)^0.5,AM17+((AN17*Side_Slope_Left_Post)^2+AN17^2)^0.5+((AN17*Side_Slope_Right_Post)^2+AN17^2)^0.5)","v":2},{"$f":"AR17/AS17","v":0},{"$f":"1.49/AQ17*AR17*AT17^0.667*AP17^0.5","v":{"$error":"#DIV/0!"}},{"$f":"1.49/AQ17*AT17^0.667*AP17^0.5","v":{"$error":"#DIV/0!"}},{"$f":"AU17-q10post","v":{"$error":"#DIV/0!"}},{"$error":"#DIV/0!"}]
[null,null,null,"D10 =",null,"ft.",null,null,null,"D10 =",null,"ft.",null,"D10 =",{"$f":"IF(OR(d10post=0,d10pre=0),\"\",(d10post/d10pre)-1)","v":""},null,null,null,null,null,null,null,null,null,null,null,{"$f":"Base_Width_Pre","v":0},1.6213254592941764,{"$f":"(Side_Slope_Left_Pre+Side_Slope_Right_Pre)/2","v":0},{"$f":"Slope_Pre","v":0},{"$f":"Roughness_Pre","v":0},0,{"$f":"AA18+((AB18*Side_Slope_Left_Pre)^2+AB18^2)^0.5+((AB18*Side_Slope_Right_Pre)^2+AB18^2)^0.5","v":3.2426509185883527},0,{"$error":"#DIV/0!"},{"$error":"#DIV/0!"},{"$f":"AI18-q10pre","v":{"$error":"#DIV/0!"}},{"$error":"#DIV/0!"},{"$f":"IF(Post_Const_Geometry_Selection=\"Geometry Same as Pre-Construction\",Base_Width_Pre,Base_Width_Post)","v":0},1,{"$f":"IF(Post_Const_Geometry_Selection=\"Geometry Same as Pre-Construction\",(Side_Slope_Left_Pre+Side_Slope_Right_Pre)/2,(Side_Slope_Left_Post+Side_Slope_Right_Post)/2)","v":0},{"$f":"IF(Post_Const_Geometry_Selection=\"Geometry Same as Pre-Construction\",Slope_Pre,Slope_Post)","v":0},{"$f":"IF(Post_Const_Geometry_Selection=\"Geometry Same as Pre-Construction\",Roughness_Pre,Roughness_Post)","v":0},0,{"$f":"IF(Post_Const_Geometry_Selection=\"Geometry Same as Pre-Construction\",AM18+((AN18*Side_Slope_Left_Pre)^2+AN18^2)^0.5+((AN18*Side_Slope_Right_Pre)^2+AN18^2)^0.5,AM18+((AN18*Side_Slope_Left_Post)^2+AN18^2)^0.5+((AN18*Side_Slope_Right_Post)^2+AN18^2)^0.5)","v":2},0,{"$error":"#DIV/0!"},{"$error":"#DIV/0!"},{"$f":"AU18-q10post","v":{"$error":"#DIV/0!"}},{"$error":"#DIV/0!"}]
[null,null,null,"Q25 =",null,"cfs",null,null,null,"Q25 =",null,"cfs",null,"Q25 =",{"$f":"IF(OR(q25post=\"\",q25pre=\"\"),\"\",(q25post/q25pre)-1)","v":""}]
[null,null,null,"V25 =",null,"ft./s",null,null,null,"V25 =",null,"ft./s",null,"V25 =",{"$f":"IF(OR(v25post=0,v25pre=0),\"\",(v25post/v25pre)-1)","v":""},null,null,null,null,null,null,null,null,null,null,null,{"$f":"Base_Width_Pre","v":0},1.682068068069611,{"$f":"(Side_Slope_Left_Pre+Side_Slope_Right_Pre)/2","v":0},{"$f":"Slope_Pre","v":0},{"$f":"Roughness_Pre","v":0},{"$f":"AA20*AB20+AC20*AB20^2","v":0},{"$f":"AA20+((AB20*Side_Slope_Left_Pre)^2+AB20^2)^0.5+((AB20*Side_Slope_Right_Pre)^2+AB20^2)^0.5","v":3.3641361361392219},0,{"$error":"#DIV/0!"},{"$error":"#DIV/0!"},{"$f":"AI20-q25pre","v":{"$error":"#DIV/0!"}},{"$error":"#DIV/0!"},{"$f":"IF(Post_Const_Geometry_Selection=\"Geometry Same as Pre-Construction\",Base_Width_Pre,Base_Width_Post)","v":0},1,{"$f":"IF(Post_Const_Geometry_Selection=\"Geometry Same as Pre-Construction\",(Side_Slope_Left_Pre+Side_Slope_Right_Pre)/2,(Side_Slope_Left_Post+Side_Slope_Right_Post)/2)","v":0},{"$f":"IF(Post_Const_Geometry_Selection=\"Geometry Same as Pre-Construction\",Slope_Pre,Slope_Post)","v":0},{"$f":"IF(Post_Const_Geometry_Selection=\"Geometry Same as Pre-Construction\",Roughness_Pre,Roughness_Post)","v":0},{"$f":"AM20*AN20+AO20*AN20^2","v":0},{"$f":"IF(Post_Const_Geometry_Selection=\"Geometry Same as Pre-Construction\",AM20+((AN20*Side_Slope_Left_Pre)^2+AN20^2)^0.5+((AN20*Side_Slope_Right_Pre)^2+AN20^2)^0.5,AM20+((AN20*Side_Slope_Left_Post)^2+AN20^2)^0.5+((AN20*Side_Slope_Right_Post)^2+AN20^2)^0.5)","v":2},{"$f":"AR20/AS20","v":0},{"$f":"1.49/AQ20*AR20*AT20^0.667*AP20^0.5","v":{"$error":"#DIV/0!"}},{"$f":"1.49/AQ20*AT20^0.667*AP20^0.5","v":{"$error":"#DIV/0!"}},{"$f":"AU20-q25post","v":{"$error":"#DIV/0!"}},{"$error":"#DIV/0!"}]
[null,null,null,"D25 =",null,"ft.",null,null,null,"D25 =",null,"ft.",null,"D25 =",{"$f":"IF(OR(d25post=0,d25pre=0),\"\",(d25post/d25pre)-1)","v":""},null,null,null,null,null,null,null,null,null,null,null,{"$f":"Base_Width_Pre","v":0},1.682068068069611,{"$f":"(Side_Slope_Left_Pre+Side_Slope_Right_Pre)/2","v":0},{"$f":"Slope_Pre","v":0},{"$f":"Roughness_Pre","v":0},0,{"$f":"AA21+((AB21*Side_Slope_Left_Pre)^2+AB21^2)^0.5+((AB21*Side_Slope_Right_Pre)^2+AB21^2)^0.5","v":3.3641361361392219},0,{"$error":"#DIV/0!"},{"$error":"#DIV/0!"},{"$f":"AI21-q25pre","v":{"$error":"#DIV/0!"}},{"$error":"#DIV/0!"},{"$f":"IF(Post_Const_Geometry_Selection=\"Geometry Same as Pre-Construction\",Base_Width_Pre,Base_Width_Post)","v":0},1,{"$f":"IF(Post_Const_Geometry_Selection=\"Geometry Same as Pre-Construction\",(Side_Slope_Left_Pre+Side_Slope_Right_Pre)/2,(Side_Slope_Left_Post+Side_Slope_Right_Post)/2)","v":0},{"$f":"IF(Post_Const_Geometry_Selection=\"Geometry Same as Pre-Construction\",Slope_Pre,Slope_Post)","v":0},{"$f":"IF(Post_Const_Geometry_Selection=\"Geometry Same as Pre-Construction\",Roughness_Pre,Roughness_Post)","v":0},{"$f":"AM21*AN21+AO21*AN21^2","v":0},{"$f":"IF(Post_Const_Geometry_Selection=\"Geometry Same as Pre-Construction\",AM21+((AN21*Side_Slope_Left_Pre)^2+AN21^2)^0.5+((AN21*Side_Slope_Right_Pre)^2+AN21^2)^0.5,AM21+((AN21*Side_Slope_Left_Post)^2+AN21^2)^0.5+((AN21*Side_Slope_Right_Post)^2+AN21^2)^0.5)","v":2},0,{"$error":"#DIV/0!"},{"$error":"#DIV/0!"},{"$f":"AU21-q25post","v":{"$error":"#DIV/0!"}},{"$error":"#DIV/0!"}]
[null,null,null,"Q50 =",null,"cfs",null,null,null,"Q50 =",null,"cfs",null,"Q50 =",{"$f":"IF(OR(q50post=\"\",q50pre=\"\"),\"\",(q50post/q50pre)-1)","v":""}]
[null,null,null,"V50 =",null,"ft./s",null,null,null,"V50 =",null,"ft./s",null,"V50 =",{"$f":"IF(OR(v50post=0,v50pre=0),\"\",(v50post/v50pre)-1)","v":""},null,null,null,null,null,null,null,null,null,null,null,{"$f":"Base_Width_Pre","v":0},1.7196104937144696,{"$f":"(Side_Slope_Left_Pre+Side_Slope_Right_Pre)/2","v":0},{"$f":"Slope_Pre","v":0},{"$f":"Roughness_Pre","v":0},0,{"$f":"AA23+((AB23*Side_Slope_Left_Pre)^2+AB23^2)^0.5+((AB23*Side_Slope_Right_Pre)^2+AB23^2)^0.5","v":3.4392209874289392},0,{"$error":"#DIV/0!"},{"$error":"#DIV/0!"},{"$f":"AI23-q50pre","v":{"$error":"#DIV/0!"}},{"$error":"#DIV/0!"},{"$f":"IF(Post_Const_Geometry_Selection=\"Geometry Same as Pre-Construction\",Base_Width_Pre,Base_Width_Post)","v":0},1,{"$f":"IF(Post_Const_Geometry_Selection=\"Geometry Same as Pre-Construction\",(Side_Slope_Left_Pre+Side_Slope_Right_Pre)/2,(Side_Slope_Left_Post+Side_Slope_Right_Post)/2)","v":0},{"$f":"IF(Post_Const_Geometry_Selection=\"Geometry Same as Pre-Construction\",Slope_Pre,Slope_Post)","v":0},{"$f":"IF(Post_Const_Geometry_Selection=\"Geometry Same as Pre-Construction\",Roughness_Pre,Roughness_Post)","v":0},{"$f":"AM23*AN23+AO23*AN23^2","v":0},{"$f":"IF(Post_Const_Geometry_Selection=\"Geometry Same as Pre-Construction\",AM23+((AN23*Side_Slope_Left_Pre)^2+AN23^2)^0.5+((AN23*Side_Slope_Right_Pre)^2+AN23^2)^0.5,AM23+((AN23*Side_Slope_Left_Post)^2+AN23^2)^0.5+((AN23*Side_Slope_Right_Post)^2+AN23^2)^0.5)","v":2},{"$f":"AR23/AS23","v":0},{"$f":"1.49/AQ23*AR23*AT23^0.667*AP23^0.5","v":{"$error":"#DIV/0!"}},{"$f":"1.49/AQ23*AT23^0.667*AP23^0.5","v":{"$error":"#DIV/0!"}},{"$f":"AU23-q50post","v":{"$error":"#DIV/0!"}},{"$error":"#DIV/0!"}]
[null,null,null,"D50 =",null,"ft.",null,null,null,"D50 =",null,"ft.",null,"D50 =",{"$f":"IF(OR(d50post=0,d50pre=0),\"\",(d50post/d50pre)-1)","v":""},null,null,null,null,null,null,null,null,null,null,null,{"$f":"Base_Width_Pre","v":0},1.7196104937144696,{"$f":"(Side_Slope_Left_Pre+Side_Slope_Right_Pre)/2","v":0},{"$f":"Slope_Pre","v":0},{"$f":"Roughness_Pre","v":0},{"$f":"AA24*AB24+AC24*AB24^2","v":0},{"$f":"AA24+((AB24*Side_Slope_Left_Pre)^2+AB24^2)^0.5+((AB24*Side_Slope_Right_Pre)^2+AB24^2)^0.5","v":3.4392209874289392},0,{"$f":"1.49/AE24*AF24*AH24^0.667*AD24^0.5","v":{"$error":"#DIV/0!"}},{"$error":"#DIV/0!"},{"$f":"AI24-q50pre","v":{"$error":"#DIV/0!"}},{"$error":"#DIV/0!"},{"$f":"IF(Post_Const_Geometry_Selection=\"Geometry Same as Pre-Construction\",Base_Width_Pre,Base_Width_Post)","v":0},1,{"$f":"IF(Post_Const_Geometry_Selection=\"Geometry Same as Pre-Construction\",(Side_Slope_Left_Pre+Side_Slope_Right_Pre)/2,(Side_Slope_Left_Post+Side_Slope_Right_Post)/2)","v":0},{"$f":"IF(Post_Const_Geometry_Selection=\"Geometry Same as Pre-Construction\",Slope_Pre,Slope_Post)","v":0},{"$f":"IF(Post_Const_Geometry_Selection=\"Geometry Same as Pre-Construction\",Roughness_Pre,Roughness_Post)","v":0},0,{"$f":"IF(Post_Const_Geometry_Selection=\"Geometry Same as Pre-Construction\",AM24+((AN24*Side_Slope_Left_Pre)^2+AN24^2)^0.5+((AN24*Side_Slope_Right_Pre)^2+AN24^2)^0.5,AM24+((AN24*Side_Slope_Left_Post)^2+AN24^2)^0.5+((AN24*Side_Slope_Right_Post)^2+AN24^2)^0.5)","v":2},0,{"$error":"#DIV/0!"},{"$error":"#DIV/0!"},{"$f":"AU24-q50post","v":{"$error":"#DIV/0!"}},{"$error":"#DIV/0!"}]
[null,null,null,"Q100 =",null,"cfs",null,null,null,"Q100 =",null,"cfs",null,"Q100 =",{"$f":"IF(OR(q100post=\"\",q100pre=\"\"),\"\",(q100post/q100pre)-1)","v":""}]
[null,null,null,"V100 =",null,"ft./s",null,null,null,"V100 =",null,"ft./s",null,"V100 =",{"$f":"IF(OR(v100post=0,v100pre=0),\"\",(v100post/v100pre)-1)","v":""},null,null,null,null,null,null,null,null,null,null,null,{"$f":"Base_Width_Pre","v":0},1.7196104937144696,{"$f":"(Side_Slope_Left_Pre+Side_Slope_Right_Pre)/2","v":0},{"$f":"Slope_Pre","v":0},{"$f":"Roughness_Pre","v":0},{"$f":"AA26*AB26+AC26*AB26^2","v":0},{"$f":"AA26+((AB26*Side_Slope_Left_Pre)^2+AB26^2)^0.5+((AB26*Side_Slope_Right_Pre)^2+AB26^2)^0.5","v":3.4392209874289392},{"$f":"AF26/AG26","v":0},{"$f":"1.49/AE26*AF26*AH26^0.667*AD26^0.5","v":{"$error":"#DIV/0!"}},{"$f":"1.49/AE26*AH26^0.667*AD26^0.5","v":{"$error":"#DIV/0!"}},{"$f":"AI26-q100pre","v":{"$error":"#DIV/0!"}},{"$f":"ROUND(AK26,1)","v":{"$error":"#DIV/0!"}},{"$f":"IF(Post_Const_Geometry_Selection=\"Geometry Same as Pre-Construction\",Base_Width_Pre,Base_Width_Post)","v":0},1,{"$f":"IF(Post_Const_Geometry_Selection=\"Geometry Same as Pre-Construction\",(Side_Slope_Left_Pre+Side_Slope_Right_Pre)/2,(Side_Slope_Left_Post+Side_Slope_Right_Post)/2)","v":0},{"$f":"IF(Post_Const_Geometry_Selection=\"Geometry Same as Pre-Construction\",Slope_Pre,Slope_Post)","v":0},{"$f":"IF(Post_Const_Geometry_Selection=\"Geometry Same as Pre-Construction\",Roughness_Pre,Roughness_Post)","v":0},{"$f":"AM26*AN26+AO26*AN26^2","v":0},{"$f":"IF(Post_Const_Geometry_Selection=\"Geometry Same as Pre-Construction\",AM26+((AN26*Side_Slope_Left_Pre)^2+AN26^2)^0.5+((AN26*Side_Slope_Right_Pre)^2+AN26^2)^0.5,AM26+((AN26*Side_Slope_Left_Post)^2+AN26^2)^0.5+((AN26*Side_Slope_Right_Post)^2+AN26^2)^0.5)","v":2},{"$f":"AR26/AS26","v":0},{"$f":"1.49/AQ26*AR26*AT26^0.667*AP26^0.5","v":{"$error":"#DIV/0!"}},{"$f":"1.49/AQ26*AT26^0.667*AP26^0.5","v":{"$error":"#DIV/0!"}},{"$f":"AU26-q100post","v":{"$error":"#DIV/0!"}},{"$f":"ROUND(AW26,1)","v":{"$error":"#DIV/0!"}}]
[null,null,null,"D100 =",null,"ft.",null,null,null,"D100 =",null,"ft.",null,"D100 =",{"$f":"IF(OR(d100post=0,d100pre=0),\"\",(d100post/d100pre)-1)","v":""},null,null,null,null,null,null,null,null,null,null,null,{"$f":"Base_Width_Pre","v":0},1.7196104937144696,{"$f":"(Side_Slope_Left_Pre+Side_Slope_Right_Pre)/2","v":0},{"$f":"Slope_Pre","v":0},{"$f":"Roughness_Pre","v":0},{"$f":"AA27*AB27+AC27*AB27^2","v":0},{"$f":"AA27+((AB27*Side_Slope_Left_Pre)^2+AB27^2)^0.5+((AB27*Side_Slope_Right_Pre)^2+AB27^2)^0.5","v":3.4392209874289392},0,{"$f":"1.49/AE27*AF27*AH27^0.667*AD27^0.5","v":{"$error":"#DIV/0!"}},{"$error":"#DIV/0!"},{"$f":"AI27-q100pre","v":{"$error":"#DIV/0!"}},{"$f":"ROUND(AK27,1)","v":{"$error":"#DIV/0!"}},{"$f":"IF(Post_Const_Geometry_Selection=\"Geometry Same as Pre-Construction\",Base_Width_Pre,Base_Width_Post)","v":0},1,{"$f":"IF(Post_Const_Geometry_Selection=\"Geometry Same as Pre-Construction\",(Side_Slope_Left_Pre+Side_Slope_Right_Pre)/2,(Side_Slope_Left_Post+Side_Slope_Right_Post)/2)","v":0},{"$f":"IF(Post_Const_Geometry_Selection=\"Geometry Same as Pre-Construction\",Slope_Pre,Slope_Post)","v":0},{"$f":"IF(Post_Const_Geometry_Selection=\"Geometry Same as Pre-Construction\",Roughness_Pre,Roughness_Post)","v":0},0,{"$f":"IF(Post_Const_Geometry_Selection=\"Geometry Same as Pre-Construction\",AM27+((AN27*Side_Slope_Left_Pre)^2+AN27^2)^0.5+((AN27*Side_Slope_Right_Pre)^2+AN27^2)^0.5,AM27+((AN27*Side_Slope_Left_Post)^2+AN27^2)^0.5+((AN27*Side_Slope_Right_Post)^2+AN27^2)^0.5)","v":2},0,{"$f":"1.49/AQ27*AR27*AT27^0.667*AP27^0.5","v":{"$error":"#DIV/0!"}},{"$f":"1.49/AQ27*AT27^0.667*AP27^0.5","v":{"$error":"#DIV/0!"}},{"$f":"AU27-q100post","v":{"$error":"#DIV/0!"}},{"$error":"#DIV/0!"}]
[null,null,null,null,null,null,null,null,null,null,null,null,null,"DAtotal=",{"$f":"IF(OR(da_total_post=0,da_total_post=\"\",da_total_pre=0),\"\",(da_total_post/da_total_pre)-1)","v":""}]
["Railroad / 100-YR Design? ",null,null,"Existing Erosion / Potential Future Erosion?",null,null,null,"Post Const. D/S Channel liner type",null,null,null,null,null,"DA imp R/W = ",{"$f":"IF(OR(da_pre_imp=\"\",da_post_imp=\"\"),\"\",da_post_imp-da_pre_imp)","v":""}]
[null,null,null,null,null,null,null,null,null,null,{"$f":"IF(J30=\"\",\"\",IF(d10post=\"\",\"Calc D10\",IF(AND(Post_Const_Geometry_Selection=\"Geometry Same as Pre-Construction\",Slope_Pre=\"\"),\"Enter Slope\",IF(AND(Slope_Post=\"\",Post_Const_Geometry_Selection<>\"Geometry Same as Pre-Construction\"),\"Enter Slope\",IF(Post_Const_Geometry_Selection=\"Geometry Same as Pre-Construction\",Slope_Pre*d10post*62.4,Slope_Post*d10post*62.4)))))","v":""},null,null,"% imp Area = ",{"$f":"IF(OR(percent_imp_pre_total=\"\",percent_imp_post_total=\"\"),\"\",percent_imp_post_total-percent_imp_pre_total)","v":""},null,null,null,null,null,null,null,null,null,null,null,null,null,null,null,null,null,{"$f":"_xlfn.TEXTJOIN(\"\",TRUE,\"OA-\",B1,\"-\",UID_hidden)","v":"OA-0-"}]
[]
[]
[]
["LINER TYPE","Select Liner Type Above To Generate List",null,null,null,null,null,"PRE-CONSTRUCTION OUTLET GEOMETRY"]
[]
["V10 Permissible",{"$f":"IF(I30=\"N/A\",\"N/A\",IF(Soil_Type=\"Permanent Matting Product (stable)\",\"User to Define\",IF(J30<>\"\",\"N/A\",IF(I30=\"Soil\",AD41,IF(I30=\"Non-Soil\",AD43,\"\")))))","v":""},null,{"$f":"IF(Soil_Type='PICK LISTS'!E14,\"N/A\",IF(A34=\"LINER TYPE\",AF62,AD60))","v":""},null,null,null,"POST-CONSTRUCTION OUTLET GEOMETRY"]
["τ10 Permissible",{"$f":"IF(A34=\"SOIL TYPE\",\"N/A\",IF(Soil_Type=\"Grass / Dense Veg. (no bare soil spots)\",\"N/A\",IF(J30<>\"\",AD43,\"\")))","v":""},null,null,null,null,null,null,null,null,null,null,null,null,null,null,null,null,null,null,null,null,null,null,null,null,null,"Hydrology Method:",null,"USGS-5030 Method"]
[]
["PRE-CONSTRUCTION OUTLET GEOMETRY",null,null,null,null,null,null,null,"POST-CONSTRUCTION OUTLET GEOMETRY"]
[null,null,null,null,null,null,null,null,null,null,null,null,null,null,null,null,null,null,null,null,null,null,null,null,null,null,null,null,null,null,null,"allowable shear stress",null,{"$f":"AD43","v":""}]
[null,null,null,null,null,null,null,null,null,null,null,null,null,null,null,null,null,null,null,null,null,null,null,null,null,null,null,"v_permissible soil",null,{"$f":"IF(Soil_Type='PICK LISTS'!E2,'PICK LISTS'!F2,IF(Soil_Type='PICK LISTS'!E3,'PICK LISTS'!F3,IF(Soil_Type='PICK LISTS'!E4,'PICK LISTS'!F4, IF(Soil_Type='PICK LISTS'!E5,'PICK LISTS'!F5, IF(Soil_Type='PICK LISTS'!E6,'PICK LISTS'!F6,IF(Soil_Type='PICK LISTS'!E7,'PICK LISTS'!F7,IF(Soil_Type='PICK LISTS'!E8,'PICK LISTS'!F8,IF(Soil_Type='PICK LISTS'!E9,'PICK LISTS'!F9,IF(Soil_Type='PICK LISTS'!E10,'PICK LISTS'!F10,IF(Soil_Type='PICK LISTS'!E11,'PICK LISTS'!F11,IF(Soil_Type='PICK LISTS'!E12,'PICK LISTS'!F12,IF(Soil_Type='PICK LISTS'!E13,'PICK LISTS'!F13,IF(Soil_Type=\"N/A (Pipe System or Non-Channel)\",\"N/A\",\"\")))))))))))))","v":""},null,"riprap permissible velocity",null,null,{"$f":"IF(v10post=\"\",\"\",(1.49/(Roughness_Pre*SQRT(62.4*d10pre)))*(AH18^(0.1666666))*(AH40^0.5))","v":""},null,null,null,"PRE"]
[null,null,null,null,null,null,null,null,null,null,null,null,null,null,null,null,null,null,null,null,null,null,null,null,null,null,null,null,null,null,null,null,null,null,null,null,null,null,null,"Intensity Calcs"]
[null,null,null,null,null,null,null,null,null,null,null,null,null,null,null,null,null,null,null,null,null,null,null,null,null,null,null,"shear/v_perm non-soil",null,{"$f":"IF(Soil_Type='PICK LISTS'!H18,'PICK LISTS'!I18,IF(Soil_Type='PICK LISTS'!H19,'PICK LISTS'!I19,IF(Soil_Type='PICK LISTS'!H20,'PICK LISTS'!I20,IF(Soil_Type='PICK LISTS'!H21,'PICK LISTS'!I21,IF(Soil_Type='PICK LISTS'!H22,'PICK LISTS'!I22,IF(Soil_Type='PICK LISTS'!H23,'PICK LISTS'!I23,\"\"))))))","v":""},null,"Is it riprap lined?",null,{"$f":"IF(OR(Soil_Type=\"CL-A Riprap (d50 = 4 in.)\",Soil_Type=\"CL-B Riprap (d50 = 8 in.)\",Soil_Type=\"CL-I Riprap (d50 = 10 in.)\",Soil_Type=\"CL-II Riprap (d50 = 12 in.)\"),\"YES\",\"NO\")","v":"NO"}]
[null,null,null,null,null,null,null,null,null,null,null,null,null,null,null,null,null,null,null,null,null,null,null,null,null,null,null,null,null,null,null,null,null,null,null,null,null,null,null,null,2,5,10,25,50,100]
[null,null,null,null,null,null,null,null,null,null,null,null,null,null,null,null,null,null,null,null,null,null,null,null,null,null,null,"Increase or Decrease in Velocity",null,null,null,null,null,null,null,null,null,null,null,{"$f":"IF(custom_IDF=\"YES\",INDIRECT(\"Z_CUSTOM_IDF\"),IF(county_for_this_outlet=\"New Hanover\", INDIRECT(\"NewHanover\"),INDIRECT(county_for_this_outlet)))","v":{"$error":"#REF!"}}]
[null,null,null,null,null,null,null,null,null,null,null,null,null,null,null,null,null,null,null,null,null,null,null,null,null,null,null,{"$f":"IF(OR(v10pre=\"\",v10post=\"\",Soil_Type=\"\",Soil_Type=\"Select Liner Type Above To Generate List\"),\"\",IF(v10post>v10pre,\"Increase\",IF(v10post<=v10pre,\"Decrease\",\"\")))","v":""}]
[]
[null,null,null,null,null,null,null,null,null,null,null,null,null,null,null,null,null,null,null,null,null,null,null,null,null,null,null,"Vpost > Vsoil_permissible?"]
[]
[]
[{"$f":"_xlfn.CONCAT(\"SUMMARY - \",_xlnm.sheet_title)","v":"SUMMARY - PSH # OUTLET #"},null,null,null,null,null,null,null,null,null,null,null,null,null,null,null,null,null,null,null,null,null,null,null,null,null,null,{"$f":"IF(I30=\"Soil\",IF(v10post>AD41,\"YES\",\"NO\"),IF(AH43=\"YES\",IF(K30>AD43,\"YES\",\"NO\"),IF(v10post>AD43,\"YES\",\"NO\")))","v":"NO"}]
["Please provide a summary of the outlet analysis here. Directions/guidance are provided by clicking on the \"i\" button above."]
[null,null,null,null,null,null,null,null,null,null,null,null,null,null,null,null,null,null,null,null,null,null,null,null,null,null,null,"Vpost increase > 10%?",null,null,null,null,null,null,null,null,null,null,null,"5-10",{"$f":"_xlfn.FORECAST.LINEAR(Tc_R_Pre,AO45:AO46,$AN45:$AN46)","v":{"$error":"#NAME?"}},{"$f":"_xlfn.FORECAST.LINEAR(Tc_R_Pre,AP45:AP46,$AN45:$AN46)","v":{"$error":"#NAME?"}},{"$error":"#NAME?"},{"$error":"#NAME?"},{"$error":"#NAME?"},{"$error":"#NAME?"}]
[null,null,null,null,null,null,null,null,null,null,null,null,null,null,null,null,null,null,null,null,null,null,null,null,null,null,null,{"$f":"IF(O17>0.1,\"YES\",\"NO\")","v":"YES"},null,null,null,null,null,null,null,null,null,null,null,"10-15",{"$f":"_xlfn.FORECAST.LINEAR(Tc_R_Pre,AO46:AO47,$AN46:$AN47)","v":{"$error":"#NAME?"}},{"$error":"#NAME?"},{"$error":"#NAME?"},{"$error":"#NAME?"},{"$error":"#NAME?"},{"$error":"#NAME?"}]
[null,null,null,null,null,null,null,null,null,null,null,null,null,null,null,null,null,null,null,null,null,null,null,null,null,null,null,null,null,null,null,null,null,null,null,null,null,null,null,"15-30",{"$error":"#NAME?"},{"$error":"#NAME?"},{"$error":"#NAME?"},{"$error":"#NAME?"},{"$error":"#NAME?"},{"$error":"#NAME?"}]
[null,null,null,null,null,null,null,null,null,null,null,null,null,null,null,null,null,null,null,null,null,null,null,null,null,null,null,null,null,null,null,null,null,null,null,null,null,null,null,"30-60",{"$error":"#NAME?"},{"$error":"#NAME?"},{"$error":"#NAME?"},{"$error":"#NAME?"},{"$error":"#NAME?"},{"$error":"#NAME?"}]
[]
[null,null,null,null,null,null,null,null,null,null,null,null,null,null,null,null,null,null,null,null,null,null,null,null,null,null,null,null,null,null,null,null,null,null,null,null,null,null,null,null,{"$f":"IF(OR(Tc_R_Pre>60, Tc_R_Pre<5), \"Error\", IF(AND(Tc_R_Pre>=5,Tc_R_Pre<=10),AO53, IF(AND(Tc_R_Pre>10,Tc_R_Pre<=15), AO54, IF(AND(Tc_R_Pre>15, Tc_R_Pre<=30), AO55, IF(AND(Tc_R_Pre>30, Tc_R_Pre<=60), AO56, VLOOKUP(Tc_R_Pre, INDIRECT(Name_R), 2))))))","v":{"$error":"#NAME?"}},{"$f":"IF(OR(Tc_R_Pre>60, Tc_R_Pre<5), \"Error\", IF(AND(Tc_R_Pre>=5,Tc_R_Pre<=10),AP53, IF(AND(Tc_R_Pre>10,Tc_R_Pre<=15), AP54, IF(AND(Tc_R_Pre>15, Tc_R_Pre<=30), AP55, IF(AND(Tc_R_Pre>30, Tc_R_Pre<=60), AP56, VLOOKUP(Tc_R_Pre, INDIRECT(Name_R), 2))))))","v":{"$error":"#NAME?"}},{"$error":"#NAME?"},{"$error":"#NAME?"},{"$error":"#NAME?"},{"$error":"#NAME?"}]
[null,null,null,null,null,null,null,null,null,null,null,null,null,null,null,null,null,null,"NUMBER OF OUTLET PHOTO PAGES",null,1,null,null,null,null,null,null,null,"Applies?","Which case is it?",null,"non-soil"]
[null,null,null,null,null,null,null,null,null,null,null,null,null,null,null,null,null,null,null,null,null,null,null,null,null,null,null,"Case 1",{"$f":"IF(AND(OR(F30=\"None\",F30=\"Potential\"),AB46=\"Decrease\",AB51=\"NO\"),\"YES\",\"\")","v":""},{"$f":"IF(AC60<>\"\",AB60,IF(AC61<>\"\",AB61,IF(AC62<>\"\",AB62,IF(AC63<>\"\",AB63,IF(AC64<>\"\",AB64,IF(AC65<>\"\",AB65,IF(AC66<>\"\",AB66,IF(AC67<>\"\",AB67,IF(AC68<>\"\",AB68,IF(AC69<>\"\",AB69,\"\"))))))))))","v":""}]
[null,null,null,null,null,null,null,null,null,null,null,null,null,null,null,null,null,null,null,null,null,null,null,null,null,null,null,"Case 1A",{"$f":"IF(AND(OR(F30=\"Existing\",F30=\"Both\"),AB46=\"Decrease\",AB51=\"NO\"),\"YES\",\"\")","v":""}]
[null,null,null,null,null,null,null,null,null,null,null,null,null,null,null,null,null,null,null,null,null,null,null,null,null,null,null,"Case 2",{"$f":"IF(AND(OR(F30=\"None\",F30=\"Potential\"),AB46=\"Decrease\",AB51=\"YES\"),\"YES\",\"\")","v":""},null,null,{"$f":"IF(AD60=\"\",\"\",\"Non-Soil, see Note 1 & 2 of Case Table\")","v":""}]
[null,null,null,null,null,null,null,null,null,null,null,null,null,null,null,null,null,null,null,null,null,null,null,null,null,null,null,"Case 2A",{"$f":"IF(AND(OR(F30=\"Existing\",F30=\"Both\"),AB46=\"Decrease\",AB51=\"YES\"),\"YES\",\"\")","v":""},null,null,null,null,null,null,null,null,null,null,"pre-const geometry type"]
[null,null,null,null,null,null,null,null,null,null,null,null,null,null,null,null,null,null,null,null,null,null,null,null,null,null,null,"Case 3",{"$f":"IF(AND(OR(F30=\"None\",F30=\"Potential\"),AB46=\"Increase\",AB51=\"NO\"),\"YES\",\"\")","v":""}]
[null,null,null,null,null,null,null,null,null,null,null,null,null,null,null,null,null,null,null,null,null,null,null,null,null,null,null,"Case 3A",{"$f":"IF(AND(OR(F30=\"Existing\",F30=\"Both\"),AB46=\"Increase\",AB51=\"NO\"),\"YES\",\"\")","v":""},null,null,null,null,null,null,null,null,null,null,"post-const geometry type",null,null,null,"railroad design?"]
[null,null,null,null,null,null,null,null,null,null,null,null,null,null,null,null,null,null,null,null,null,null,null,null,null,null,null,"Case 4",{"$f":"IF(AND(OR(F30=\"None\",F30=\"Potential\"),AB46=\"Increase\",AB51=\"YES\",O17<=0.1),\"YES\",\"\")","v":""}]
[null,null,null,null,null,null,null,null,null,null,null,null,null,null,null,null,null,null,null,null,null,null,null,null,null,null,null,"Case 4A",{"$f":"IF(AND(OR(F30=\"Existing\",F30=\"Both\"),AB46=\"Increase\",AB51=\"YES\",O17<=0.1),\"YES\",\"\")","v":""}]
[null,null,null,null,null,null,null,null,null,null,null,null,null,null,null,null,null,null,null,null,null,null,null,null,null,null,null,"Case 5",{"$f":"IF(AND(OR(F30=\"None\",F30=\"Potential\"),AB46=\"Increase\",AB51=\"YES\",O17>0.1),\"YES\",\"\")","v":""}]
[null,null,null,null,null,null,null,null,null,null,null,null,null,null,null,null,null,null,null,null,null,null,null,null,null,null,null,"Case 5A",{"$f":"IF(AND(OR(F30=\"Existing\",F30=\"Both\"),AB46=\"Increase\",AB51=\"YES\",O17>0.1),\"YES\",\"\")","v":""},null,null,null,null,null,null,null,null,null,"POST"]
[null,null,null,null,null,null,null,null,null,null,null,null,null,null,null,null,null,null,null,null,null,null,null,null,null,null,null,null,null,null,null,null,null,null,null,null,null,null,null,"Intensity Calcs"]
[]
["OUTLET SITE PHOTOS PAGE 1",null,null,null,null,null,null,null,null,null,null,null,null,null,null,null,null,null,null,null,null,null,null,null,null,null,null,null,null,null,null,null,null,null,null,null,null,null,null,null,2,5,10,25,50,100]
[null,null,null,null,null,null,null,null,null,null,null,null,null,null,null,null,null,null,null,null,null,null,null,null,null,null,null,null,null,null,null,null,null,null,null,null,null,null,null,{"$f":"IF(custom_IDF=\"YES\",INDIRECT(\"Z_CUSTOM_IDF\"),IF(county_for_this_outlet=\"New Hanover\", INDIRECT(\"NewHanover\"),INDIRECT(county_for_this_outlet)))","v":{"$error":"#REF!"}}]
["Photo Description Here",null,null,null,null,null,null,null,"Photo Description Here"]
[]
[]
[]
[]
[]
[]
[null,null,null,null,null,null,null,null,null,null,null,null,null,null,null,null,null,null,null,null,null,null,null,null,null,null,null,null,null,null,null,null,null,null,null,null,null,null,null,"5-10",{"$f":"_xlfn.FORECAST.LINEAR(Tc_R_Post,AO73:AO74,$AN73:$AN74)","v":{"$error":"#NAME?"}},{"$error":"#NAME?"},{"$error":"#NAME?"},{"$error":"#NAME?"},{"$error":"#NAME?"},{"$error":"#NAME?"}]
[null,null,null,null,null,null,null,null,null,null,null,null,null,null,null,null,null,null,null,null,null,null,null,null,null,null,null,null,null,null,null,null,null,null,null,null,null,null,null,"10-15",{"$error":"#NAME?"},{"$error":"#NAME?"},{"$error":"#NAME?"},{"$error":"#NAME?"},{"$error":"#NAME?"},{"$error":"#NAME?"}]
[null,null,null,null,null,null,null,null,null,null,null,null,null,null,null,null,null,null,null,null,null,null,null,null,null,null,null,null,null,null,null,null,null,null,null,null,null,null,null,"15-30",{"$error":"#NAME?"},{"$error":"#NAME?"},{"$error":"#NAME?"},{"$error":"#NAME?"},{"$error":"#NAME?"},{"$error":"#NAME?"}]
[null,null,null,null,null,null,null,null,null,null,null,null,null,null,null,null,null,null,null,null,null,null,null,null,null,null,null,null,null,null,null,null,null,null,null,null,null,null,null,"30-60",{"$error":"#NAME?"},{"$error":"#NAME?"},{"$error":"#NAME?"},{"$error":"#NAME?"},{"$error":"#NAME?"},{"$error":"#NAME?"}]
[]
[null,null,null,null,null,null,null,null,null,null,null,null,null,null,null,null,null,null,null,null,null,null,null,null,null,null,null,null,null,null,null,null,null,null,null,null,null,null,null,null,{"$f":"IF(OR(Tc_R_Post>60, Tc_R_Post<5), \"Error\", IF(AND(Tc_R_Post>=5,Tc_R_Post<=10),AO81, IF(AND(Tc_R_Post>10, Tc_R_Post<=15), AO82, IF(AND(Tc_R_Post>15, Tc_R_Post<=30), AO83, IF(AND(Tc_R_Post>30, Tc_R_Post<=60), AO84, VLOOKUP(Tc_R_Post, INDIRECT(Name_R), 2))))))","v":{"$error":"#NAME?"}},{"$error":"#NAME?"},{"$error":"#NAME?"},{"$error":"#NAME?"},{"$error":"#NAME?"},{"$error":"#NAME?"}]
[]
[]
[null,null,null,null,null,null,null,null,null,null,null,null,null,null,null,null,null,null,null,null,null,null,null,null,null,null,null,null,null,null,null,null,null,null,null,null,null,null,null,null,null,null,null,null,null,null,null,null,null,null,null,null,null,null,"template for 1 page of photos just copies the formatting from this cell below"]
[null,null,null,null,null,null,null,null,null,null,null,null,null,null,null,null,null,null,null,null,null,null,null,null,null,null,null,null,null,null,null,null,null,null,null,null,null,null,null,null,null,null,null,null,null,null,null,null,null,null,null,null,null,"---->"]
[]
[]
[]
[]
[]
[null,null,null,null,null,null,null,null,null,null,null,null,null,null,null,null,null,null,null,null,null,null,null,null,null,null,null,null,null,null,null,null,null,null,null,null,null,null,null,null,null,null,null,null,null,null,null,null,null,null,null,null,null,null,"TEMPLATE FOR 2 PHOTO PAGES",null,null,null,null,null,null,null,null,null,null,null,null,null,null,null,null,null,"TEMPLATE FOR 3 PHOTO PAGES",null,null,null,null,null,null,null,null,null,null,null,null,null,null,null,null,null,"TEMPLATE FOR 4 PHOTO PAGES",null,null,null,null,null,null,null,null,null,null,null,null,null,null,null,null,null,"TEMPLATE FOR 5 PHOTO PAGES"]
[{"$f":"_xlfn.CONCAT( _xlnm.sheet_title,\" SITE PHOTOS - PAGE 2\")","v":"PSH # OUTLET # SITE PHOTOS - PAGE 2"},null,null,null,null,null,null,null,null,null,null,null,null,null,null,null,null,null,null,null,null,null,null,null,null,null,null,null,null,null,null,null,null,null,null,null,null,null,null,null,null,null,null,null,null,null,null,null,null,null,null,null,null,null,"OUTLET SITE PHOTOS PAGE 2",null,null,null,null,null,null,null,null,null,null,null,null,null,null,null,null,null,"OUTLET SITE PHOTOS PAGE 2",null,null,null,null,null,null,null,null,null,null,null,null,null,null,null,null,null,"OUTLET SITE PHOTOS PAGE 2",null,null,null,null,null,null,null,null,null,null,null,null,null,null,null,null,null,"OUTLET SITE PHOTOS PAGE 2"]
["Photo Description Here",null,null,null,null,null,null,null,"Photo Description Here",null,null,null,null,null,null,null,null,null,null,null,null,null,null,null,null,null,null,null,null,null,null,null,null,null,null,null,null,null,null,null,null,null,null,null,null,null,null,null,null,null,null,null,null,null,"Photo Description Here",null,null,null,null,null,null,null,"Photo Description Here",null,null,null,null,null,null,null,null,null,"Photo Description Here",null,null,null,null,null,null,null,"Photo Description Here",null,null,null,null,null,null,null,null,null,"Photo Description Here",null,null,null,null,null,null,null,"Photo Description Here",null,null,null,null,null,null,null,null,null,"Photo Description Here",null,null,null,null,null,null,null,"Photo Description Here"]
[]
[]
[]
[null,null,null,null,null,null,null,null,null,null,null,null,null,null,null,null,null,null,null,null,null,null,null,null,null,null,null,null,null,null,null,null,null,null,null,null,null,null,null,{"$f":"INDIRECT(New_Hanover)","v":{"$error":"#NAME?"}}]
[]
[]
[null,null,null,null,null,null,null,null,null,null,null,null,null,null,null,null,null,null,null,null,null,null,null,null,null,null,null,null,null,null,null,null,null,null,"hidden da and c pre field values for this sheet"]
[null,null,null,null,null,null,null,null,null,null,null,null,null,null,null,null,null,null,null,null,null,null,null,null,null,null,null,null,null,null,null,null,null,null,null,null,"check for non std c-values",null,"hidden da and c post field values for this sheet",null,"check for non std c-values"]
[null,null,null,null,null,null,null,null,null,null,null,null,null,null,null,null,null,null,null,null,null,null,null,null,null,null,null,null,null,null,null,null,null,null,0,"0.9",null,null,0,"0.9"]
[null,null,null,null,null,null,null,null,null,null,null,null,null,null,null,null,null,null,null,null,null,null,null,null,null,null,null,null,null,null,null,null,null,null,0,0.9,null,null,0,0.9]
[null,null,null,null,null,null,null,null,null,null,null,null,null,null,null,null,null,null,null,null,null,null,null,null,null,null,null,null,null,null,null,null,null,null,0,"0.3",null,null,0,"0.3"]
[null,null,null,null,null,null,null,null,null,null,null,null,null,null,null,null,null,null,null,null,null,null,null,null,null,null,null,null,null,null,null,null,null,null,0,0.2,null,null,"0","0.2"]
[null,null,null,null,null,null,null,null,null,null,null,null,null,null,null,null,null,null,null,null,null,null,null,null,null,null,null,null,null,null,null,null,null,null,"0","0",{"$f":"IF(VALUE(da_other2_pre_field)=0,\"no non std area\",IF(AND(VALUE(c_other2_pre_field)>0.3,VALUE(c_other2_pre_field)<0.9),\"non std c values\",\"\"))","v":"no non std area"},null,"0","0",{"$f":"IF(VALUE(da_other2_post_field)=0,\"no non std area\",IF(AND(VALUE(c_other2_post_field)>0.3,VALUE(c_other2_post_field)<0.9),\"non std c values\",\"\"))","v":"no non std area"}]
[null,null,null,null,null,null,null,null,null,null,null,null,null,null,null,null,null,null,null,null,null,null,null,null,null,null,null,null,null,null,null,null,null,null,"0","0",{"$f":"IF(VALUE(da_other3_pre_field)=0,\"no non std area\",IF(AND(VALUE(c_other3_pre_field)>0.3,VALUE(c_other3_pre_field)<0.9),\"non std c values\",\"\"))","v":"no non std area"},null,"0","0",{"$f":"IF(VALUE(da_other3_post_field)=0,\"no non std area\",IF(AND(VALUE(c_other3_post_field)>0.3,VALUE(c_other3_post_field)<0.9),\"non std c values\",\"\"))","v":"no non std area"}]
[null,null,null,null,null,null,null,null,null,null,null,null,null,null,null,null,null,null,null,null,null,null,null,null,null,null,null,null,null,null,null,null,null,null,"0","0",{"$f":"IF(VALUE(da_other4_pre_field)=0,\"no non std area\",IF(AND(VALUE(c_other4_pre_field)>0.3,VALUE(c_other4_pre_field)<0.9),\"non std c values\",\"\"))","v":"no non std area"},null,"0","0",{"$f":"IF(VALUE(da_other4_post_field)=0,\"no non std area\",IF(AND(VALUE(c_other4_post_field)>0.3,VALUE(c_other4_post_field)<0.9),\"non std c values\",\"\"))","v":"no non std area"}]
["Photo Description Here",null,null,null,null,null,null,null,"Photo Description Here",null,null,null,null,null,null,null,null,null,null,null,null,null,null,null,null,null,null,null,null,null,null,null,null,null,null,null,null,null,null,null,null,null,null,null,null,null,null,null,null,null,null,null,null,null,"Photo Description Here",null,null,null,null,null,null,null,"Photo Description Here",null,null,null,null,null,null,null,null,null,"Photo Description Here",null,null,null,null,null,null,null,"Photo Description Here",null,null,null,null,null,null,null,null,null,"Photo Description Here",null,null,null,null,null,null,null,"Photo Description Here",null,null,null,null,null,null,null,null,null,"Photo Description Here",null,null,null,null,null,null,null,"Photo Description Here"]
[null,null,null,null,null,null,null,null,null,null,null,null,null,null,null,null,null,null,null,null,null,null,null,null,null,null,null,null,null,null,null,null,null,null,null,null,{"$f":"IF(OR(AK111=\"non std c values\",AK112=\"non std c values\",AK113=\"non std c values\"),\"non std c values exist\", \"\")","v":""},null,null,null,{"$f":"IF(OR(AO111=\"non std c values\",AO112=\"non std c values\",AO113=\"non std c values\"),\"non std c values exist\", \"\")","v":""}]
[]
[]
[]
[]
[]
[]
[]
[]
[]
[]
[]
[]
[]
[]
[]
[{"$f":"_xlfn.CONCAT( _xlnm.sheet_title,\" SITE PHOTOS - PAGE 3\")","v":"PSH # OUTLET # SITE PHOTOS - PAGE 3"},null,null,null,null,null,null,null,null,null,null,null,null,null,null,null,null,null,null,null,null,null,null,null,null,null,null,null,null,null,null,null,null,null,null,null,null,null,null,null,null,null,null,null,null,null,null,null,null,null,null,null,null,null,null,null,null,null,null,null,null,null,null,null,null,null,null,null,null,null,null,null,"OUTLET SITE PHOTOS PAGE 3",null,null,null,null,null,null,null,null,null,null,null,null,null,null,null,null,null,"OUTLET SITE PHOTOS PAGE 3",null,null,null,null,null,null,null,null,null,null,null,null,null,null,null,null,null,"OUTLET SITE PHOTOS PAGE 3"]
["Photo Description Here",null,null,null,null,null,null,null,"Photo Description Here",null,null,null,null,null,null,null,null,null,null,null,null,null,null,null,null,null,null,null,null,null,null,null,null,null,null,null,null,null,null,null,null,null,null,null,null,null,null,null,null,null,null,null,null,null,null,null,null,null,null,null,null,null,null,null,null,null,null,null,null,null,null,null,"Photo Description Here",null,null,null,null,null,null,null,"Photo Description Here",null,null,null,null,null,null,null,null,null,"Photo Description Here",null,null,null,null,null,null,null,"Photo Description Here",null,null,null,null,null,null,null,null,null,"Photo Description Here",null,null,null,null,null,null,null,"Photo Description Here"]
[]
[]
[]
[]
[]
[]
[]
[]
[]
[]
[]
[]
[]
[]
[]
["Photo Description Here",null,null,null,null,null,null,null,"Photo Description Here",null,null,null,null,null,null,null,null,null,null,null,null,null,null,null,null,null,null,null,null,null,null,null,null,null,null,null,null,null,null,null,null,null,null,null,null,null,null,null,null,null,null,null,null,null,null,null,null,null,null,null,null,null,null,null,null,null,null,null,null,null,null,null,"Photo Description Here",null,null,null,null,null,null,null,"Photo Description Here",null,null,null,null,null,null,null,null,null,"Photo Description Here",null,null,null,null,null,null,null,"Photo Description Here",null,null,null,null,null,null,null,null,null,"Photo Description Here",null,null,null,null,null,null,null,"Photo Description Here"]
[]
[]
[]
[]
[]
[]
[]
[]
[]
[]
[]
[]
[]
[]
[]
[]
[{"$f":"_xlfn.CONCAT( _xlnm.sheet_title,\" SITE PHOTOS - PAGE 4\")","v":"PSH # OUTLET # SITE PHOTOS - PAGE 4"},null,null,null,null,null,null,null,null,null,null,null,null,null,null,null,null,null,null,null,null,null,null,null,null,null,null,null,null,null,null,null,null,null,null,null,null,null,null,null,null,null,null,null,null,null,null,null,null,null,null,null,null,null,null,null,null,null,null,null,null,null,null,null,null,null,null,null,null,null,null,null,null,null,null,null,null,null,null,null,null,null,null,null,null,null,null,null,null,null,"OUTLET SITE PHOTOS PAGE 4",null,null,null,null,null,null,null,null,null,null,null,null,null,null,null,null,null,"OUTLET SITE PHOTOS PAGE 4"]
["Photo Description Here",null,null,null,null,null,null,null,"Photo Description Here",null,null,null,null,null,null,null,null,null,null,null,null,null,null,null,null,null,null,null,null,null,null,null,null,null,null,null,null,null,null,null,null,null,null,null,null,null,null,null,null,null,null,null,null,null,null,null,null,null,null,null,null,null,null,null,null,null,null,null,null,null,null,null,null,null,null,null,null,null,null,null,null,null,null,null,null,null,null,null,null,null,"Photo Description Here",null,null,null,null,null,null,null,"Photo Description Here",null,null,null,null,null,null,null,null,null,"Photo Description Here",null,null,null,null,null,null,null,"Photo Description Here"]
[]
[]
[]
[]
[]
[]
[]
[]
[]
[]
[]
[]
[]
[]
[]
["Photo Description Here",null,null,null,null,null,null,null,"Photo Description Here",null,null,null,null,null,null,null,null,null,null,null,null,null,null,null,null,null,null,null,null,null,null,null,null,null,null,null,null,null,null,null,null,null,null,null,null,null,null,null,null,null,null,null,null,null,null,null,null,null,null,null,null,null,null,null,null,null,null,null,null,null,null,null,null,null,null,null,null,null,null,null,null,null,null,null,null,null,null,null,null,null,"Photo Description Here",null,null,null,null,null,null,null,"Photo Description Here",null,null,null,null,null,null,null,null,null,"Photo Description Here",null,null,null,null,null,null,null,"Photo Description Here"]
[]
[]
[]
[]
[]
[]
[]
[]
[]
[]
[]
[]
[]
[]
[]
[]
[{"$f":"_xlfn.CONCAT( _xlnm.sheet_title,\" SITE PHOTOS - PAGE 5\")","v":"PSH # OUTLET # SITE PHOTOS - PAGE 5"},null,null,null,null,null,null,null,null,null,null,null,null,null,null,null,null,null,null,null,null,null,null,null,null,null,null,null,null,null,null,null,null,null,null,null,null,null,null,null,null,null,null,null,null,null,null,null,null,null,null,null,null,null,null,null,null,null,null,null,null,null,null,null,null,null,null,null,null,null,null,null,null,null,null,null,null,null,null,null,null,null,null,null,null,null,null,null,null,null,null,null,null,null,null,null,null,null,null,null,null,null,null,null,null,null,null,null,"OUTLET SITE PHOTOS PAGE 5"]
["Photo Description Here",null,null,null,null,null,null,null,"Photo Description Here",null,null,null,null,null,null,null,null,null,null,null,null,null,null,null,null,null,null,null,null,null,null,null,null,null,null,null,null,null,null,null,null,null,null,null,null,null,null,null,null,null,null,null,null,null,null,null,null,null,null,null,null,null,null,null,null,null,null,null,null,null,null,null,null,null,null,null,null,null,null,null,null,null,null,null,null,null,null,null,null,null,null,null,null,null,null,null,null,null,null,null,null,null,null,null,null,null,null,null,"Photo Description Here",null,null,null,null,null,null,null,"Photo Description Here"]
[]
[]
[]
[]
[]
[]
[]
[]
[]
[]
[]
[]
[]
[]
[]
["Photo Description Here",null,null,null,null,null,null,null,"Photo Description Here",null,null,null,null,null,null,null,null,null,null,null,null,null,null,null,null,null,null,null,null,null,null,null,null,null,null,null,null,null,null,null,null,null,null,null,null,null,null,null,null,null,null,null,null,null,null,null,null,null,null,null,null,null,null,null,null,null,null,null,null,null,null,null,null,null,null,null,null,null,null,null,null,null,null,null,null,null,null,null,null,null,null,null,null,null,null,null,null,null,null,null,null,null,null,null,null,null,null,null,"Photo Description Here",null,null,null,null,null,null,null,"Photo Description Here"]
[]
[]
[]
[]
[]
[]
[]
[]
[]
[]
[]
[]
[]
[]
[]
[]
[]
[]
[]
[]
[]
[]
[]
[]
[]
[]
[]
[]
[]
[null,null,null,null,null,null,null,null,null,null,null,null,null,null,null,null,null,null,null,null,null,null,null,null,null,null,null,null,null,null,null,null,null,null,"τ10 Post = "]
[]
[]
[]
["ROWS HOLDING CELL DATA BELOW TO BE HIDDEN (CELLS HOLD DATA+FORMATTING FOR MACROS AND CALCULATIONS)"]
[]
[]
["hidden formatting for triangular / trapezoidal macros DO NOT TOUCH",null,null,null,null,null,null,null,"hidden formatting for triangular / trapezoidal macros DO NOT TOUCH"]
["Depth (ft) =",null,null,null,"H:V (Lt) = ",null,null,null,"Depth (ft) =",null,"H:V (Lt) ="]
["Slope (ft/ft) = ",null,null,null,"H:V (Rt) = ",null,null,null,"Slope (ft/ft) = ",null,"H:V (Rt) ="]
["Manning's N =",null,null,null,"Base Width (ft.) =",0,null,null,"Manning's N =",null,"Base Width ="]
["Notes (lining, condition, etc.): ",null,null,null,null,null,null,null,"Notes (lining, condition, etc.): "]
[]
[]
[]
[]
[]
["hidden formatting for irregular channel macro DO NOT TOUCH",null,null,null,null,null,null,null,"hidden formatting for irregular channel macro DO NOT TOUCH"]
[]
[{"$f":"IF(AND($J$30<>\"\",Post_Const_Geometry_Selection=\"Geometry Same as Pre-Construction\"),\"Slope (ft/ft) = \",\"\")","v":""},null,null,null,null,null,null,null,{"$f":"IF($J$30<>\"\",\"Slope (ft/ft) = \",\"\")","v":""}]
["Notes:",null,null,null,null,null,null,null,"Notes:"]
[]
[]
[]
[]
[]
["hidden formatting for pipe macros DO NOT TOUCH",null,null,null,null,null,null,null,"hidden formatting for pipe macros DO NOT TOUCH",null,null,null,null,null,null,null,null,null,null,"hidden formatting for blank DO NOT TOUCH"]
["Diameter (in) =",null,null,null,"QCapacity (cfs) =",{"$f":"IF(OR(B273=\"\",B274=\"\"),\"\",IFERROR(MIN((SQRT(B274)/D275)*((B273/16)^(8/3)),VLOOKUP(B273,'PICK LISTS'!$E$44:$F$54,2,FALSE)),(SQRT(B274)/D275)*((B273/16)^(8/3))))","v":""},null,null,"Diameter (in) =",null,null,"QCapacity (cfs) = ",null,{"$f":"IF(OR(J273=\"\",J274=\"\"),\"\",IFERROR(MIN((SQRT(J274)/K275)*((J273/16)^(8/3)),VLOOKUP(J273,'PICK LISTS'!$E$44:$F$54,2,FALSE)),(SQRT(J274)/K275)*((J273/16)^(8/3))))","v":""},{"$f":"IF(OR(N273=\"\",N274=\"\"),\"\",IF(N274>N273,\"NOTE: Q10 > Qfull\",\"Q10 < Qfull\"))","v":""},null,null,null,null,"Notes:"]
["Slope (ft/ft) = ",null,null,null,"Q10pre (cfs) =",{"$f":"$E$16","v":0},null,null,"Slope (ft/ft) = ",null,null,"Q10 Post (cfs) = ",null,{"$f":"$K$16","v":0}]
["Pipe Material =","RCP",null,{"$f":"VLOOKUP(B275,'PICK LISTS'!$E$29:$F$33, 2, FALSE)","v":1.2E-2},null,null,null,null,"Pipe Material =","RCP",{"$f":"VLOOKUP(J275,'PICK LISTS'!$E$29:$F$33, 2, FALSE)","v":1.2E-2}]
["Notes:",null,null,null,null,null,null,null,"Notes:"]
[]
[]
[]
[]
[null,null,null,null,null,null,null,null,"hidden formatting for same as pre const. ds rec pipe macro DO NOT TOUCH"]
[]
[null,null,null,null,null,null,null,null,null,null,"Qfull (cfs) = ",{"$f":"F282","v":0},null,{"$f":"IF(OR(L283=\"\",L284=\"\"),\"\",IF(L284>L283,\"NOTE: Q10 > Qfull\",\"Q10 < Qfull\"))","v":""}]
[null,null,null,null,null,null,null,null,null,null,"Q10 Post (cfs) = ",{"$f":"IF($K$16=0,\"\",$K$16)","v":""}]
[]
[]
[]
[]
[]
[]
[]
["SOIL TYPE"]
[]
["LINER TYPE"]
[]
[]
[]
[null,{"$f":"IF($I$30=\"N/A\",\"N/A\",IF(Soil_Type=\"Permanent Matting Product (stable)\",\"User to Define\",IF($J$30<>\"\",\"N/A\",IF($I$30=\"Soil\",$AD$41,IF($I$30=\"Non-Soil\",$AD$43,\"\")))))","v":""}]
[null,{"$f":"IF($A$34=\"SOIL TYPE\",\"N/A\",IF(Soil_Type=\"Grass / Dense Veg. (no bare soil spots)\",\"N/A\",IF($J$30<>\"\",$AD$43,\"\")))","v":""}]

{"sheet":"USGS-5158 TAB TEMPLATE","index":6,"n_rows":299,"n_cols":117,"rows_kept":299,"cut":false,"hidden":true,"merged":[[291,1,291,4],[293,1,293,4],[35,3,36,5],[58,29,58,30],[58,31,60,32],[59,29,68,30],[61,31,68,32],[164,0,164,16],[165,0,180,7],[165,8,180,16],[181,0,197,7],[181,8,197,16],[198,0,198,16],[199,0,214,7],[199,8,214,16],[215,0,231,7],[215,8,231,16],[97,0,112,7],[97,8,112,16],[113,0,129,7],[113,8,129,16],[130,0,130,16],[131,0,146,7],[131,8,146,16],[282,13,284,14],[256,0,257,5],[256,8,257,15],[272,14,274,15],[35,7,35,9],[35,10,35,15],[5,4,5,5],[265,0,267,5],[265,8,267,15],[12,0,13,0],[12,7,13,7],[5,1,5,3],[7,0,7,5],[7,7,7,11],[7,13,7,15],[272,19,276,24],[275,0,276,5],[275,8,276,15],[71,0,72,16],[73,0,95,7],[73,8,95,16],[40,0,41,5],[40,8,41,14],[43,0,47,5],[43,8,47,15],[50,0,50,16],[51,0,70,16],[96,0,96,16],[147,0,163,7],[147,8,163,16],[215,108,231,115],[215,116,231,124],[249,0,251,24],[253,10,253,12],[254,10,254,12],[255,10,255,12],[181,90,197,97],[181,98,197,106],[181,108,197,115],[181,116,197,124],[198,108,198,124],[199,108,214,115],[199,116,214,124],[164,90,164,106],[164,108,164,124],[165,90,180,97],[165,98,180,106],[165,108,180,115],[165,116,180,124],[147,72,163,79],[147,80,163,88],[147,90,163,97],[147,98,163,106],[147,108,163,115],[147,116,163,124],[130,72,130,88],[130,90,130,106],[130,108,130,124],[131,72,146,79],[131,80,146,88],[131,90,146,97],[131,98,146,106],[131,108,146,115],[131,116,146,124],[97,108,112,115],[97,116,112,124],[104,34,105,34],[113,54,129,61],[113,62,129,70],[113,72,129,79],[113,80,129,88],[113,90,129,97],[113,98,129,106],[113,108,129,115],[97,54,112,61],[97,62,112,70],[97,72,112,79],[97,80,112,88],[97,90,112,97],[97,98,112,106],[113,116,129,124],[95,72,95,88],[95,90,95,106],[95,108,95,124],[96,54,96,70],[96,72,96,88],[96,90,96,106],[96,108,96,124],[58,18,59,19],[58,20,59,20],[95,54,95,70],[36,27,36,28],[38,0,38,5],[38,8,38,15],[16,0,17,0],[16,1,17,1],[16,7,17,7],[16,8,17,8],[16,18,29,23],[33,1,33,4],[33,7,33,9],[33,10,33,15],[28,0,29,0],[28,3,30,4],[29,5,29,6],[28,7,30,7],[15,18,15,23],[7,38,8,38],[7,39,8,39],[7,40,8,40],[7,41,8,41],[7,42,8,42],[7,43,8,43],[7,31,8,31],[7,32,8,32],[7,33,8,33],[7,34,8,34],[7,35,8,35],[7,36,8,36],[7,26,8,26],[7,27,8,27],[7,28,8,28],[7,29,8,29],[7,30,8,30],[2,1,4,4],[1,7,1,8],[2,5,2,9],[0,11,0,16],[7,44,8,44],[7,45,8,45],[7,46,8,46],[7,47,8,47],[7,48,8,48],[0,25,3,51],[0,52,3,75],[0,76,3,99],[0,100,3,125],[1,11,1,16],[5,26,6,36],[5,38,6,48],[2,11,2,16],[3,5,3,9],[3,11,3,16],[5,11,5,13],[5,14,5,15]]}
["TIP Project:",{"$f":"TIP_number_MAIN_tab","v":0},null,null,null,null,null,null,null,null,"Date:",{"$f":"Date_MAIN_tab","v":"00:00:00"},null,null,null,null,null,null,null,null,null,null,null,null,null,"COLUMNS HOLDING CELLS BELOW TO BE HIDDEN (CELLS HOLD BACKGROUND DATA FOR MACROS AND CALCULATIONS)",null,null,null,null,null,null,null,null,null,null,null,null,null,null,null,null,null,null,null,null,null,null,null,null,null,null,"COLUMNS HOLDING CELLS BELOW TO BE HIDDEN (CELLS HOLD BACKGROUND DATA FOR MACROS AND CALCULATIONS)",null,null,null,null,null,null,null,null,null,null,null,null,null,null,null,null,null,null,null,null,null,null,null,"COLUMNS HOLDING CELLS BELOW TO BE HIDDEN (CELLS HOLD BACKGROUND DATA FOR MACROS AND CALCULATIONS)",null,null,null,null,null,null,null,null,null,null,null,null,null,null,null,null,null,null,null,null,null,null,null,"COLUMNS HOLDING CELLS BELOW TO BE HIDDEN (CELLS HOLD BACKGROUND DATA FOR MACROS AND CALCULATIONS)"]
["County:",null,null,null,null,null,null,"PSH # OUTLET #",null,null,"  Design Firm:",{"$f":"design_firm_MAIN_tab","v":0}]
["Description:",{"$f":"IF(project_description_MAIN_tab=\"\",\"\",project_description_MAIN_tab)","v":""},null,null,null,null,null,"PSH # OUTLET #",null,null,"  Designed By:",{"$f":"designer_MAIN_tab","v":0}]
[null,null,null,null,null,"Input Alignment, Station, Offset Here",null,null,null,null,"Reviewed By:"]
[]
[{"$f":"MAIN!A37","v":"Version 1.0"},"Outlet UID Number:",null,null,{"$f":"IF(TIP_number_MAIN_tab=0,\"ENTER TIP OR PROJ #\",AG30)","v":"ENTER TIP OR PROJ #"},null,null,"Latitude:",null,null,"Longitude:",null,null,null,"Google Maps",null,null,null,null,null,null,null,null,null,null,null,"PRE CONST. MANNING'S EQUATION OPEN CHANNEL",null,null,null,null,null,null,null,null,null,null,null,"POST CONST. MANNING'S EQUATION OPEN CHANNEL"]
[]
["PRE-CONSTRUCTION (USGS-5158 METHOD)",null,null,null,null,null,null,"POST-CONSTRUCTION (USGS-5158 METHOD)",null,null,null,null,null,"CHANGE",null,null,null,null,null,null,null,null,null,null,null,null,"B (ft)","norm. depth (ft)","avg sideslope","S (ft/ft)","N val","A (sq.ft.)","P (ft.)","R (ft.)","Q (cfs)","Vc (ft/s)","Q Compare Check: Make sure = 0 (set to 0 by changing y in data>what if> goal seek)",null,"B (ft)","norm. depth (ft)","avg sideslope","S (ft/ft)","N val","A (sq.ft.)","P (ft.)","R (ft.)","Q (cfs)","Vc (ft/s)","Q Compare Check: Make sure = 0 (set to 0 by changing y in data>what if> goal seek)"]
[]
[null,null,null,"Q2 =",null,"cfs",null,null,null,"Q2 =",null,"cfs",null,"Q2 =",{"$f":"IF(OR(q2post=\"\",q2pre=\"\"),\"\",(q2post/q2pre)-1)","v":""}]
["DA (SQ. MI.) = ",null,null,"V2 =",null,"ft./s",null,"DA (SQ. MI.) = ",null,"V2 =",null,"ft./s",null,"V2 =",{"$f":"IF(OR(v2post=0,v2pre=0),\"\",(v2post/v2pre)-1)","v":""},null,null,null,"Green = Calculated / up to date (color 210,255,210)",null,null,null,null,null,null,null,{"$f":"Base_Width_Pre","v":0},1.4727991030475791,{"$f":"(Side_Slope_Left_Pre+Side_Slope_Right_Pre)/2","v":0},{"$f":"Slope_Pre","v":0},{"$f":"Roughness_Pre","v":0},{"$f":"AA11*AB11+AC11*AB11^2","v":0},{"$f":"AA11+((AB11*Side_Slope_Left_Pre)^2+AB11^2)^0.5+((AB11*Side_Slope_Right_Pre)^2+AB11^2)^0.5","v":2.9455982060951582},{"$f":"AF11/AG11","v":0},{"$f":"1.49/AE11*AF11*AH11^0.667*AD11^0.5","v":{"$error":"#DIV/0!"}},{"$f":"1.49/AE11*AH11^0.667*AD11^0.5","v":{"$error":"#DIV/0!"}},{"$f":"AI11-q2pre","v":{"$error":"#DIV/0!"}},{"$f":"ROUND(AK11,1)","v":{"$error":"#DIV/0!"}},{"$f":"IF(Post_Const_Geometry_Selection=\"Geometry Same as Pre-Construction\",Base_Width_Pre,Base_Width_Post)","v":0},1,{"$f":"IF(Post_Const_Geometry_Selection=\"Geometry Same as Pre-Construction\",(Side_Slope_Left_Pre+Side_Slope_Right_Pre)/2,(Side_Slope_Left_Post+Side_Slope_Right_Post)/2)","v":0},{"$f":"IF(Post_Const_Geometry_Selection=\"Geometry Same as Pre-Construction\",Slope_Pre,Slope_Post)","v":0},{"$f":"IF(Post_Const_Geometry_Selection=\"Geometry Same as Pre-Construction\",Roughness_Pre,Roughness_Post)","v":0},{"$f":"AM11*AN11+AO11*AN11^2","v":0},{"$f":"IF(Post_Const_Geometry_Selection=\"Geometry Same as Pre-Construction\",AM11+((AN11*Side_Slope_Left_Pre)^2+AN11^2)^0.5+((AN11*Side_Slope_Right_Pre)^2+AN11^2)^0.5,AM11+((AN11*Side_Slope_Left_Post)^2+AN11^2)^0.5+((AN11*Side_Slope_Right_Post)^2+AN11^2)^0.5)","v":2},{"$f":"AR11/AS11","v":0},{"$f":"1.49/AQ11*AR11*AT11^0.667*AP11^0.5","v":{"$error":"#DIV/0!"}},{"$f":"1.49/AQ11*AT11^0.667*AP11^0.5","v":{"$error":"#DIV/0!"}},{"$f":"AU11-q2post","v":{"$error":"#DIV/0!"}},{"$f":"ROUND(AW11,1)","v":{"$error":"#DIV/0!"}}]
["Hyd. Region = ",null,null,"D2 =",null,"ft.",null,"Hyd. Region = ",{"$f":"IF(B12=\"\",\"\",B12)","v":""},"D2 =",null,"ft.",null,"D2 =",{"$f":"IF(OR(d2post=0,d2pre=0),\"\",(d2post/d2pre)-1)","v":""},null,null,null,"Red = Calculated, incorrect, or not up to date (color 255,165,165)",null,null,null,null,null,null,null,{"$f":"Base_Width_Pre","v":0},1.4727991030475791,{"$f":"(Side_Slope_Left_Pre+Side_Slope_Right_Pre)/2","v":0},{"$f":"Slope_Pre","v":0},{"$f":"Roughness_Pre","v":0},{"$f":"AA12*AB12+AC12*AB12^2","v":0},{"$f":"AA12+((AB12*Side_Slope_Left_Pre)^2+AB12^2)^0.5+((AB12*Side_Slope_Right_Pre)^2+AB12^2)^0.5","v":2.9455982060951582},{"$f":"AF12/AG12","v":0},{"$f":"1.49/AE12*AF12*AH12^0.667*AD12^0.5","v":{"$error":"#DIV/0!"}},{"$f":"1.49/AE12*AH12^0.667*AD12^0.5","v":{"$error":"#DIV/0!"}},{"$f":"AI12-q2pre","v":{"$error":"#DIV/0!"}},{"$f":"ROUND(AK12,1)","v":{"$error":"#DIV/0!"}},{"$f":"IF(Post_Const_Geometry_Selection=\"Geometry Same as Pre-Construction\",Base_Width_Pre,Base_Width_Post)","v":0},1,{"$f":"IF(Post_Const_Geometry_Selection=\"Geometry Same as Pre-Construction\",(Side_Slope_Left_Pre+Side_Slope_Right_Pre)/2,(Side_Slope_Left_Post+Side_Slope_Right_Post)/2)","v":0},{"$f":"IF(Post_Const_Geometry_Selection=\"Geometry Same as Pre-Construction\",Slope_Pre,Slope_Post)","v":0},{"$f":"IF(Post_Const_Geometry_Selection=\"Geometry Same as Pre-Construction\",Roughness_Pre,Roughness_Post)","v":0},{"$f":"AM12*AN12+AO12*AN12^2","v":0},{"$f":"IF(Post_Const_Geometry_Selection=\"Geometry Same as Pre-Construction\",AM12+((AN12*Side_Slope_Left_Pre)^2+AN12^2)^0.5+((AN12*Side_Slope_Right_Pre)^2+AN12^2)^0.5,AM12+((AN12*Side_Slope_Left_Post)^2+AN12^2)^0.5+((AN12*Side_Slope_Right_Post)^2+AN12^2)^0.5)","v":2},{"$f":"AR12/AS12","v":0},{"$f":"1.49/AQ12*AR12*AT12^0.667*AP12^0.5","v":{"$error":"#DIV/0!"}},{"$f":"1.49/AQ12*AT12^0.667*AP12^0.5","v":{"$error":"#DIV/0!"}},{"$f":"AU12-q2post","v":{"$error":"#DIV/0!"}},{"$f":"ROUND(AW12,1)","v":{"$error":"#DIV/0!"}}]
["% Imp. Area (Total) =",null,null,"Q5 =",null,"cfs",null,"% Imp. Area (Total) =",null,"Q5 =",null,"cfs",null,"Q5 =",{"$f":"IF(OR(q5post=\"\",q5pre=\"\"),\"\",(q5post/q5pre)-1)","v":""},null,null,null,"light blue = user iput (cells unlocked) (color 190,240,240)"]
[null,null,null,"V5 =",null,"ft./s",null,null,null,"V5 =",null,"ft./s",null,"V5 =",{"$f":"IF(OR(v5post=0,v5pre=0),\"\",(v5post/v5pre)-1)","v":""},null,null,null,"Yellow = Warning / Caution           (color 255,255,100)",null,null,null,null,null,null,null,{"$f":"Base_Width_Pre","v":0},1.5647239205356298,{"$f":"(Side_Slope_Left_Pre+Side_Slope_Right_Pre)/2","v":0},{"$f":"Slope_Pre","v":0},{"$f":"Roughness_Pre","v":0},{"$f":"AA14*AB14+AC14*AB14^2","v":0},{"$f":"AA14+((AB14*Side_Slope_Left_Pre)^2+AB14^2)^0.5+((AB14*Side_Slope_Right_Pre)^2+AB14^2)^0.5","v":3.1294478410712596},{"$f":"AF14/AG14","v":0},{"$f":"1.49/AE14*AF14*AH14^0.667*AD14^0.5","v":{"$error":"#DIV/0!"}},{"$f":"1.49/AE14*AH14^0.667*AD14^0.5","v":{"$error":"#DIV/0!"}},{"$f":"AI14-q5pre","v":{"$error":"#DIV/0!"}},{"$f":"ROUND(AK14,1)","v":{"$error":"#DIV/0!"}},{"$f":"IF(Post_Const_Geometry_Selection=\"Geometry Same as Pre-Construction\",Base_Width_Pre,Base_Width_Post)","v":0},1,{"$f":"IF(Post_Const_Geometry_Selection=\"Geometry Same as Pre-Construction\",(Side_Slope_Left_Pre+Side_Slope_Right_Pre)/2,(Side_Slope_Left_Post+Side_Slope_Right_Post)/2)","v":0},{"$f":"IF(Post_Const_Geometry_Selection=\"Geometry Same as Pre-Construction\",Slope_Pre,Slope_Post)","v":0},{"$f":"IF(Post_Const_Geometry_Selection=\"Geometry Same as Pre-Construction\",Roughness_Pre,Roughness_Post)","v":0},{"$f":"AM14*AN14+AO14*AN14^2","v":0},{"$f":"IF(Post_Const_Geometry_Selection=\"Geometry Same as Pre-Construction\",AM14+((AN14*Side_Slope_Left_Pre)^2+AN14^2)^0.5+((AN14*Side_Slope_Right_Pre)^2+AN14^2)^0.5,AM14+((AN14*Side_Slope_Left_Post)^2+AN14^2)^0.5+((AN14*Side_Slope_Right_Post)^2+AN14^2)^0.5)","v":2},{"$f":"AR14/AS14","v":0},{"$f":"1.49/AQ14*AR14*AT14^0.667*AP14^0.5","v":{"$error":"#DIV/0!"}},{"$f":"1.49/AQ14*AT14^0.667*AP14^0.5","v":{"$error":"#DIV/0!"}},{"$f":"AU14-q5post","v":{"$error":"#DIV/0!"}},{"$f":"ROUND(AW14,1)","v":{"$error":"#DIV/0!"}}]
["DA imp in R/W = ",null,null,"D5 =",null,"ft.",null,"DA imp in R/W = ",null,"D5 =",null,"ft.",null,"D5 =",{"$f":"IF(OR(d5post=0,d5pre=0),\"\",(d5post/d5pre)-1)","v":""},null,null,null,null,null,null,null,null,null,null,null,{"$f":"Base_Width_Pre","v":0},1.5647239205356298,{"$f":"(Side_Slope_Left_Pre+Side_Slope_Right_Pre)/2","v":0},{"$f":"Slope_Pre","v":0},{"$f":"Roughness_Pre","v":0},0,{"$f":"AA15+((AB15*Side_Slope_Left_Pre)^2+AB15^2)^0.5+((AB15*Side_Slope_Right_Pre)^2+AB15^2)^0.5","v":3.1294478410712596},0,{"$error":"#DIV/0!"},{"$error":"#DIV/0!"},{"$f":"AI15-q5pre","v":{"$error":"#DIV/0!"}},{"$error":"#DIV/0!"},{"$f":"IF(Post_Const_Geometry_Selection=\"Geometry Same as Pre-Construction\",Base_Width_Pre,Base_Width_Post)","v":0},1,{"$f":"IF(Post_Const_Geometry_Selection=\"Geometry Same as Pre-Construction\",(Side_Slope_Left_Pre+Side_Slope_Right_Pre)/2,(Side_Slope_Left_Post+Side_Slope_Right_Post)/2)","v":0},{"$f":"IF(Post_Const_Geometry_Selection=\"Geometry Same as Pre-Construction\",Slope_Pre,Slope_Post)","v":0},{"$f":"IF(Post_Const_Geometry_Selection=\"Geometry Same as Pre-Construction\",Roughness_Pre,Roughness_Post)","v":0},0,{"$f":"IF(Post_Const_Geometry_Selection=\"Geometry Same as Pre-Construction\",AM15+((AN15*Side_Slope_Left_Pre)^2+AN15^2)^0.5+((AN15*Side_Slope_Right_Pre)^2+AN15^2)^0.5,AM15+((AN15*Side_Slope_Left_Post)^2+AN15^2)^0.5+((AN15*Side_Slope_Right_Post)^2+AN15^2)^0.5)","v":2},0,{"$error":"#DIV/0!"},{"$error":"#DIV/0!"},{"$f":"AU15-q5post","v":{"$error":"#DIV/0!"}},{"$error":"#DIV/0!"}]
[null,null,null,"Q10 =",null,"cfs",null,null,null,"Q10 =",null,"cfs",null,"Q10 =",{"$f":"IF(OR(q10post=\"\",q10pre=\"\"),\"\",(q10post/q10pre)-1)","v":""},null,null,null,"User Notes (will not be printed)",null,null,null,null,null,null,null,null,null,null,null,null,null,null,null,null,null,null,0]
["% Imp. Area (NCDOT Contribution)",{"$f":"IF(OR(da_pre_imp=0,da_total_pre=0),\"\",(da_pre_imp/(da_total_pre*640)))","v":""},null,"V10 =",null,"ft./s",null,"% Imp. Area (NCDOT Contribution)",{"$f":"IF(OR(da_post_imp=0,da_total_post=0),\"\",(da_post_imp/(da_total_post*640)))","v":""},"V10 =",null,"ft./s",null,"V10 =",{"$f":"IF(OR(v10post=0,v10pre=0),\"\",(v10post/v10pre)-1)","v":""},null,null,null,null,null,null,null,null,null,null,null,{"$f":"Base_Width_Pre","v":0},1.6213254592941764,{"$f":"(Side_Slope_Left_Pre+Side_Slope_Right_Pre)/2","v":0},{"$f":"Slope_Pre","v":0},{"$f":"Roughness_Pre","v":0},0,{"$f":"AA17+((AB17*Side_Slope_Left_Pre)^2+AB17^2)^0.5+((AB17*Side_Slope_Right_Pre)^2+AB17^2)^0.5","v":3.2426509185883527},0,{"$error":"#DIV/0!"},{"$error":"#DIV/0!"},{"$f":"AI17-q10pre","v":{"$error":"#DIV/0!"}},{"$error":"#DIV/0!"},{"$f":"IF(Post_Const_Geometry_Selection=\"Geometry Same as Pre-Construction\",Base_Width_Pre,Base_Width_Post)","v":0},1,{"$f":"IF(Post_Const_Geometry_Selection=\"Geometry Same as Pre-Construction\",(Side_Slope_Left_Pre+Side_Slope_Right_Pre)/2,(Side_Slope_Left_Post+Side_Slope_Right_Post)/2)","v":0},{"$f":"IF(Post_Const_Geometry_Selection=\"Geometry Same as Pre-Construction\",Slope_Pre,Slope_Post)","v":0},{"$f":"IF(Post_Const_Geometry_Selection=\"Geometry Same as Pre-Construction\",Roughness_Pre,Roughness_Post)","v":0},{"$f":"AM17*AN17+AO17*AN17^2","v":0},{"$f":"IF(Post_Const_Geometry_Selection=\"Geometry Same as Pre-Construction\",AM17+((AN17*Side_Slope_Left_Pre)^2+AN17^2)^0.5+((AN17*Side_Slope_Right_Pre)^2+AN17^2)^0.5,AM17+((AN17*Side_Slope_Left_Post)^2+AN17^2)^0.5+((AN17*Side_Slope_Right_Post)^2+AN17^2)^0.5)","v":2},{"$f":"AR17/AS17","v":0},{"$f":"1.49/AQ17*AR17*AT17^0.667*AP17^0.5","v":{"$error":"#DIV/0!"}},{"$f":"1.49/AQ17*AT17^0.667*AP17^0.5","v":{"$error":"#DIV/0!"}},{"$f":"AU17-q10post","v":{"$error":"#DIV/0!"}},{"$error":"#DIV/0!"}]
[null,null,null,"D10 =",null,"ft.",null,null,null,"D10 =",null,"ft.",null,"D10 =",{"$f":"IF(OR(d10post=0,d10pre=0),\"\",(d10post/d10pre)-1)","v":""},null,null,null,null,null,null,null,null,null,null,null,{"$f":"Base_Width_Pre","v":0},1.6213254592941764,{"$f":"(Side_Slope_Left_Pre+Side_Slope_Right_Pre)/2","v":0},{"$f":"Slope_Pre","v":0},{"$f":"Roughness_Pre","v":0},0,{"$f":"AA18+((AB18*Side_Slope_Left_Pre)^2+AB18^2)^0.5+((AB18*Side_Slope_Right_Pre)^2+AB18^2)^0.5","v":3.2426509185883527},0,{"$error":"#DIV/0!"},{"$error":"#DIV/0!"},{"$f":"AI18-q10pre","v":{"$error":"#DIV/0!"}},{"$error":"#DIV/0!"},{"$f":"IF(Post_Const_Geometry_Selection=\"Geometry Same as Pre-Construction\",Base_Width_Pre,Base_Width_Post)","v":0},1,{"$f":"IF(Post_Const_Geometry_Selection=\"Geometry Same as Pre-Construction\",(Side_Slope_Left_Pre+Side_Slope_Right_Pre)/2,(Side_Slope_Left_Post+Side_Slope_Right_Post)/2)","v":0},{"$f":"IF(Post_Const_Geometry_Selection=\"Geometry Same as Pre-Construction\",Slope_Pre,Slope_Post)","v":0},{"$f":"IF(Post_Const_Geometry_Selection=\"Geometry Same as Pre-Construction\",Roughness_Pre,Roughness_Post)","v":0},0,{"$f":"IF(Post_Const_Geometry_Selection=\"Geometry Same as Pre-Construction\",AM18+((AN18*Side_Slope_Left_Pre)^2+AN18^2)^0.5+((AN18*Side_Slope_Right_Pre)^2+AN18^2)^0.5,AM18+((AN18*Side_Slope_Left_Post)^2+AN18^2)^0.5+((AN18*Side_Slope_Right_Post)^2+AN18^2)^0.5)","v":2},0,{"$error":"#DIV/0!"},{"$error":"#DIV/0!"},{"$f":"AU18-q10post","v":{"$error":"#DIV/0!"}},{"$error":"#DIV/0!"}]
[null,null,null,"Q25 =",null,"cfs",null,null,null,"Q25 =",null,"cfs",null,"Q25 =",{"$f":"IF(OR(q25post=\"\",q25pre=\"\"),\"\",(q25post/q25pre)-1)","v":""}]
[null,null,null,"V25 =",null,"ft./s",null,null,null,"V25 =",null,"ft./s",null,"V25 =",{"$f":"IF(OR(v25post=0,v25pre=0),\"\",(v25post/v25pre)-1)","v":""},null,null,null,null,null,null,null,null,null,null,null,{"$f":"Base_Width_Pre","v":0},1.682068068069611,{"$f":"(Side_Slope_Left_Pre+Side_Slope_Right_Pre)/2","v":0},{"$f":"Slope_Pre","v":0},{"$f":"Roughness_Pre","v":0},{"$f":"AA20*AB20+AC20*AB20^2","v":0},{"$f":"AA20+((AB20*Side_Slope_Left_Pre)^2+AB20^2)^0.5+((AB20*Side_Slope_Right_Pre)^2+AB20^2)^0.5","v":3.3641361361392219},0,{"$error":"#DIV/0!"},{"$error":"#DIV/0!"},{"$f":"AI20-q25pre","v":{"$error":"#DIV/0!"}},{"$error":"#DIV/0!"},{"$f":"IF(Post_Const_Geometry_Selection=\"Geometry Same as Pre-Construction\",Base_Width_Pre,Base_Width_Post)","v":0},1,{"$f":"IF(Post_Const_Geometry_Selection=\"Geometry Same as Pre-Construction\",(Side_Slope_Left_Pre+Side_Slope_Right_Pre)/2,(Side_Slope_Left_Post+Side_Slope_Right_Post)/2)","v":0},{"$f":"IF(Post_Const_Geometry_Selection=\"Geometry Same as Pre-Construction\",Slope_Pre,Slope_Post)","v":0},{"$f":"IF(Post_Const_Geometry_Selection=\"Geometry Same as Pre-Construction\",Roughness_Pre,Roughness_Post)","v":0},{"$f":"AM20*AN20+AO20*AN20^2","v":0},{"$f":"IF(Post_Const_Geometry_Selection=\"Geometry Same as Pre-Construction\",AM20+((AN20*Side_Slope_Left_Pre)^2+AN20^2)^0.5+((AN20*Side_Slope_Right_Pre)^2+AN20^2)^0.5,AM20+((AN20*Side_Slope_Left_Post)^2+AN20^2)^0.5+((AN20*Side_Slope_Right_Post)^2+AN20^2)^0.5)","v":2},{"$f":"AR20/AS20","v":0},{"$f":"1.49/AQ20*AR20*AT20^0.667*AP20^0.5","v":{"$error":"#DIV/0!"}},{"$f":"1.49/AQ20*AT20^0.667*AP20^0.5","v":{"$error":"#DIV/0!"}},{"$f":"AU20-q25post","v":{"$error":"#DIV/0!"}},{"$error":"#DIV/0!"}]
[null,null,null,"D25 =",null,"ft.",null,null,null,"D25 =",null,"ft.",null,"D25 =",{"$f":"IF(OR(d25post=0,d25pre=0),\"\",(d25post/d25pre)-1)","v":""},null,null,null,null,null,null,null,null,null,null,null,{"$f":"Base_Width_Pre","v":0},1.682068068069611,{"$f":"(Side_Slope_Left_Pre+Side_Slope_Right_Pre)/2","v":0},{"$f":"Slope_Pre","v":0},{"$f":"Roughness_Pre","v":0},0,{"$f":"AA21+((AB21*Side_Slope_Left_Pre)^2+AB21^2)^0.5+((AB21*Side_Slope_Right_Pre)^2+AB21^2)^0.5","v":3.3641361361392219},0,{"$error":"#DIV/0!"},{"$error":"#DIV/0!"},{"$f":"AI21-q25pre","v":{"$error":"#DIV/0!"}},{"$error":"#DIV/0!"},{"$f":"IF(Post_Const_Geometry_Selection=\"Geometry Same as Pre-Construction\",Base_Width_Pre,Base_Width_Post)","v":0},1,{"$f":"IF(Post_Const_Geometry_Selection=\"Geometry Same as Pre-Construction\",(Side_Slope_Left_Pre+Side_Slope_Right_Pre)/2,(Side_Slope_Left_Post+Side_Slope_Right_Post)/2)","v":0},{"$f":"IF(Post_Const_Geometry_Selection=\"Geometry Same as Pre-Construction\",Slope_Pre,Slope_Post)","v":0},{"$f":"IF(Post_Const_Geometry_Selection=\"Geometry Same as Pre-Construction\",Roughness_Pre,Roughness_Post)","v":0},{"$f":"AM21*AN21+AO21*AN21^2","v":0},{"$f":"IF(Post_Const_Geometry_Selection=\"Geometry Same as Pre-Construction\",AM21+((AN21*Side_Slope_Left_Pre)^2+AN21^2)^0.5+((AN21*Side_Slope_Right_Pre)^2+AN21^2)^0.5,AM21+((AN21*Side_Slope_Left_Post)^2+AN21^2)^0.5+((AN21*Side_Slope_Right_Post)^2+AN21^2)^0.5)","v":2},0,{"$error":"#DIV/0!"},{"$error":"#DIV/0!"},{"$f":"AU21-q25post","v":{"$error":"#DIV/0!"}},{"$error":"#DIV/0!"}]
[null,null,null,"Q50 =",null,"cfs",null,null,null,"Q50 =",null,"cfs",null,"Q50 =",{"$f":"IF(OR(q50post=\"\",q50pre=\"\"),\"\",(q50post/q50pre)-1)","v":""}]
[null,null,null,"V50 =",null,"ft./s",null,null,null,"V50 =",null,"ft./s",null,"V50 =",{"$f":"IF(OR(v50post=0,v50pre=0),\"\",(v50post/v50pre)-1)","v":""},null,null,null,null,null,null,null,null,null,null,null,{"$f":"Base_Width_Pre","v":0},1.7196104937144696,{"$f":"(Side_Slope_Left_Pre+Side_Slope_Right_Pre)/2","v":0},{"$f":"Slope_Pre","v":0},{"$f":"Roughness_Pre","v":0},0,{"$f":"AA23+((AB23*Side_Slope_Left_Pre)^2+AB23^2)^0.5+((AB23*Side_Slope_Right_Pre)^2+AB23^2)^0.5","v":3.4392209874289392},0,{"$error":"#DIV/0!"},{"$error":"#DIV/0!"},{"$f":"AI23-q50pre","v":{"$error":"#DIV/0!"}},{"$error":"#DIV/0!"},{"$f":"IF(Post_Const_Geometry_Selection=\"Geometry Same as Pre-Construction\",Base_Width_Pre,Base_Width_Post)","v":0},1,{"$f":"IF(Post_Const_Geometry_Selection=\"Geometry Same as Pre-Construction\",(Side_Slope_Left_Pre+Side_Slope_Right_Pre)/2,(Side_Slope_Left_Post+Side_Slope_Right_Post)/2)","v":0},{"$f":"IF(Post_Const_Geometry_Selection=\"Geometry Same as Pre-Construction\",Slope_Pre,Slope_Post)","v":0},{"$f":"IF(Post_Const_Geometry_Selection=\"Geometry Same as Pre-Construction\",Roughness_Pre,Roughness_Post)","v":0},{"$f":"AM23*AN23+AO23*AN23^2","v":0},{"$f":"IF(Post_Const_Geometry_Selection=\"Geometry Same as Pre-Construction\",AM23+((AN23*Side_Slope_Left_Pre)^2+AN23^2)^0.5+((AN23*Side_Slope_Right_Pre)^2+AN23^2)^0.5,AM23+((AN23*Side_Slope_Left_Post)^2+AN23^2)^0.5+((AN23*Side_Slope_Right_Post)^2+AN23^2)^0.5)","v":2},{"$f":"AR23/AS23","v":0},{"$f":"1.49/AQ23*AR23*AT23^0.667*AP23^0.5","v":{"$error":"#DIV/0!"}},{"$f":"1.49/AQ23*AT23^0.667*AP23^0.5","v":{"$error":"#DIV/0!"}},{"$f":"AU23-q50post","v":{"$error":"#DIV/0!"}},{"$error":"#DIV/0!"}]
[null,null,null,"D50 =",null,"ft.",null,null,null,"D50 =",null,"ft.",null,"D50 =",{"$f":"IF(OR(d50post=0,d50pre=0),\"\",(d50post/d50pre)-1)","v":""},null,null,null,null,null,null,null,null,null,null,null,{"$f":"Base_Width_Pre","v":0},1.7196104937144696,{"$f":"(Side_Slope_Left_Pre+Side_Slope_Right_Pre)/2","v":0},{"$f":"Slope_Pre","v":0},{"$f":"Roughness_Pre","v":0},{"$f":"AA24*AB24+AC24*AB24^2","v":0},{"$f":"AA24+((AB24*Side_Slope_Left_Pre)^2+AB24^2)^0.5+((AB24*Side_Slope_Right_Pre)^2+AB24^2)^0.5","v":3.4392209874289392},0,{"$f":"1.49/AE24*AF24*AH24^0.667*AD24^0.5","v":{"$error":"#DIV/0!"}},{"$error":"#DIV/0!"},{"$f":"AI24-q50pre","v":{"$error":"#DIV/0!"}},{"$error":"#DIV/0!"},{"$f":"IF(Post_Const_Geometry_Selection=\"Geometry Same as Pre-Construction\",Base_Width_Pre,Base_Width_Post)","v":0},1,{"$f":"IF(Post_Const_Geometry_Selection=\"Geometry Same as Pre-Construction\",(Side_Slope_Left_Pre+Side_Slope_Right_Pre)/2,(Side_Slope_Left_Post+Side_Slope_Right_Post)/2)","v":0},{"$f":"IF(Post_Const_Geometry_Selection=\"Geometry Same as Pre-Construction\",Slope_Pre,Slope_Post)","v":0},{"$f":"IF(Post_Const_Geometry_Selection=\"Geometry Same as Pre-Construction\",Roughness_Pre,Roughness_Post)","v":0},0,{"$f":"IF(Post_Const_Geometry_Selection=\"Geometry Same as Pre-Construction\",AM24+((AN24*Side_Slope_Left_Pre)^2+AN24^2)^0.5+((AN24*Side_Slope_Right_Pre)^2+AN24^2)^0.5,AM24+((AN24*Side_Slope_Left_Post)^2+AN24^2)^0.5+((AN24*Side_Slope_Right_Post)^2+AN24^2)^0.5)","v":2},0,{"$error":"#DIV/0!"},{"$error":"#DIV/0!"},{"$f":"AU24-q50post","v":{"$error":"#DIV/0!"}},{"$error":"#DIV/0!"}]
[null,null,null,"Q100 =",null,"cfs",null,null,null,"Q100 =",null,"cfs",null,"Q100 =",{"$f":"IF(OR(q100post=\"\",q100pre=\"\"),\"\",(q100post/q100pre)-1)","v":""}]
[null,null,null,"V100 =",null,"ft./s",null,null,null,"V100 =",null,"ft./s",null,"V100 =",{"$f":"IF(OR(v100post=0,v100pre=0),\"\",(v100post/v100pre)-1)","v":""},null,null,null,null,null,null,null,null,null,null,null,{"$f":"Base_Width_Pre","v":0},1.7196104937144696,{"$f":"(Side_Slope_Left_Pre+Side_Slope_Right_Pre)/2","v":0},{"$f":"Slope_Pre","v":0},{"$f":"Roughness_Pre","v":0},{"$f":"AA26*AB26+AC26*AB26^2","v":0},{"$f":"AA26+((AB26*Side_Slope_Left_Pre)^2+AB26^2)^0.5+((AB26*Side_Slope_Right_Pre)^2+AB26^2)^0.5","v":3.4392209874289392},{"$f":"AF26/AG26","v":0},{"$f":"1.49/AE26*AF26*AH26^0.667*AD26^0.5","v":{"$error":"#DIV/0!"}},{"$f":"1.49/AE26*AH26^0.667*AD26^0.5","v":{"$error":"#DIV/0!"}},{"$f":"AI26-q100pre","v":{"$error":"#DIV/0!"}},{"$f":"ROUND(AK26,1)","v":{"$error":"#DIV/0!"}},{"$f":"IF(Post_Const_Geometry_Selection=\"Geometry Same as Pre-Construction\",Base_Width_Pre,Base_Width_Post)","v":0},1,{"$f":"IF(Post_Const_Geometry_Selection=\"Geometry Same as Pre-Construction\",(Side_Slope_Left_Pre+Side_Slope_Right_Pre)/2,(Side_Slope_Left_Post+Side_Slope_Right_Post)/2)","v":0},{"$f":"IF(Post_Const_Geometry_Selection=\"Geometry Same as Pre-Construction\",Slope_Pre,Slope_Post)","v":0},{"$f":"IF(Post_Const_Geometry_Selection=\"Geometry Same as Pre-Construction\",Roughness_Pre,Roughness_Post)","v":0},{"$f":"AM26*AN26+AO26*AN26^2","v":0},{"$f":"IF(Post_Const_Geometry_Selection=\"Geometry Same as Pre-Construction\",AM26+((AN26*Side_Slope_Left_Pre)^2+AN26^2)^0.5+((AN26*Side_Slope_Right_Pre)^2+AN26^2)^0.5,AM26+((AN26*Side_Slope_Left_Post)^2+AN26^2)^0.5+((AN26*Side_Slope_Right_Post)^2+AN26^2)^0.5)","v":2},{"$f":"AR26/AS26","v":0},{"$f":"1.49/AQ26*AR26*AT26^0.667*AP26^0.5","v":{"$error":"#DIV/0!"}},{"$f":"1.49/AQ26*AT26^0.667*AP26^0.5","v":{"$error":"#DIV/0!"}},{"$f":"AU26-q100post","v":{"$error":"#DIV/0!"}},{"$f":"ROUND(AW26,1)","v":{"$error":"#DIV/0!"}}]
[null,null,null,"D100 =",null,"ft.",null,null,null,"D100 =",null,"ft.",null,"D100 =",{"$f":"IF(OR(d100post=0,d100pre=0),\"\",(d100post/d100pre)-1)","v":""},null,null,null,null,null,null,null,null,null,null,null,{"$f":"Base_Width_Pre","v":0},1.7196104937144696,{"$f":"(Side_Slope_Left_Pre+Side_Slope_Right_Pre)/2","v":0},{"$f":"Slope_Pre","v":0},{"$f":"Roughness_Pre","v":0},{"$f":"AA27*AB27+AC27*AB27^2","v":0},{"$f":"AA27+((AB27*Side_Slope_Left_Pre)^2+AB27^2)^0.5+((AB27*Side_Slope_Right_Pre)^2+AB27^2)^0.5","v":3.4392209874289392},0,{"$f":"1.49/AE27*AF27*AH27^0.667*AD27^0.5","v":{"$error":"#DIV/0!"}},{"$error":"#DIV/0!"},{"$f":"AI27-q100pre","v":{"$error":"#DIV/0!"}},{"$f":"ROUND(AK27,1)","v":{"$error":"#DIV/0!"}},{"$f":"IF(Post_Const_Geometry_Selection=\"Geometry Same as Pre-Construction\",Base_Width_Pre,Base_Width_Post)","v":0},1,{"$f":"IF(Post_Const_Geometry_Selection=\"Geometry Same as Pre-Construction\",(Side_Slope_Left_Pre+Side_Slope_Right_Pre)/2,(Side_Slope_Left_Post+Side_Slope_Right_Post)/2)","v":0},{"$f":"IF(Post_Const_Geometry_Selection=\"Geometry Same as Pre-Construction\",Slope_Pre,Slope_Post)","v":0},{"$f":"IF(Post_Const_Geometry_Selection=\"Geometry Same as Pre-Construction\",Roughness_Pre,Roughness_Post)","v":0},0,{"$f":"IF(Post_Const_Geometry_Selection=\"Geometry Same as Pre-Construction\",AM27+((AN27*Side_Slope_Left_Pre)^2+AN27^2)^0.5+((AN27*Side_Slope_Right_Pre)^2+AN27^2)^0.5,AM27+((AN27*Side_Slope_Left_Post)^2+AN27^2)^0.5+((AN27*Side_Slope_Right_Post)^2+AN27^2)^0.5)","v":2},0,{"$f":"1.49/AQ27*AR27*AT27^0.667*AP27^0.5","v":{"$error":"#DIV/0!"}},{"$f":"1.49/AQ27*AT27^0.667*AP27^0.5","v":{"$error":"#DIV/0!"}},{"$f":"AU27-q100post","v":{"$error":"#DIV/0!"}},{"$error":"#DIV/0!"}]
[null,null,null,null,null,null,null,null,null,null,null,null,null,"DAtotal=",{"$f":"IF(OR(da_total_post=0,da_total_post=\"\",da_total_pre=0),\"\",(da_total_post/da_total_pre)-1)","v":""}]
["Railroad / 100-YR Design? ",null,null,"Existing Erosion / Potential Future Erosion?",null,null,null,"Post Const. D/S Channel liner type",null,null,null,null,null,"DA imp R/W = ",{"$f":"IF(OR(da_pre_imp=\"\",da_post_imp=\"\"),\"\",da_post_imp-da_pre_imp)","v":""}]
[null,null,null,null,null,null,null,null,null,null,{"$f":"IF(J30=\"\",\"\",IF(d10post=\"\",\"Calc D10\",IF(AND(Post_Const_Geometry_Selection=\"Geometry Same as Pre-Construction\",Slope_Pre=\"\"),\"Enter Slope\",IF(AND(Slope_Post=\"\",Post_Const_Geometry_Selection<>\"Geometry Same as Pre-Construction\"),\"Enter Slope\",IF(Post_Const_Geometry_Selection=\"Geometry Same as Pre-Construction\",Slope_Pre*d10post*62.4,Slope_Post*d10post*62.4)))))","v":""},null,null,"% imp Area = ",{"$f":"IF(OR(percent_imp_pre_total=\"\",percent_imp_post_total=\"\"),\"\",percent_imp_post_total-percent_imp_pre_total)","v":""},null,null,null,null,null,null,null,null,null,null,null,null,null,null,null,null,null,{"$f":"_xlfn.TEXTJOIN(\"\",TRUE,\"OA-\",B1,\"-\",UID_hidden)","v":"OA-0-"}]
[]
[]
[]
["LINER TYPE","Select Liner Type Above To Generate List",null,null,null,null,null,"PRE-CONSTRUCTION OUTLET GEOMETRY"]
[]
["V10 Permissible",{"$f":"IF(I30=\"N/A\",\"N/A\",IF(Soil_Type=\"Permanent Matting Product (stable)\",\"User to Define\",IF(J30<>\"\",\"N/A\",IF(I30=\"Soil\",AD41,IF(I30=\"Non-Soil\",AD43,\"\")))))","v":""},null,{"$f":"IF(Soil_Type='PICK LISTS'!E14,\"N/A\",IF(A34=\"LINER TYPE\",AF62,AD60))","v":""},null,null,null,"POST-CONSTRUCTION OUTLET GEOMETRY"]
["τ10 Permissible",{"$f":"IF(A34=\"SOIL TYPE\",\"N/A\",IF(Soil_Type=\"Grass / Dense Veg. (no bare soil spots)\",\"N/A\",IF(J30<>\"\",AD43,\"\")))","v":""},null,null,null,null,null,null,null,null,null,null,null,null,null,null,null,null,null,null,null,null,null,null,null,null,null,"Hydrology Method:",null,"USGS-5158 Method"]
[]
["PRE-CONSTRUCTION OUTLET GEOMETRY",null,null,null,null,null,null,null,"POST-CONSTRUCTION OUTLET GEOMETRY"]
[null,null,null,null,null,null,null,null,null,null,null,null,null,null,null,null,null,null,null,null,null,null,null,null,null,null,null,null,null,null,null,"allowable shear stress",null,{"$f":"AD43","v":""}]
[null,null,null,null,null,null,null,null,null,null,null,null,null,null,null,null,null,null,null,null,null,null,null,null,null,null,null,"v_permissible soil",null,{"$f":"IF(Soil_Type='PICK LISTS'!E2,'PICK LISTS'!F2,IF(Soil_Type='PICK LISTS'!E3,'PICK LISTS'!F3,IF(Soil_Type='PICK LISTS'!E4,'PICK LISTS'!F4, IF(Soil_Type='PICK LISTS'!E5,'PICK LISTS'!F5, IF(Soil_Type='PICK LISTS'!E6,'PICK LISTS'!F6,IF(Soil_Type='PICK LISTS'!E7,'PICK LISTS'!F7,IF(Soil_Type='PICK LISTS'!E8,'PICK LISTS'!F8,IF(Soil_Type='PICK LISTS'!E9,'PICK LISTS'!F9,IF(Soil_Type='PICK LISTS'!E10,'PICK LISTS'!F10,IF(Soil_Type='PICK LISTS'!E11,'PICK LISTS'!F11,IF(Soil_Type='PICK LISTS'!E12,'PICK LISTS'!F12,IF(Soil_Type='PICK LISTS'!E13,'PICK LISTS'!F13,IF(Soil_Type=\"N/A (Pipe System or Non-Channel)\",\"N/A\",\"\")))))))))))))","v":""},null,"riprap permissible velocity",null,null,{"$f":"IF(v10post=\"\",\"\",(1.49/(Roughness_Pre*SQRT(62.4*d10pre)))*(AH18^(0.1666666))*(AH40^0.5))","v":""},null,null,null,"PRE"]
[null,null,null,null,null,null,null,null,null,null,null,null,null,null,null,null,null,null,null,null,null,null,null,null,null,null,null,null,null,null,null,null,null,null,null,null,null,null,null,"Intensity Calcs"]
[null,null,null,null,null,null,null,null,null,null,null,null,null,null,null,null,null,null,null,null,null,null,null,null,null,null,null,"shear/v_perm non-soil",null,{"$f":"IF(Soil_Type='PICK LISTS'!H18,'PICK LISTS'!I18,IF(Soil_Type='PICK LISTS'!H19,'PICK LISTS'!I19,IF(Soil_Type='PICK LISTS'!H20,'PICK LISTS'!I20,IF(Soil_Type='PICK LISTS'!H21,'PICK LISTS'!I21,IF(Soil_Type='PICK LISTS'!H22,'PICK LISTS'!I22,IF(Soil_Type='PICK LISTS'!H23,'PICK LISTS'!I23,\"\"))))))","v":""},null,"Is it riprap lined?",null,{"$f":"IF(OR(Soil_Type=\"CL-A Riprap (d50 = 4 in.)\",Soil_Type=\"CL-B Riprap (d50 = 8 in.)\",Soil_Type=\"CL-I Riprap (d50 = 10 in.)\",Soil_Type=\"CL-II Riprap (d50 = 12 in.)\"),\"YES\",\"NO\")","v":"NO"}]
[null,null,null,null,null,null,null,null,null,null,null,null,null,null,null,null,null,null,null,null,null,null,null,null,null,null,null,null,null,null,null,null,null,null,null,null,null,null,null,null,2,5,10,25,50,100]
[null,null,null,null,null,null,null,null,null,null,null,null,null,null,null,null,null,null,null,null,null,null,null,null,null,null,null,"Increase or Decrease in Velocity",null,null,null,null,null,null,null,null,null,null,null,{"$f":"IF(custom_IDF=\"YES\",INDIRECT(\"Z_CUSTOM_IDF\"),IF(county_for_this_outlet=\"New Hanover\", INDIRECT(\"NewHanover\"),INDIRECT(county_for_this_outlet)))","v":{"$error":"#REF!"}}]
[null,null,null,null,null,null,null,null,null,null,null,null,null,null,null,null,null,null,null,null,null,null,null,null,null,null,null,{"$f":"IF(OR(v10pre=\"\",v10post=\"\",Soil_Type=\"\",Soil_Type=\"Select Liner Type Above To Generate List\"),\"\",IF(v10post>v10pre,\"Increase\",IF(v10post<=v10pre,\"Decrease\",\"\")))","v":""}]
[]
[null,null,null,null,null,null,null,null,null,null,null,null,null,null,null,null,null,null,null,null,null,null,null,null,null,null,null,"Vpost > Vsoil_permissible?"]
[]
[]
[{"$f":"_xlfn.CONCAT(\"SUMMARY - \",_xlnm.sheet_title)","v":"SUMMARY - PSH # OUTLET #"},null,null,null,null,null,null,null,null,null,null,null,null,null,null,null,null,null,null,null,null,null,null,null,null,null,null,{"$f":"IF(I30=\"Soil\",IF(v10post>AD41,\"YES\",\"NO\"),IF(AH43=\"YES\",IF(K30>AD43,\"YES\",\"NO\"),IF(v10post>AD43,\"YES\",\"NO\")))","v":"NO"}]
["Please provide a summary of the outlet analysis here. Directions/guidance are provided by clicking on the \"i\" button above."]
[null,null,null,null,null,null,null,null,null,null,null,null,null,null,null,null,null,null,null,null,null,null,null,null,null,null,null,"Vpost increase > 10%?",null,null,null,null,null,null,null,null,null,null,null,"5-10",{"$f":"_xlfn.FORECAST.LINEAR(Tc_R_Pre,AO45:AO46,$AN45:$AN46)","v":{"$error":"#NAME?"}},{"$f":"_xlfn.FORECAST.LINEAR(Tc_R_Pre,AP45:AP46,$AN45:$AN46)","v":{"$error":"#NAME?"}},{"$error":"#NAME?"},{"$error":"#NAME?"},{"$error":"#NAME?"},{"$error":"#NAME?"}]
[null,null,null,null,null,null,null,null,null,null,null,null,null,null,null,null,null,null,null,null,null,null,null,null,null,null,null,{"$f":"IF(O17>0.1,\"YES\",\"NO\")","v":"YES"},null,null,null,null,null,null,null,null,null,null,null,"10-15",{"$f":"_xlfn.FORECAST.LINEAR(Tc_R_Pre,AO46:AO47,$AN46:$AN47)","v":{"$error":"#NAME?"}},{"$error":"#NAME?"},{"$error":"#NAME?"},{"$error":"#NAME?"},{"$error":"#NAME?"},{"$error":"#NAME?"}]
[null,null,null,null,null,null,null,null,null,null,null,null,null,null,null,null,null,null,null,null,null,null,null,null,null,null,null,null,null,null,null,null,null,null,null,null,null,null,null,"15-30",{"$error":"#NAME?"},{"$error":"#NAME?"},{"$error":"#NAME?"},{"$error":"#NAME?"},{"$error":"#NAME?"},{"$error":"#NAME?"}]
[null,null,null,null,null,null,null,null,null,null,null,null,null,null,null,null,null,null,null,null,null,null,null,null,null,null,null,null,null,null,null,null,null,null,null,null,null,null,null,"30-60",{"$error":"#NAME?"},{"$error":"#NAME?"},{"$error":"#NAME?"},{"$error":"#NAME?"},{"$error":"#NAME?"},{"$error":"#NAME?"}]
[]
[null,null,null,null,null,null,null,null,null,null,null,null,null,null,null,null,null,null,null,null,null,null,null,null,null,null,null,null,null,null,null,null,null,null,null,null,null,null,null,null,{"$f":"IF(OR(Tc_R_Pre>60, Tc_R_Pre<5), \"Error\", IF(AND(Tc_R_Pre>=5,Tc_R_Pre<=10),AO53, IF(AND(Tc_R_Pre>10,Tc_R_Pre<=15), AO54, IF(AND(Tc_R_Pre>15, Tc_R_Pre<=30), AO55, IF(AND(Tc_R_Pre>30, Tc_R_Pre<=60), AO56, VLOOKUP(Tc_R_Pre, INDIRECT(Name_R), 2))))))","v":{"$error":"#NAME?"}},{"$f":"IF(OR(Tc_R_Pre>60, Tc_R_Pre<5), \"Error\", IF(AND(Tc_R_Pre>=5,Tc_R_Pre<=10),AP53, IF(AND(Tc_R_Pre>10,Tc_R_Pre<=15), AP54, IF(AND(Tc_R_Pre>15, Tc_R_Pre<=30), AP55, IF(AND(Tc_R_Pre>30, Tc_R_Pre<=60), AP56, VLOOKUP(Tc_R_Pre, INDIRECT(Name_R), 2))))))","v":{"$error":"#NAME?"}},{"$error":"#NAME?"},{"$error":"#NAME?"},{"$error":"#NAME?"},{"$error":"#NAME?"}]
[null,null,null,null,null,null,null,null,null,null,null,null,null,null,null,null,null,null,"NUMBER OF OUTLET PHOTO PAGES",null,1,null,null,null,null,null,null,null,"Applies?","Which case is it?",null,"non-soil"]
[null,null,null,null,null,null,null,null,null,null,null,null,null,null,null,null,null,null,null,null,null,null,null,null,null,null,null,"Case 1",{"$f":"IF(AND(OR(F30=\"None\",F30=\"Potential\"),AB46=\"Decrease\",AB51=\"NO\"),\"YES\",\"\")","v":""},{"$f":"IF(AC60<>\"\",AB60,IF(AC61<>\"\",AB61,IF(AC62<>\"\",AB62,IF(AC63<>\"\",AB63,IF(AC64<>\"\",AB64,IF(AC65<>\"\",AB65,IF(AC66<>\"\",AB66,IF(AC67<>\"\",AB67,IF(AC68<>\"\",AB68,IF(AC69<>\"\",AB69,\"\"))))))))))","v":""}]
[null,null,null,null,null,null,null,null,null,null,null,null,null,null,null,null,null,null,null,null,null,null,null,null,null,null,null,"Case 1A",{"$f":"IF(AND(OR(F30=\"Existing\",F30=\"Both\"),AB46=\"Decrease\",AB51=\"NO\"),\"YES\",\"\")","v":""}]
[null,null,null,null,null,null,null,null,null,null,null,null,null,null,null,null,null,null,null,null,null,null,null,null,null,null,null,"Case 2",{"$f":"IF(AND(OR(F30=\"None\",F30=\"Potential\"),AB46=\"Decrease\",AB51=\"YES\"),\"YES\",\"\")","v":""},null,null,{"$f":"IF(AD60=\"\",\"\",\"Non-Soil, see Note 1 & 2 of Case Table\")","v":""}]
[null,null,null,null,null,null,null,null,null,null,null,null,null,null,null,null,null,null,null,null,null,null,null,null,null,null,null,"Case 2A",{"$f":"IF(AND(OR(F30=\"Existing\",F30=\"Both\"),AB46=\"Decrease\",AB51=\"YES\"),\"YES\",\"\")","v":""},null,null,null,null,null,null,null,null,null,null,"pre-const geometry type"]
[null,null,null,null,null,null,null,null,null,null,null,null,null,null,null,null,null,null,null,null,null,null,null,null,null,null,null,"Case 3",{"$f":"IF(AND(OR(F30=\"None\",F30=\"Potential\"),AB46=\"Increase\",AB51=\"NO\"),\"YES\",\"\")","v":""}]
[null,null,null,null,null,null,null,null,null,null,null,null,null,null,null,null,null,null,null,null,null,null,null,null,null,null,null,"Case 3A",{"$f":"IF(AND(OR(F30=\"Existing\",F30=\"Both\"),AB46=\"Increase\",AB51=\"NO\"),\"YES\",\"\")","v":""},null,null,null,null,null,null,null,null,null,null,"post-const geometry type",null,null,null,"railroad design?"]
[null,null,null,null,null,null,null,null,null,null,null,null,null,null,null,null,null,null,null,null,null,null,null,null,null,null,null,"Case 4",{"$f":"IF(AND(OR(F30=\"None\",F30=\"Potential\"),AB46=\"Increase\",AB51=\"YES\",O17<=0.1),\"YES\",\"\")","v":""}]
[null,null,null,null,null,null,null,null,null,null,null,null,null,null,null,null,null,null,null,null,null,null,null,null,null,null,null,"Case 4A",{"$f":"IF(AND(OR(F30=\"Existing\",F30=\"Both\"),AB46=\"Increase\",AB51=\"YES\",O17<=0.1),\"YES\",\"\")","v":""}]
[null,null,null,null,null,null,null,null,null,null,null,null,null,null,null,null,null,null,null,null,null,null,null,null,null,null,null,"Case 5",{"$f":"IF(AND(OR(F30=\"None\",F30=\"Potential\"),AB46=\"Increase\",AB51=\"YES\",O17>0.1),\"YES\",\"\")","v":""}]
[null,null,null,null,null,null,null,null,null,null,null,null,null,null,null,null,null,null,null,null,null,null,null,null,null,null,null,"Case 5A",{"$f":"IF(AND(OR(F30=\"Existing\",F30=\"Both\"),AB46=\"Increase\",AB51=\"YES\",O17>0.1),\"YES\",\"\")","v":""},null,null,null,null,null,null,null,null,null,"POST"]
[null,null,null,null,null,null,null,null,null,null,null,null,null,null,null,null,null,null,null,null,null,null,null,null,null,null,null,null,null,null,null,null,null,null,null,null,null,null,null,"Intensity Calcs"]
[]
["OUTLET SITE PHOTOS PAGE 1",null,null,null,null,null,null,null,null,null,null,null,null,null,null,null,null,null,null,null,null,null,null,null,null,null,null,null,null,null,null,null,null,null,null,null,null,null,null,null,2,5,10,25,50,100]
[null,null,null,null,null,null,null,null,null,null,null,null,null,null,null,null,null,null,null,null,null,null,null,null,null,null,null,null,null,null,null,null,null,null,null,null,null,null,null,{"$f":"IF(custom_IDF=\"YES\",INDIRECT(\"Z_CUSTOM_IDF\"),IF(county_for_this_outlet=\"New Hanover\", INDIRECT(\"NewHanover\"),INDIRECT(county_for_this_outlet)))","v":{"$error":"#REF!"}}]
["Photo Description Here",null,null,null,null,null,null,null,"Photo Description Here"]
[]
[]
[]
[]
[]
[]
[null,null,null,null,null,null,null,null,null,null,null,null,null,null,null,null,null,null,null,null,null,null,null,null,null,null,null,null,null,null,null,null,null,null,null,null,null,null,null,"5-10",{"$f":"_xlfn.FORECAST.LINEAR(Tc_R_Post,AO73:AO74,$AN73:$AN74)","v":{"$error":"#NAME?"}},{"$error":"#NAME?"},{"$error":"#NAME?"},{"$error":"#NAME?"},{"$error":"#NAME?"},{"$error":"#NAME?"}]
[null,null,null,null,null,null,null,null,null,null,null,null,null,null,null,null,null,null,null,null,null,null,null,null,null,null,null,null,null,null,null,null,null,null,null,null,null,null,null,"10-15",{"$error":"#NAME?"},{"$error":"#NAME?"},{"$error":"#NAME?"},{"$error":"#NAME?"},{"$error":"#NAME?"},{"$error":"#NAME?"}]
[null,null,null,null,null,null,null,null,null,null,null,null,null,null,null,null,null,null,null,null,null,null,null,null,null,null,null,null,null,null,null,null,null,null,null,null,null,null,null,"15-30",{"$error":"#NAME?"},{"$error":"#NAME?"},{"$error":"#NAME?"},{"$error":"#NAME?"},{"$error":"#NAME?"},{"$error":"#NAME?"}]
[null,null,null,null,null,null,null,null,null,null,null,null,null,null,null,null,null,null,null,null,null,null,null,null,null,null,null,null,null,null,null,null,null,null,null,null,null,null,null,"30-60",{"$error":"#NAME?"},{"$error":"#NAME?"},{"$error":"#NAME?"},{"$error":"#NAME?"},{"$error":"#NAME?"},{"$error":"#NAME?"}]
[]
[null,null,null,null,null,null,null,null,null,null,null,null,null,null,null,null,null,null,null,null,null,null,null,null,null,null,null,null,null,null,null,null,null,null,null,null,null,null,null,null,{"$f":"IF(OR(Tc_R_Post>60, Tc_R_Post<5), \"Error\", IF(AND(Tc_R_Post>=5,Tc_R_Post<=10),AO81, IF(AND(Tc_R_Post>10, Tc_R_Post<=15), AO82, IF(AND(Tc_R_Post>15, Tc_R_Post<=30), AO83, IF(AND(Tc_R_Post>30, Tc_R_Post<=60), AO84, VLOOKUP(Tc_R_Post, INDIRECT(Name_R), 2))))))","v":{"$error":"#NAME?"}},{"$error":"#NAME?"},{"$error":"#NAME?"},{"$error":"#NAME?"},{"$error":"#NAME?"},{"$error":"#NAME?"}]
[]
[]
[null,null,null,null,null,null,null,null,null,null,null,null,null,null,null,null,null,null,null,null,null,null,null,null,null,null,null,null,null,null,null,null,null,null,null,null,null,null,null,null,null,null,null,null,null,null,null,null,null,null,null,null,null,null,"template for 1 page of photos just copies the formatting from this cell below"]
[null,null,null,null,null,null,null,null,null,null,null,null,null,null,null,null,null,null,null,null,null,null,null,null,null,null,null,null,null,null,null,null,null,null,null,null,null,null,null,null,null,null,null,null,null,null,null,null,null,null,null,null,null,"---->"]
[]
[]
[]
[]
[]
[null,null,null,null,null,null,null,null,null,null,null,null,null,null,null,null,null,null,null,null,null,null,null,null,null,null,null,null,null,null,null,null,null,null,null,null,null,null,null,null,null,null,null,null,null,null,null,null,null,null,null,null,null,null,"TEMPLATE FOR 2 PHOTO PAGES",null,null,null,null,null,null,null,null,null,null,null,null,null,null,null,null,null,"TEMPLATE FOR 3 PHOTO PAGES",null,null,null,null,null,null,null,null,null,null,null,null,null,null,null,null,null,"TEMPLATE FOR 4 PHOTO PAGES",null,null,null,null,null,null,null,null,null,null,null,null,null,null,null,null,null,"TEMPLATE FOR 5 PHOTO PAGES"]
[{"$f":"_xlfn.CONCAT( _xlnm.sheet_title,\" SITE PHOTOS - PAGE 2\")","v":"PSH # OUTLET # SITE PHOTOS - PAGE 2"},null,null,null,null,null,null,null,null,null,null,null,null,null,null,null,null,null,null,null,null,null,null,null,null,null,null,null,null,null,null,null,null,null,null,null,null,null,null,null,null,null,null,null,null,null,null,null,null,null,null,null,null,null,"OUTLET SITE PHOTOS PAGE 2",null,null,null,null,null,null,null,null,null,null,null,null,null,null,null,null,null,"OUTLET SITE PHOTOS PAGE 2",null,null,null,null,null,null,null,null,null,null,null,null,null,null,null,null,null,"OUTLET SITE PHOTOS PAGE 2",null,null,null,null,null,null,null,null,null,null,null,null,null,null,null,null,null,"OUTLET SITE PHOTOS PAGE 2"]
["Photo Description Here",null,null,null,null,null,null,null,"Photo Description Here",null,null,null,null,null,null,null,null,null,null,null,null,null,null,null,null,null,null,null,null,null,null,null,null,null,null,null,null,null,null,null,null,null,null,null,null,null,null,null,null,null,null,null,null,null,"Photo Description Here",null,null,null,null,null,null,null,"Photo Description Here",null,null,null,null,null,null,null,null,null,"Photo Description Here",null,null,null,null,null,null,null,"Photo Description Here",null,null,null,null,null,null,null,null,null,"Photo Description Here",null,null,null,null,null,null,null,"Photo Description Here",null,null,null,null,null,null,null,null,null,"Photo Description Here",null,null,null,null,null,null,null,"Photo Description Here"]
[]
[]
[]
[null,null,null,null,null,null,null,null,null,null,null,null,null,null,null,null,null,null,null,null,null,null,null,null,null,null,null,null,null,null,null,null,null,null,null,null,null,null,null,{"$f":"INDIRECT(New_Hanover)","v":{"$error":"#NAME?"}}]
[]
[]
[null,null,null,null,null,null,null,null,null,null,null,null,null,null,null,null,null,null,null,null,null,null,null,null,null,null,null,null,null,null,null,null,null,null,"hidden da and c pre field values for this sheet"]
[null,null,null,null,null,null,null,null,null,null,null,null,null,null,null,null,null,null,null,null,null,null,null,null,null,null,null,null,null,null,null,null,null,null,null,null,"check for non std c-values",null,"hidden da and c post field values for this sheet",null,"check for non std c-values"]
[null,null,null,null,null,null,null,null,null,null,null,null,null,null,null,null,null,null,null,null,null,null,null,null,null,null,null,null,null,null,null,null,null,null,0,"0.9",null,null,0,"0.9"]
[null,null,null,null,null,null,null,null,null,null,null,null,null,null,null,null,null,null,null,null,null,null,null,null,null,null,null,null,null,null,null,null,null,null,0,0.9,null,null,0,0.9]
[null,null,null,null,null,null,null,null,null,null,null,null,null,null,null,null,null,null,null,null,null,null,null,null,null,null,null,null,null,null,null,null,null,null,0,"0.3",null,null,0,"0.3"]
[null,null,null,null,null,null,null,null,null,null,null,null,null,null,null,null,null,null,null,null,null,null,null,null,null,null,null,null,null,null,null,null,null,null,0,0.2,null,null,"0","0.2"]
[null,null,null,null,null,null,null,null,null,null,null,null,null,null,null,null,null,null,null,null,null,null,null,null,null,null,null,null,null,null,null,null,null,null,"0","0",{"$f":"IF(VALUE(da_other2_pre_field)=0,\"no non std area\",IF(AND(VALUE(c_other2_pre_field)>0.3,VALUE(c_other2_pre_field)<0.9),\"non std c values\",\"\"))","v":"no non std area"},null,"0","0",{"$f":"IF(VALUE(da_other2_post_field)=0,\"no non std area\",IF(AND(VALUE(c_other2_post_field)>0.3,VALUE(c_other2_post_field)<0.9),\"non std c values\",\"\"))","v":"no non std area"}]
[null,null,null,null,null,null,null,null,null,null,null,null,null,null,null,null,null,null,null,null,null,null,null,null,null,null,null,null,null,null,null,null,null,null,"0","0",{"$f":"IF(VALUE(da_other3_pre_field)=0,\"no non std area\",IF(AND(VALUE(c_other3_pre_field)>0.3,VALUE(c_other3_pre_field)<0.9),\"non std c values\",\"\"))","v":"no non std area"},null,"0","0",{"$f":"IF(VALUE(da_other3_post_field)=0,\"no non std area\",IF(AND(VALUE(c_other3_post_field)>0.3,VALUE(c_other3_post_field)<0.9),\"non std c values\",\"\"))","v":"no non std area"}]
[null,null,null,null,null,null,null,null,null,null,null,null,null,null,null,null,null,null,null,null,null,null,null,null,null,null,null,null,null,null,null,null,null,null,"0","0",{"$f":"IF(VALUE(da_other4_pre_field)=0,\"no non std area\",IF(AND(VALUE(c_other4_pre_field)>0.3,VALUE(c_other4_pre_field)<0.9),\"non std c values\",\"\"))","v":"no non std area"},null,"0","0",{"$f":"IF(VALUE(da_other4_post_field)=0,\"no non std area\",IF(AND(VALUE(c_other4_post_field)>0.3,VALUE(c_other4_post_field)<0.9),\"non std c values\",\"\"))","v":"no non std area"}]
["Photo Description Here",null,null,null,null,null,null,null,"Photo Description Here",null,null,null,null,null,null,null,null,null,null,null,null,null,null,null,null,null,null,null,null,null,null,null,null,null,null,null,null,null,null,null,null,null,null,null,null,null,null,null,null,null,null,null,null,null,"Photo Description Here",null,null,null,null,null,null,null,"Photo Description Here",null,null,null,null,null,null,null,null,null,"Photo Description Here",null,null,null,null,null,null,null,"Photo Description Here",null,null,null,null,null,null,null,null,null,"Photo Description Here",null,null,null,null,null,null,null,"Photo Description Here",null,null,null,null,null,null,null,null,null,"Photo Description Here",null,null,null,null,null,null,null,"Photo Description Here"]
[null,null,null,null,null,null,null,null,null,null,null,null,null,null,null,null,null,null,null,null,null,null,null,null,null,null,null,null,null,null,null,null,null,null,null,null,{"$f":"IF(OR(AK111=\"non std c values\",AK112=\"non std c values\",AK113=\"non std c values\"),\"non std c values exist\", \"\")","v":""},null,null,null,{"$f":"IF(OR(AO111=\"non std c values\",AO112=\"non std c values\",AO113=\"non std c values\"),\"non std c values exist\", \"\")","v":""}]
[]
[]
[]
[]
[]
[]
[]
[]
[]
[]
[]
[]
[]
[]
[]
[{"$f":"_xlfn.CONCAT( _xlnm.sheet_title,\" SITE PHOTOS - PAGE 3\")","v":"PSH # OUTLET # SITE PHOTOS - PAGE 3"},null,null,null,null,null,null,null,null,null,null,null,null,null,null,null,null,null,null,null,null,null,null,null,null,null,null,null,null,null,null,null,null,null,null,null,null,null,null,null,null,null,null,null,null,null,null,null,null,null,null,null,null,null,null,null,null,null,null,null,null,null,null,null,null,null,null,null,null,null,null,null,"OUTLET SITE PHOTOS PAGE 3",null,null,null,null,null,null,null,null,null,null,null,null,null,null,null,null,null,"OUTLET SITE PHOTOS PAGE 3",null,null,null,null,null,null,null,null,null,null,null,null,null,null,null,null,null,"OUTLET SITE PHOTOS PAGE 3"]
["Photo Description Here",null,null,null,null,null,null,null,"Photo Description Here",null,null,null,null,null,null,null,null,null,null,null,null,null,null,null,null,null,null,null,null,null,null,null,null,null,null,null,null,null,null,null,null,null,null,null,null,null,null,null,null,null,null,null,null,null,null,null,null,null,null,null,null,null,null,null,null,null,null,null,null,null,null,null,"Photo Description Here",null,null,null,null,null,null,null,"Photo Description Here",null,null,null,null,null,null,null,null,null,"Photo Description Here",null,null,null,null,null,null,null,"Photo Description Here",null,null,null,null,null,null,null,null,null,"Photo Description Here",null,null,null,null,null,null,null,"Photo Description Here"]
[]
[]
[]
[]
[]
[]
[]
[]
[]
[]
[]
[]
[]
[]
[]
["Photo Description Here",null,null,null,null,null,null,null,"Photo Description Here",null,null,null,null,null,null,null,null,null,null,null,null,null,null,null,null,null,null,null,null,null,null,null,null,null,null,null,null,null,null,null,null,null,null,null,null,null,null,null,null,null,null,null,null,null,null,null,null,null,null,null,null,null,null,null,null,null,null,null,null,null,null,null,"Photo Description Here",null,null,null,null,null,null,null,"Photo Description Here",null,null,null,null,null,null,null,null,null,"Photo Description Here",null,null,null,null,null,null,null,"Photo Description Here",null,null,null,null,null,null,null,null,null,"Photo Description Here",null,null,null,null,null,null,null,"Photo Description Here"]
[]
[]
[]
[]
[]
[]
[]
[]
[]
[]
[]
[]
[]
[]
[]
[]
[{"$f":"_xlfn.CONCAT( _xlnm.sheet_title,\" SITE PHOTOS - PAGE 4\")","v":"PSH # OUTLET # SITE PHOTOS - PAGE 4"},null,null,null,null,null,null,null,null,null,null,null,null,null,null,null,null,null,null,null,null,null,null,null,null,null,null,null,null,null,null,null,null,null,null,null,null,null,null,null,null,null,null,null,null,null,null,null,null,null,null,null,null,null,null,null,null,null,null,null,null,null,null,null,null,null,null,null,null,null,null,null,null,null,null,null,null,null,null,null,null,null,null,null,null,null,null,null,null,null,"OUTLET SITE PHOTOS PAGE 4",null,null,null,null,null,null,null,null,null,null,null,null,null,null,null,null,null,"OUTLET SITE PHOTOS PAGE 4"]
["Photo Description Here",null,null,null,null,null,null,null,"Photo Description Here",null,null,null,null,null,null,null,null,null,null,null,null,null,null,null,null,null,null,null,null,null,null,null,null,null,null,null,null,null,null,null,null,null,null,null,null,null,null,null,null,null,null,null,null,null,null,null,null,null,null,null,null,null,null,null,null,null,null,null,null,null,null,null,null,null,null,null,null,null,null,null,null,null,null,null,null,null,null,null,null,null,"Photo Description Here",null,null,null,null,null,null,null,"Photo Description Here",null,null,null,null,null,null,null,null,null,"Photo Description Here",null,null,null,null,null,null,null,"Photo Description Here"]
[]
[]
[]
[]
[]
[]
[]
[]
[]
[]
[]
[]
[]
[]
[]
["Photo Description Here",null,null,null,null,null,null,null,"Photo Description Here",null,null,null,null,null,null,null,null,null,null,null,null,null,null,null,null,null,null,null,null,null,null,null,null,null,null,null,null,null,null,null,null,null,null,null,null,null,null,null,null,null,null,null,null,null,null,null,null,null,null,null,null,null,null,null,null,null,null,null,null,null,null,null,null,null,null,null,null,null,null,null,null,null,null,null,null,null,null,null,null,null,"Photo Description Here",null,null,null,null,null,null,null,"Photo Description Here",null,null,null,null,null,null,null,null,null,"Photo Description Here",null,null,null,null,null,null,null,"Photo Description Here"]
[]
[]
[]
[]
[]
[]
[]
[]
[]
[]
[]
[]
[]
[]
[]
[]
[{"$f":"_xlfn.CONCAT( _xlnm.sheet_title,\" SITE PHOTOS - PAGE 5\")","v":"PSH # OUTLET # SITE PHOTOS - PAGE 5"},null,null,null,null,null,null,null,null,null,null,null,null,null,null,null,null,null,null,null,null,null,null,null,null,null,null,null,null,null,null,null,null,null,null,null,null,null,null,null,null,null,null,null,null,null,null,null,null,null,null,null,null,null,null,null,null,null,null,null,null,null,null,null,null,null,null,null,null,null,null,null,null,null,null,null,null,null,null,null,null,null,null,null,null,null,null,null,null,null,null,null,null,null,null,null,null,null,null,null,null,null,null,null,null,null,null,null,"OUTLET SITE PHOTOS PAGE 5"]
["Photo Description Here",null,null,null,null,null,null,null,"Photo Description Here",null,null,null,null,null,null,null,null,null,null,null,null,null,null,null,null,null,null,null,null,null,null,null,null,null,null,null,null,null,null,null,null,null,null,null,null,null,null,null,null,null,null,null,null,null,null,null,null,null,null,null,null,null,null,null,null,null,null,null,null,null,null,null,null,null,null,null,null,null,null,null,null,null,null,null,null,null,null,null,null,null,null,null,null,null,null,null,null,null,null,null,null,null,null,null,null,null,null,null,"Photo Description Here",null,null,null,null,null,null,null,"Photo Description Here"]
[]
[]
[]
[]
[]
[]
[]
[]
[]
[]
[]
[]
[]
[]
[]
["Photo Description Here",null,null,null,null,null,null,null,"Photo Description Here",null,null,null,null,null,null,null,null,null,null,null,null,null,null,null,null,null,null,null,null,null,null,null,null,null,null,null,null,null,null,null,null,null,null,null,null,null,null,null,null,null,null,null,null,null,null,null,null,null,null,null,null,null,null,null,null,null,null,null,null,null,null,null,null,null,null,null,null,null,null,null,null,null,null,null,null,null,null,null,null,null,null,null,null,null,null,null,null,null,null,null,null,null,null,null,null,null,null,null,"Photo Description Here",null,null,null,null,null,null,null,"Photo Description Here"]
[]
[]
[]
[]
[]
[]
[]
[]
[]
[]
[]
[]
[]
[]
[]
[]
[]
[]
[]
[]
[]
[]
[]
[]
[]
[]
[]
[]
[]
[null,null,null,null,null,null,null,null,null,null,null,null,null,null,null,null,null,null,null,null,null,null,null,null,null,null,null,null,null,null,null,null,null,null,"τ10 Post = "]
[]
[]
[]
["ROWS HOLDING CELL DATA BELOW TO BE HIDDEN (CELLS HOLD DATA+FORMATTING FOR MACROS AND CALCULATIONS)"]
[]
[]
["hidden formatting for triangular / trapezoidal macros DO NOT TOUCH",null,null,null,null,null,null,null,"hidden formatting for triangular / trapezoidal macros DO NOT TOUCH"]
["Depth (ft) =",null,null,null,"H:V (Lt) = ",null,null,null,"Depth (ft) =",null,"H:V (Lt) ="]
["Slope (ft/ft) = ",null,null,null,"H:V (Rt) = ",null,null,null,"Slope (ft/ft) = ",null,"H:V (Rt) ="]
["Manning's N =",null,null,null,"Base Width (ft.) =",0,null,null,"Manning's N =",null,"Base Width ="]
["Notes (lining, condition, etc.): ",null,null,null,null,null,null,null,"Notes (lining, condition, etc.): "]
[]
[]
[]
[]
[]
["hidden formatting for irregular channel macro DO NOT TOUCH",null,null,null,null,null,null,null,"hidden formatting for irregular channel macro DO NOT TOUCH"]
[]
[{"$f":"IF(AND($J$30<>\"\",Post_Const_Geometry_Selection=\"Geometry Same as Pre-Construction\"),\"Slope (ft/ft) = \",\"\")","v":""},null,null,null,null,null,null,null,{"$f":"IF($J$30<>\"\",\"Slope (ft/ft) = \",\"\")","v":""}]
["Notes:",null,null,null,null,null,null,null,"Notes:"]
[]
[]
[]
[]
[]
["hidden formatting for pipe macros DO NOT TOUCH",null,null,null,null,null,null,null,"hidden formatting for pipe macros DO NOT TOUCH",null,null,null,null,null,null,null,null,null,null,"hidden formatting for blank DO NOT TOUCH"]
["Diameter (in) =",null,null,null,"QCapacity (cfs) =",{"$f":"IF(OR(B273=\"\",B274=\"\"),\"\",IFERROR(MIN((SQRT(B274)/D275)*((B273/16)^(8/3)),VLOOKUP(B273,'PICK LISTS'!$E$44:$F$54,2,FALSE)),(SQRT(B274)/D275)*((B273/16)^(8/3))))","v":""},null,null,"Diameter (in) =",null,null,"QCapacity (cfs) = ",null,{"$f":"IF(OR(J273=\"\",J274=\"\"),\"\",IFERROR(MIN((SQRT(J274)/K275)*((J273/16)^(8/3)),VLOOKUP(J273,'PICK LISTS'!$E$44:$F$54,2,FALSE)),(SQRT(J274)/K275)*((J273/16)^(8/3))))","v":""},{"$f":"IF(OR(N273=\"\",N274=\"\"),\"\",IF(N274>N273,\"NOTE: Q10 > Qfull\",\"Q10 < Qfull\"))","v":""},null,null,null,null,"Notes:"]
["Slope (ft/ft) = ",null,null,null,"Q10pre (cfs) =",{"$f":"$E$16","v":0},null,null,"Slope (ft/ft) = ",null,null,"Q10 Post (cfs) = ",null,{"$f":"$K$16","v":0}]
["Pipe Material =","RCP",null,{"$f":"VLOOKUP(B275,'PICK LISTS'!$E$29:$F$33, 2, FALSE)","v":1.2E-2},null,null,null,null,"Pipe Material =","RCP",{"$f":"VLOOKUP(J275,'PICK LISTS'!$E$29:$F$33, 2, FALSE)","v":1.2E-2}]
["Notes:",null,null,null,null,null,null,null,"Notes:"]
[]
[]
[]
[]
[null,null,null,null,null,null,null,null,"hidden formatting for same as pre const. ds rec pipe macro DO NOT TOUCH"]
[]
[null,null,null,null,null,null,null,null,null,null,"Qfull (cfs) = ",{"$f":"F282","v":0},null,{"$f":"IF(OR(L283=\"\",L284=\"\"),\"\",IF(L284>L283,\"NOTE: Q10 > Qfull\",\"Q10 < Qfull\"))","v":""}]
[null,null,null,null,null,null,null,null,null,null,"Q10 Post (cfs) = ",{"$f":"IF($K$16=0,\"\",$K$16)","v":""}]
[]
[]
[]
[]
[]
[]
[]
["SOIL TYPE"]
[]
["LINER TYPE"]
[]
[]
[]
[null,{"$f":"IF($I$30=\"N/A\",\"N/A\",IF(Soil_Type=\"Permanent Matting Product (stable)\",\"User to Define\",IF($J$30<>\"\",\"N/A\",IF($I$30=\"Soil\",$AD$41,IF($I$30=\"Non-Soil\",$AD$43,\"\")))))","v":""}]
[null,{"$f":"IF($A$34=\"SOIL TYPE\",\"N/A\",IF(Soil_Type=\"Grass / Dense Veg. (no bare soil spots)\",\"N/A\",IF($J$30<>\"\",$AD$43,\"\")))","v":""}]

{"sheet":"USER INPUT TAB TEMPLATE","index":7,"n_rows":299,"n_cols":117,"rows_kept":299,"cut":false,"hidden":true,"merged":[[291,1,291,4],[293,1,293,4],[35,3,36,5],[58,29,58,30],[58,31,60,32],[59,29,68,30],[61,31,68,32],[164,0,164,16],[165,0,180,7],[165,8,180,16],[181,0,197,7],[181,8,197,16],[198,0,198,16],[199,0,214,7],[199,8,214,16],[215,0,231,7],[215,8,231,16],[97,0,112,7],[97,8,112,16],[113,0,129,7],[113,8,129,16],[130,0,130,16],[131,0,146,7],[131,8,146,16],[282,13,284,14],[256,0,257,5],[256,8,257,15],[272,14,274,15],[35,7,35,9],[35,10,35,15],[5,4,5,5],[265,0,267,5],[265,8,267,15],[5,1,5,3],[7,0,7,5],[7,7,7,11],[7,13,7,15],[272,19,276,24],[275,0,276,5],[275,8,276,15],[71,0,72,16],[73,0,95,7],[73,8,95,16],[40,0,41,5],[40,8,41,14],[43,0,47,5],[43,8,47,15],[50,0,50,16],[51,0,70,16],[96,0,96,16],[147,0,163,7],[147,8,163,16],[215,108,231,115],[215,116,231,124],[249,0,251,24],[253,10,253,12],[254,10,254,12],[255,10,255,12],[181,90,197,97],[181,98,197,106],[181,108,197,115],[181,116,197,124],[198,108,198,124],[199,108,214,115],[199,116,214,124],[164,90,164,106],[164,108,164,124],[165,90,180,97],[165,98,180,106],[165,108,180,115],[165,116,180,124],[147,72,163,79],[147,80,163,88],[147,90,163,97],[147,98,163,106],[147,108,163,115],[147,116,163,124],[130,72,130,88],[130,90,130,106],[130,108,130,124],[131,72,146,79],[131,80,146,88],[131,90,146,97],[131,98,146,106],[131,108,146,115],[131,116,146,124],[97,108,112,115],[97,116,112,124],[104,34,105,34],[113,54,129,61],[113,62,129,70],[113,72,129,79],[113,80,129,88],[113,90,129,97],[113,98,129,106],[113,108,129,115],[97,54,112,61],[97,62,112,70],[97,72,112,79],[97,80,112,88],[97,90,112,97],[97,98,112,106],[113,116,129,124],[95,72,95,88],[95,90,95,106],[95,108,95,124],[96,54,96,70],[96,72,96,88],[96,90,96,106],[96,108,96,124],[58,18,59,19],[58,20,59,20],[95,54,95,70],[36,27,36,28],[38,0,38,5],[38,8,38,15],[16,0,17,0],[16,1,17,1],[16,7,17,7],[16,8,17,8],[16,18,29,23],[33,1,33,4],[33,7,33,9],[33,10,33,15],[28,0,29,0],[28,3,30,4],[29,5,29,6],[28,7,30,7],[15,18,15,23],[7,38,8,38],[7,39,8,39],[7,40,8,40],[7,41,8,41],[7,42,8,42],[7,43,8,43],[7,31,8,31],[7,32,8,32],[7,33,8,33],[7,34,8,34],[7,35,8,35],[7,36,8,36],[7,26,8,26],[7,27,8,27],[7,28,8,28],[7,29,8,29],[7,30,8,30],[2,1,4,4],[1,7,1,8],[2,5,2,9],[0,11,0,16],[7,44,8,44],[7,45,8,45],[7,46,8,46],[7,47,8,47],[7,48,8,48],[0,25,3,51],[0,52,3,75],[0,76,3,99],[0,100,3,125],[1,11,1,16],[5,26,6,36],[5,38,6,48],[2,11,2,16],[3,5,3,9],[3,11,3,16],[5,11,5,13],[5,14,5,15]]}
["TIP Project:",{"$f":"TIP_number_MAIN_tab","v":0},null,null,null,null,null,null,null,null,"Date:",{"$f":"Date_MAIN_tab","v":"00:00:00"},null,null,null,null,null,null,null,null,null,null,null,null,null,"COLUMNS HOLDING CELLS BELOW TO BE HIDDEN (CELLS HOLD BACKGROUND DATA FOR MACROS AND CALCULATIONS)",null,null,null,null,null,null,null,null,null,null,null,null,null,null,null,null,null,null,null,null,null,null,null,null,null,null,"COLUMNS HOLDING CELLS BELOW TO BE HIDDEN (CELLS HOLD BACKGROUND DATA FOR MACROS AND CALCULATIONS)",null,null,null,null,null,null,null,null,null,null,null,null,null,null,null,null,null,null,null,null,null,null,null,"COLUMNS HOLDING CELLS BELOW TO BE HIDDEN (CELLS HOLD BACKGROUND DATA FOR MACROS AND CALCULATIONS)",null,null,null,null,null,null,null,null,null,null,null,null,null,null,null,null,null,null,null,null,null,null,null,"COLUMNS HOLDING CELLS BELOW TO BE HIDDEN (CELLS HOLD BACKGROUND DATA FOR MACROS AND CALCULATIONS)"]
["County:",null,null,null,null,null,null,"PSH # OUTLET #",null,null,"  Design Firm:",{"$f":"design_firm_MAIN_tab","v":0}]
["Description:",{"$f":"IF(project_description_MAIN_tab=\"\",\"\",project_description_MAIN_tab)","v":""},null,null,null,null,null,"PSH # OUTLET #",null,null,"  Designed By:",{"$f":"designer_MAIN_tab","v":0}]
[null,null,null,null,null,"Input Alignment, Station, Offset Here",null,null,null,null,"Reviewed By:"]
[]
[{"$f":"MAIN!A37","v":"Version 1.0"},"Outlet UID Number:",null,null,{"$f":"IF(TIP_number_MAIN_tab=0,\"ENTER TIP OR PROJ #\",AG30)","v":"ENTER TIP OR PROJ #"},null,null,"Latitude:",null,null,"Longitude:",null,null,null,"Google Maps",null,null,null,null,null,null,null,null,null,null,null,"PRE CONST. MANNING'S EQUATION OPEN CHANNEL",null,null,null,null,null,null,null,null,null,null,null,"POST CONST. MANNING'S EQUATION OPEN CHANNEL"]
[]
["PRE-CONSTRUCTION (USER INPUT METHOD)",null,null,null,null,null,null,"POST-CONSTRUCTION (USER INPUT METHOD)",null,null,null,null,null,"CHANGE",null,null,null,null,null,null,null,null,null,null,null,null,"B (ft)","norm. depth (ft)","avg sideslope","S (ft/ft)","N val","A (sq.ft.)","P (ft.)","R (ft.)","Q (cfs)","Vc (ft/s)","Q Compare Check: Make sure = 0 (set to 0 by changing y in data>what if> goal seek)",null,"B (ft)","norm. depth (ft)","avg sideslope","S (ft/ft)","N val","A (sq.ft.)","P (ft.)","R (ft.)","Q (cfs)","Vc (ft/s)","Q Compare Check: Make sure = 0 (set to 0 by changing y in data>what if> goal seek)"]
[]
[null,null,null,"Q2 =",null,"cfs",null,null,null,"Q2 =",null,"cfs",null,"Q2 =",{"$f":"IF(OR(q2post=\"\",q2pre=\"\"),\"\",(q2post/q2pre)-1)","v":""}]
["DA (ac) = ",null,null,"V2 =",null,"ft./s",null,"DA (ac) = ",null,"V2 =",null,"ft./s",null,"V2 =",{"$f":"IF(OR(v2post=0,v2pre=0),\"\",(v2post/v2pre)-1)","v":""},null,null,null,"Green = Calculated / up to date (color 210,255,210)",null,null,null,null,null,null,null,{"$f":"Base_Width_Pre","v":0},1.4727991030475791,{"$f":"(Side_Slope_Left_Pre+Side_Slope_Right_Pre)/2","v":0},{"$f":"Slope_Pre","v":0},{"$f":"Roughness_Pre","v":0},{"$f":"AA11*AB11+AC11*AB11^2","v":0},{"$f":"AA11+((AB11*Side_Slope_Left_Pre)^2+AB11^2)^0.5+((AB11*Side_Slope_Right_Pre)^2+AB11^2)^0.5","v":2.9455982060951582},{"$f":"AF11/AG11","v":0},{"$f":"1.49/AE11*AF11*AH11^0.667*AD11^0.5","v":{"$error":"#DIV/0!"}},{"$f":"1.49/AE11*AH11^0.667*AD11^0.5","v":{"$error":"#DIV/0!"}},{"$f":"AI11-q2pre","v":{"$error":"#DIV/0!"}},{"$f":"ROUND(AK11,1)","v":{"$error":"#DIV/0!"}},{"$f":"IF(Post_Const_Geometry_Selection=\"Geometry Same as Pre-Construction\",Base_Width_Pre,Base_Width_Post)","v":0},1,{"$f":"IF(Post_Const_Geometry_Selection=\"Geometry Same as Pre-Construction\",(Side_Slope_Left_Pre+Side_Slope_Right_Pre)/2,(Side_Slope_Left_Post+Side_Slope_Right_Post)/2)","v":0},{"$f":"IF(Post_Const_Geometry_Selection=\"Geometry Same as Pre-Construction\",Slope_Pre,Slope_Post)","v":0},{"$f":"IF(Post_Const_Geometry_Selection=\"Geometry Same as Pre-Construction\",Roughness_Pre,Roughness_Post)","v":0},{"$f":"AM11*AN11+AO11*AN11^2","v":0},{"$f":"IF(Post_Const_Geometry_Selection=\"Geometry Same as Pre-Construction\",AM11+((AN11*Side_Slope_Left_Pre)^2+AN11^2)^0.5+((AN11*Side_Slope_Right_Pre)^2+AN11^2)^0.5,AM11+((AN11*Side_Slope_Left_Post)^2+AN11^2)^0.5+((AN11*Side_Slope_Right_Post)^2+AN11^2)^0.5)","v":2},{"$f":"AR11/AS11","v":0},{"$f":"1.49/AQ11*AR11*AT11^0.667*AP11^0.5","v":{"$error":"#DIV/0!"}},{"$f":"1.49/AQ11*AT11^0.667*AP11^0.5","v":{"$error":"#DIV/0!"}},{"$f":"AU11-q2post","v":{"$error":"#DIV/0!"}},{"$f":"ROUND(AW11,1)","v":{"$error":"#DIV/0!"}}]
[null,null,null,"D2 =",null,"ft.",null,null,null,"D2 =",null,"ft.",null,"D2 =",{"$f":"IF(OR(d2post=0,d2pre=0),\"\",(d2post/d2pre)-1)","v":""},null,null,null,"Red = Calculated, incorrect, or not up to date (color 255,165,165)",null,null,null,null,null,null,null,{"$f":"Base_Width_Pre","v":0},1.4727991030475791,{"$f":"(Side_Slope_Left_Pre+Side_Slope_Right_Pre)/2","v":0},{"$f":"Slope_Pre","v":0},{"$f":"Roughness_Pre","v":0},{"$f":"AA12*AB12+AC12*AB12^2","v":0},{"$f":"AA12+((AB12*Side_Slope_Left_Pre)^2+AB12^2)^0.5+((AB12*Side_Slope_Right_Pre)^2+AB12^2)^0.5","v":2.9455982060951582},{"$f":"AF12/AG12","v":0},{"$f":"1.49/AE12*AF12*AH12^0.667*AD12^0.5","v":{"$error":"#DIV/0!"}},{"$f":"1.49/AE12*AH12^0.667*AD12^0.5","v":{"$error":"#DIV/0!"}},{"$f":"AI12-q2pre","v":{"$error":"#DIV/0!"}},{"$f":"ROUND(AK12,1)","v":{"$error":"#DIV/0!"}},{"$f":"IF(Post_Const_Geometry_Selection=\"Geometry Same as Pre-Construction\",Base_Width_Pre,Base_Width_Post)","v":0},1,{"$f":"IF(Post_Const_Geometry_Selection=\"Geometry Same as Pre-Construction\",(Side_Slope_Left_Pre+Side_Slope_Right_Pre)/2,(Side_Slope_Left_Post+Side_Slope_Right_Post)/2)","v":0},{"$f":"IF(Post_Const_Geometry_Selection=\"Geometry Same as Pre-Construction\",Slope_Pre,Slope_Post)","v":0},{"$f":"IF(Post_Const_Geometry_Selection=\"Geometry Same as Pre-Construction\",Roughness_Pre,Roughness_Post)","v":0},{"$f":"AM12*AN12+AO12*AN12^2","v":0},{"$f":"IF(Post_Const_Geometry_Selection=\"Geometry Same as Pre-Construction\",AM12+((AN12*Side_Slope_Left_Pre)^2+AN12^2)^0.5+((AN12*Side_Slope_Right_Pre)^2+AN12^2)^0.5,AM12+((AN12*Side_Slope_Left_Post)^2+AN12^2)^0.5+((AN12*Side_Slope_Right_Post)^2+AN12^2)^0.5)","v":2},{"$f":"AR12/AS12","v":0},{"$f":"1.49/AQ12*AR12*AT12^0.667*AP12^0.5","v":{"$error":"#DIV/0!"}},{"$f":"1.49/AQ12*AT12^0.667*AP12^0.5","v":{"$error":"#DIV/0!"}},{"$f":"AU12-q2post","v":{"$error":"#DIV/0!"}},{"$f":"ROUND(AW12,1)","v":{"$error":"#DIV/0!"}}]
[null,null,null,"Q5 =",null,"cfs",null,null,null,"Q5 =",null,"cfs",null,"Q5 =",{"$f":"IF(OR(q5post=\"\",q5pre=\"\"),\"\",(q5post/q5pre)-1)","v":""},null,null,null,"light blue = user iput (cells unlocked) (color 190,240,240)"]
["DA imp in R/W = ",null,null,"V5 =",null,"ft./s",null,"DA imp in R/W = ",null,"V5 =",null,"ft./s",null,"V5 =",{"$f":"IF(OR(v5post=0,v5pre=0),\"\",(v5post/v5pre)-1)","v":""},null,null,null,"Yellow = Warning / Caution           (color 255,255,100)",null,null,null,null,null,null,null,{"$f":"Base_Width_Pre","v":0},1.5647239205356298,{"$f":"(Side_Slope_Left_Pre+Side_Slope_Right_Pre)/2","v":0},{"$f":"Slope_Pre","v":0},{"$f":"Roughness_Pre","v":0},{"$f":"AA14*AB14+AC14*AB14^2","v":0},{"$f":"AA14+((AB14*Side_Slope_Left_Pre)^2+AB14^2)^0.5+((AB14*Side_Slope_Right_Pre)^2+AB14^2)^0.5","v":3.1294478410712596},{"$f":"AF14/AG14","v":0},{"$f":"1.49/AE14*AF14*AH14^0.667*AD14^0.5","v":{"$error":"#DIV/0!"}},{"$f":"1.49/AE14*AH14^0.667*AD14^0.5","v":{"$error":"#DIV/0!"}},{"$f":"AI14-q5pre","v":{"$error":"#DIV/0!"}},{"$f":"ROUND(AK14,1)","v":{"$error":"#DIV/0!"}},{"$f":"IF(Post_Const_Geometry_Selection=\"Geometry Same as Pre-Construction\",Base_Width_Pre,Base_Width_Post)","v":0},1,{"$f":"IF(Post_Const_Geometry_Selection=\"Geometry Same as Pre-Construction\",(Side_Slope_Left_Pre+Side_Slope_Right_Pre)/2,(Side_Slope_Left_Post+Side_Slope_Right_Post)/2)","v":0},{"$f":"IF(Post_Const_Geometry_Selection=\"Geometry Same as Pre-Construction\",Slope_Pre,Slope_Post)","v":0},{"$f":"IF(Post_Const_Geometry_Selection=\"Geometry Same as Pre-Construction\",Roughness_Pre,Roughness_Post)","v":0},{"$f":"AM14*AN14+AO14*AN14^2","v":0},{"$f":"IF(Post_Const_Geometry_Selection=\"Geometry Same as Pre-Construction\",AM14+((AN14*Side_Slope_Left_Pre)^2+AN14^2)^0.5+((AN14*Side_Slope_Right_Pre)^2+AN14^2)^0.5,AM14+((AN14*Side_Slope_Left_Post)^2+AN14^2)^0.5+((AN14*Side_Slope_Right_Post)^2+AN14^2)^0.5)","v":2},{"$f":"AR14/AS14","v":0},{"$f":"1.49/AQ14*AR14*AT14^0.667*AP14^0.5","v":{"$error":"#DIV/0!"}},{"$f":"1.49/AQ14*AT14^0.667*AP14^0.5","v":{"$error":"#DIV/0!"}},{"$f":"AU14-q5post","v":{"$error":"#DIV/0!"}},{"$f":"ROUND(AW14,1)","v":{"$error":"#DIV/0!"}}]
[null,null,null,"D5 =",null,"ft.",null,null,null,"D5 =",null,"ft.",null,"D5 =",{"$f":"IF(OR(d5post=0,d5pre=0),\"\",(d5post/d5pre)-1)","v":""},null,null,null,null,null,null,null,null,null,null,null,{"$f":"Base_Width_Pre","v":0},1.5647239205356298,{"$f":"(Side_Slope_Left_Pre+Side_Slope_Right_Pre)/2","v":0},{"$f":"Slope_Pre","v":0},{"$f":"Roughness_Pre","v":0},0,{"$f":"AA15+((AB15*Side_Slope_Left_Pre)^2+AB15^2)^0.5+((AB15*Side_Slope_Right_Pre)^2+AB15^2)^0.5","v":3.1294478410712596},0,{"$error":"#DIV/0!"},{"$error":"#DIV/0!"},{"$f":"AI15-q5pre","v":{"$error":"#DIV/0!"}},{"$error":"#DIV/0!"},{"$f":"IF(Post_Const_Geometry_Selection=\"Geometry Same as Pre-Construction\",Base_Width_Pre,Base_Width_Post)","v":0},1,{"$f":"IF(Post_Const_Geometry_Selection=\"Geometry Same as Pre-Construction\",(Side_Slope_Left_Pre+Side_Slope_Right_Pre)/2,(Side_Slope_Left_Post+Side_Slope_Right_Post)/2)","v":0},{"$f":"IF(Post_Const_Geometry_Selection=\"Geometry Same as Pre-Construction\",Slope_Pre,Slope_Post)","v":0},{"$f":"IF(Post_Const_Geometry_Selection=\"Geometry Same as Pre-Construction\",Roughness_Pre,Roughness_Post)","v":0},0,{"$f":"IF(Post_Const_Geometry_Selection=\"Geometry Same as Pre-Construction\",AM15+((AN15*Side_Slope_Left_Pre)^2+AN15^2)^0.5+((AN15*Side_Slope_Right_Pre)^2+AN15^2)^0.5,AM15+((AN15*Side_Slope_Left_Post)^2+AN15^2)^0.5+((AN15*Side_Slope_Right_Post)^2+AN15^2)^0.5)","v":2},0,{"$error":"#DIV/0!"},{"$error":"#DIV/0!"},{"$f":"AU15-q5post","v":{"$error":"#DIV/0!"}},{"$error":"#DIV/0!"}]
[null,null,null,"Q10 =",null,"cfs",null,null,null,"Q10 =",null,"cfs",null,"Q10 =",{"$f":"IF(OR(q10post=\"\",q10pre=\"\"),\"\",(q10post/q10pre)-1)","v":""},null,null,null,"User Notes (will not be printed)",null,null,null,null,null,null,null,null,null,null,null,null,null,null,null,null,null,null,0]
["% Imp. Area (NCDOT Contribution)",{"$f":"IF(OR(da_pre_imp=0,da_total_pre=0),\"\",(da_pre_imp/(da_total_pre*640)))","v":""},null,"V10 =",null,"ft./s",null,"% Imp. Area (NCDOT Contribution)",{"$f":"IF(OR(da_post_imp=0,da_total_post=0),\"\",(da_post_imp/(da_total_post*640)))","v":""},"V10 =",null,"ft./s",null,"V10 =",{"$f":"IF(OR(v10post=0,v10pre=0),\"\",(v10post/v10pre)-1)","v":""},null,null,null,null,null,null,null,null,null,null,null,{"$f":"Base_Width_Pre","v":0},1.6213254592941764,{"$f":"(Side_Slope_Left_Pre+Side_Slope_Right_Pre)/2","v":0},{"$f":"Slope_Pre","v":0},{"$f":"Roughness_Pre","v":0},0,{"$f":"AA17+((AB17*Side_Slope_Left_Pre)^2+AB17^2)^0.5+((AB17*Side_Slope_Right_Pre)^2+AB17^2)^0.5","v":3.2426509185883527},0,{"$error":"#DIV/0!"},{"$error":"#DIV/0!"},{"$f":"AI17-q10pre","v":{"$error":"#DIV/0!"}},{"$error":"#DIV/0!"},{"$f":"IF(Post_Const_Geometry_Selection=\"Geometry Same as Pre-Construction\",Base_Width_Pre,Base_Width_Post)","v":0},1,{"$f":"IF(Post_Const_Geometry_Selection=\"Geometry Same as Pre-Construction\",(Side_Slope_Left_Pre+Side_Slope_Right_Pre)/2,(Side_Slope_Left_Post+Side_Slope_Right_Post)/2)","v":0},{"$f":"IF(Post_Const_Geometry_Selection=\"Geometry Same as Pre-Construction\",Slope_Pre,Slope_Post)","v":0},{"$f":"IF(Post_Const_Geometry_Selection=\"Geometry Same as Pre-Construction\",Roughness_Pre,Roughness_Post)","v":0},{"$f":"AM17*AN17+AO17*AN17^2","v":0},{"$f":"IF(Post_Const_Geometry_Selection=\"Geometry Same as Pre-Construction\",AM17+((AN17*Side_Slope_Left_Pre)^2+AN17^2)^0.5+((AN17*Side_Slope_Right_Pre)^2+AN17^2)^0.5,AM17+((AN17*Side_Slope_Left_Post)^2+AN17^2)^0.5+((AN17*Side_Slope_Right_Post)^2+AN17^2)^0.5)","v":2},{"$f":"AR17/AS17","v":0},{"$f":"1.49/AQ17*AR17*AT17^0.667*AP17^0.5","v":{"$error":"#DIV/0!"}},{"$f":"1.49/AQ17*AT17^0.667*AP17^0.5","v":{"$error":"#DIV/0!"}},{"$f":"AU17-q10post","v":{"$error":"#DIV/0!"}},{"$error":"#DIV/0!"}]
[null,null,null,"D10 =",null,"ft.",null,null,null,"D10 =",null,"ft.",null,"D10 =",{"$f":"IF(OR(d10post=0,d10pre=0),\"\",(d10post/d10pre)-1)","v":""},null,null,null,null,null,null,null,null,null,null,null,{"$f":"Base_Width_Pre","v":0},1.6213254592941764,{"$f":"(Side_Slope_Left_Pre+Side_Slope_Right_Pre)/2","v":0},{"$f":"Slope_Pre","v":0},{"$f":"Roughness_Pre","v":0},0,{"$f":"AA18+((AB18*Side_Slope_Left_Pre)^2+AB18^2)^0.5+((AB18*Side_Slope_Right_Pre)^2+AB18^2)^0.5","v":3.2426509185883527},0,{"$error":"#DIV/0!"},{"$error":"#DIV/0!"},{"$f":"AI18-q10pre","v":{"$error":"#DIV/0!"}},{"$error":"#DIV/0!"},{"$f":"IF(Post_Const_Geometry_Selection=\"Geometry Same as Pre-Construction\",Base_Width_Pre,Base_Width_Post)","v":0},1,{"$f":"IF(Post_Const_Geometry_Selection=\"Geometry Same as Pre-Construction\",(Side_Slope_Left_Pre+Side_Slope_Right_Pre)/2,(Side_Slope_Left_Post+Side_Slope_Right_Post)/2)","v":0},{"$f":"IF(Post_Const_Geometry_Selection=\"Geometry Same as Pre-Construction\",Slope_Pre,Slope_Post)","v":0},{"$f":"IF(Post_Const_Geometry_Selection=\"Geometry Same as Pre-Construction\",Roughness_Pre,Roughness_Post)","v":0},0,{"$f":"IF(Post_Const_Geometry_Selection=\"Geometry Same as Pre-Construction\",AM18+((AN18*Side_Slope_Left_Pre)^2+AN18^2)^0.5+((AN18*Side_Slope_Right_Pre)^2+AN18^2)^0.5,AM18+((AN18*Side_Slope_Left_Post)^2+AN18^2)^0.5+((AN18*Side_Slope_Right_Post)^2+AN18^2)^0.5)","v":2},0,{"$error":"#DIV/0!"},{"$error":"#DIV/0!"},{"$f":"AU18-q10post","v":{"$error":"#DIV/0!"}},{"$error":"#DIV/0!"}]
[null,null,null,"Q25 =",null,"cfs",null,null,null,"Q25 =",null,"cfs",null,"Q25 =",{"$f":"IF(OR(q25post=\"\",q25pre=\"\"),\"\",(q25post/q25pre)-1)","v":""}]
[null,null,null,"V25 =",null,"ft./s",null,null,null,"V25 =",null,"ft./s",null,"V25 =",{"$f":"IF(OR(v25post=0,v25pre=0),\"\",(v25post/v25pre)-1)","v":""},null,null,null,null,null,null,null,null,null,null,null,{"$f":"Base_Width_Pre","v":0},1.682068068069611,{"$f":"(Side_Slope_Left_Pre+Side_Slope_Right_Pre)/2","v":0},{"$f":"Slope_Pre","v":0},{"$f":"Roughness_Pre","v":0},{"$f":"AA20*AB20+AC20*AB20^2","v":0},{"$f":"AA20+((AB20*Side_Slope_Left_Pre)^2+AB20^2)^0.5+((AB20*Side_Slope_Right_Pre)^2+AB20^2)^0.5","v":3.3641361361392219},0,{"$error":"#DIV/0!"},{"$error":"#DIV/0!"},{"$f":"AI20-q25pre","v":{"$error":"#DIV/0!"}},{"$error":"#DIV/0!"},{"$f":"IF(Post_Const_Geometry_Selection=\"Geometry Same as Pre-Construction\",Base_Width_Pre,Base_Width_Post)","v":0},1,{"$f":"IF(Post_Const_Geometry_Selection=\"Geometry Same as Pre-Construction\",(Side_Slope_Left_Pre+Side_Slope_Right_Pre)/2,(Side_Slope_Left_Post+Side_Slope_Right_Post)/2)","v":0},{"$f":"IF(Post_Const_Geometry_Selection=\"Geometry Same as Pre-Construction\",Slope_Pre,Slope_Post)","v":0},{"$f":"IF(Post_Const_Geometry_Selection=\"Geometry Same as Pre-Construction\",Roughness_Pre,Roughness_Post)","v":0},{"$f":"AM20*AN20+AO20*AN20^2","v":0},{"$f":"IF(Post_Const_Geometry_Selection=\"Geometry Same as Pre-Construction\",AM20+((AN20*Side_Slope_Left_Pre)^2+AN20^2)^0.5+((AN20*Side_Slope_Right_Pre)^2+AN20^2)^0.5,AM20+((AN20*Side_Slope_Left_Post)^2+AN20^2)^0.5+((AN20*Side_Slope_Right_Post)^2+AN20^2)^0.5)","v":2},{"$f":"AR20/AS20","v":0},{"$f":"1.49/AQ20*AR20*AT20^0.667*AP20^0.5","v":{"$error":"#DIV/0!"}},{"$f":"1.49/AQ20*AT20^0.667*AP20^0.5","v":{"$error":"#DIV/0!"}},{"$f":"AU20-q25post","v":{"$error":"#DIV/0!"}},{"$error":"#DIV/0!"}]
[null,null,null,"D25 =",null,"ft.",null,null,null,"D25 =",null,"ft.",null,"D25 =",{"$f":"IF(OR(d25post=0,d25pre=0),\"\",(d25post/d25pre)-1)","v":""},null,null,null,null,null,null,null,null,null,null,null,{"$f":"Base_Width_Pre","v":0},1.682068068069611,{"$f":"(Side_Slope_Left_Pre+Side_Slope_Right_Pre)/2","v":0},{"$f":"Slope_Pre","v":0},{"$f":"Roughness_Pre","v":0},0,{"$f":"AA21+((AB21*Side_Slope_Left_Pre)^2+AB21^2)^0.5+((AB21*Side_Slope_Right_Pre)^2+AB21^2)^0.5","v":3.3641361361392219},0,{"$error":"#DIV/0!"},{"$error":"#DIV/0!"},{"$f":"AI21-q25pre","v":{"$error":"#DIV/0!"}},{"$error":"#DIV/0!"},{"$f":"IF(Post_Const_Geometry_Selection=\"Geometry Same as Pre-Construction\",Base_Width_Pre,Base_Width_Post)","v":0},1,{"$f":"IF(Post_Const_Geometry_Selection=\"Geometry Same as Pre-Construction\",(Side_Slope_Left_Pre+Side_Slope_Right_Pre)/2,(Side_Slope_Left_Post+Side_Slope_Right_Post)/2)","v":0},{"$f":"IF(Post_Const_Geometry_Selection=\"Geometry Same as Pre-Construction\",Slope_Pre,Slope_Post)","v":0},{"$f":"IF(Post_Const_Geometry_Selection=\"Geometry Same as Pre-Construction\",Roughness_Pre,Roughness_Post)","v":0},{"$f":"AM21*AN21+AO21*AN21^2","v":0},{"$f":"IF(Post_Const_Geometry_Selection=\"Geometry Same as Pre-Construction\",AM21+((AN21*Side_Slope_Left_Pre)^2+AN21^2)^0.5+((AN21*Side_Slope_Right_Pre)^2+AN21^2)^0.5,AM21+((AN21*Side_Slope_Left_Post)^2+AN21^2)^0.5+((AN21*Side_Slope_Right_Post)^2+AN21^2)^0.5)","v":2},0,{"$error":"#DIV/0!"},{"$error":"#DIV/0!"},{"$f":"AU21-q25post","v":{"$error":"#DIV/0!"}},{"$error":"#DIV/0!"}]
[null,null,null,"Q50 =",null,"cfs",null,null,null,"Q50 =",null,"cfs",null,"Q50 =",{"$f":"IF(OR(q50post=\"\",q50pre=\"\"),\"\",(q50post/q50pre)-1)","v":""}]
[null,null,null,"V50 =",null,"ft./s",null,null,null,"V50 =",null,"ft./s",null,"V50 =",{"$f":"IF(OR(v50post=0,v50pre=0),\"\",(v50post/v50pre)-1)","v":""},null,null,null,null,null,null,null,null,null,null,null,{"$f":"Base_Width_Pre","v":0},1.7196104937144696,{"$f":"(Side_Slope_Left_Pre+Side_Slope_Right_Pre)/2","v":0},{"$f":"Slope_Pre","v":0},{"$f":"Roughness_Pre","v":0},0,{"$f":"AA23+((AB23*Side_Slope_Left_Pre)^2+AB23^2)^0.5+((AB23*Side_Slope_Right_Pre)^2+AB23^2)^0.5","v":3.4392209874289392},0,{"$error":"#DIV/0!"},{"$error":"#DIV/0!"},{"$f":"AI23-q50pre","v":{"$error":"#DIV/0!"}},{"$error":"#DIV/0!"},{"$f":"IF(Post_Const_Geometry_Selection=\"Geometry Same as Pre-Construction\",Base_Width_Pre,Base_Width_Post)","v":0},1,{"$f":"IF(Post_Const_Geometry_Selection=\"Geometry Same as Pre-Construction\",(Side_Slope_Left_Pre+Side_Slope_Right_Pre)/2,(Side_Slope_Left_Post+Side_Slope_Right_Post)/2)","v":0},{"$f":"IF(Post_Const_Geometry_Selection=\"Geometry Same as Pre-Construction\",Slope_Pre,Slope_Post)","v":0},{"$f":"IF(Post_Const_Geometry_Selection=\"Geometry Same as Pre-Construction\",Roughness_Pre,Roughness_Post)","v":0},{"$f":"AM23*AN23+AO23*AN23^2","v":0},{"$f":"IF(Post_Const_Geometry_Selection=\"Geometry Same as Pre-Construction\",AM23+((AN23*Side_Slope_Left_Pre)^2+AN23^2)^0.5+((AN23*Side_Slope_Right_Pre)^2+AN23^2)^0.5,AM23+((AN23*Side_Slope_Left_Post)^2+AN23^2)^0.5+((AN23*Side_Slope_Right_Post)^2+AN23^2)^0.5)","v":2},{"$f":"AR23/AS23","v":0},{"$f":"1.49/AQ23*AR23*AT23^0.667*AP23^0.5","v":{"$error":"#DIV/0!"}},{"$f":"1.49/AQ23*AT23^0.667*AP23^0.5","v":{"$error":"#DIV/0!"}},{"$f":"AU23-q50post","v":{"$error":"#DIV/0!"}},{"$error":"#DIV/0!"}]
[null,null,null,"D50 =",null,"ft.",null,null,null,"D50 =",null,"ft.",null,"D50 =",{"$f":"IF(OR(d50post=0,d50pre=0),\"\",(d50post/d50pre)-1)","v":""},null,null,null,null,null,null,null,null,null,null,null,{"$f":"Base_Width_Pre","v":0},1.7196104937144696,{"$f":"(Side_Slope_Left_Pre+Side_Slope_Right_Pre)/2","v":0},{"$f":"Slope_Pre","v":0},{"$f":"Roughness_Pre","v":0},{"$f":"AA24*AB24+AC24*AB24^2","v":0},{"$f":"AA24+((AB24*Side_Slope_Left_Pre)^2+AB24^2)^0.5+((AB24*Side_Slope_Right_Pre)^2+AB24^2)^0.5","v":3.4392209874289392},0,{"$f":"1.49/AE24*AF24*AH24^0.667*AD24^0.5","v":{"$error":"#DIV/0!"}},{"$error":"#DIV/0!"},{"$f":"AI24-q50pre","v":{"$error":"#DIV/0!"}},{"$error":"#DIV/0!"},{"$f":"IF(Post_Const_Geometry_Selection=\"Geometry Same as Pre-Construction\",Base_Width_Pre,Base_Width_Post)","v":0},1,{"$f":"IF(Post_Const_Geometry_Selection=\"Geometry Same as Pre-Construction\",(Side_Slope_Left_Pre+Side_Slope_Right_Pre)/2,(Side_Slope_Left_Post+Side_Slope_Right_Post)/2)","v":0},{"$f":"IF(Post_Const_Geometry_Selection=\"Geometry Same as Pre-Construction\",Slope_Pre,Slope_Post)","v":0},{"$f":"IF(Post_Const_Geometry_Selection=\"Geometry Same as Pre-Construction\",Roughness_Pre,Roughness_Post)","v":0},0,{"$f":"IF(Post_Const_Geometry_Selection=\"Geometry Same as Pre-Construction\",AM24+((AN24*Side_Slope_Left_Pre)^2+AN24^2)^0.5+((AN24*Side_Slope_Right_Pre)^2+AN24^2)^0.5,AM24+((AN24*Side_Slope_Left_Post)^2+AN24^2)^0.5+((AN24*Side_Slope_Right_Post)^2+AN24^2)^0.5)","v":2},0,{"$error":"#DIV/0!"},{"$error":"#DIV/0!"},{"$f":"AU24-q50post","v":{"$error":"#DIV/0!"}},{"$error":"#DIV/0!"}]
[null,null,null,"Q100 =",null,"cfs",null,null,null,"Q100 =",null,"cfs",null,"Q100 =",{"$f":"IF(OR(q100post=\"\",q100pre=\"\"),\"\",(q100post/q100pre)-1)","v":""}]
[null,null,null,"V100 =",null,"ft./s",null,null,null,"V100 =",null,"ft./s",null,"V100 =",{"$f":"IF(OR(v100post=0,v100pre=0),\"\",(v100post/v100pre)-1)","v":""},null,null,null,null,null,null,null,null,null,null,null,{"$f":"Base_Width_Pre","v":0},1.7196104937144696,{"$f":"(Side_Slope_Left_Pre+Side_Slope_Right_Pre)/2","v":0},{"$f":"Slope_Pre","v":0},{"$f":"Roughness_Pre","v":0},{"$f":"AA26*AB26+AC26*AB26^2","v":0},{"$f":"AA26+((AB26*Side_Slope_Left_Pre)^2+AB26^2)^0.5+((AB26*Side_Slope_Right_Pre)^2+AB26^2)^0.5","v":3.4392209874289392},{"$f":"AF26/AG26","v":0},{"$f":"1.49/AE26*AF26*AH26^0.667*AD26^0.5","v":{"$error":"#DIV/0!"}},{"$f":"1.49/AE26*AH26^0.667*AD26^0.5","v":{"$error":"#DIV/0!"}},{"$f":"AI26-q100pre","v":{"$error":"#DIV/0!"}},{"$f":"ROUND(AK26,1)","v":{"$error":"#DIV/0!"}},{"$f":"IF(Post_Const_Geometry_Selection=\"Geometry Same as Pre-Construction\",Base_Width_Pre,Base_Width_Post)","v":0},1,{"$f":"IF(Post_Const_Geometry_Selection=\"Geometry Same as Pre-Construction\",(Side_Slope_Left_Pre+Side_Slope_Right_Pre)/2,(Side_Slope_Left_Post+Side_Slope_Right_Post)/2)","v":0},{"$f":"IF(Post_Const_Geometry_Selection=\"Geometry Same as Pre-Construction\",Slope_Pre,Slope_Post)","v":0},{"$f":"IF(Post_Const_Geometry_Selection=\"Geometry Same as Pre-Construction\",Roughness_Pre,Roughness_Post)","v":0},{"$f":"AM26*AN26+AO26*AN26^2","v":0},{"$f":"IF(Post_Const_Geometry_Selection=\"Geometry Same as Pre-Construction\",AM26+((AN26*Side_Slope_Left_Pre)^2+AN26^2)^0.5+((AN26*Side_Slope_Right_Pre)^2+AN26^2)^0.5,AM26+((AN26*Side_Slope_Left_Post)^2+AN26^2)^0.5+((AN26*Side_Slope_Right_Post)^2+AN26^2)^0.5)","v":2},{"$f":"AR26/AS26","v":0},{"$f":"1.49/AQ26*AR26*AT26^0.667*AP26^0.5","v":{"$error":"#DIV/0!"}},{"$f":"1.49/AQ26*AT26^0.667*AP26^0.5","v":{"$error":"#DIV/0!"}},{"$f":"AU26-q100post","v":{"$error":"#DIV/0!"}},{"$f":"ROUND(AW26,1)","v":{"$error":"#DIV/0!"}}]
[null,null,null,"D100 =",null,"ft.",null,null,null,"D100 =",null,"ft.",null,"D100 =",{"$f":"IF(OR(d100post=0,d100pre=0),\"\",(d100post/d100pre)-1)","v":""},null,null,null,null,null,null,null,null,null,null,null,{"$f":"Base_Width_Pre","v":0},1.7196104937144696,{"$f":"(Side_Slope_Left_Pre+Side_Slope_Right_Pre)/2","v":0},{"$f":"Slope_Pre","v":0},{"$f":"Roughness_Pre","v":0},{"$f":"AA27*AB27+AC27*AB27^2","v":0},{"$f":"AA27+((AB27*Side_Slope_Left_Pre)^2+AB27^2)^0.5+((AB27*Side_Slope_Right_Pre)^2+AB27^2)^0.5","v":3.4392209874289392},0,{"$f":"1.49/AE27*AF27*AH27^0.667*AD27^0.5","v":{"$error":"#DIV/0!"}},{"$error":"#DIV/0!"},{"$f":"AI27-q100pre","v":{"$error":"#DIV/0!"}},{"$f":"ROUND(AK27,1)","v":{"$error":"#DIV/0!"}},{"$f":"IF(Post_Const_Geometry_Selection=\"Geometry Same as Pre-Construction\",Base_Width_Pre,Base_Width_Post)","v":0},1,{"$f":"IF(Post_Const_Geometry_Selection=\"Geometry Same as Pre-Construction\",(Side_Slope_Left_Pre+Side_Slope_Right_Pre)/2,(Side_Slope_Left_Post+Side_Slope_Right_Post)/2)","v":0},{"$f":"IF(Post_Const_Geometry_Selection=\"Geometry Same as Pre-Construction\",Slope_Pre,Slope_Post)","v":0},{"$f":"IF(Post_Const_Geometry_Selection=\"Geometry Same as Pre-Construction\",Roughness_Pre,Roughness_Post)","v":0},0,{"$f":"IF(Post_Const_Geometry_Selection=\"Geometry Same as Pre-Construction\",AM27+((AN27*Side_Slope_Left_Pre)^2+AN27^2)^0.5+((AN27*Side_Slope_Right_Pre)^2+AN27^2)^0.5,AM27+((AN27*Side_Slope_Left_Post)^2+AN27^2)^0.5+((AN27*Side_Slope_Right_Post)^2+AN27^2)^0.5)","v":2},0,{"$f":"1.49/AQ27*AR27*AT27^0.667*AP27^0.5","v":{"$error":"#DIV/0!"}},{"$f":"1.49/AQ27*AT27^0.667*AP27^0.5","v":{"$error":"#DIV/0!"}},{"$f":"AU27-q100post","v":{"$error":"#DIV/0!"}},{"$error":"#DIV/0!"}]
[null,null,null,null,null,null,null,null,null,null,null,null,null,"DAtotal=",{"$f":"IF(OR(da_total_post=0,da_total_post=\"\",da_total_pre=0),\"\",(da_total_post/da_total_pre)-1)","v":""}]
["Railroad / 100-YR Design? ",null,null,"Existing Erosion / Potential Future Erosion?",null,null,null,"Post Const. D/S Channel liner type",null,null,null,null,null,"DA imp R/W = ",{"$f":"IF(OR(da_pre_imp=\"\",da_post_imp=\"\"),\"\",da_post_imp-da_pre_imp)","v":""}]
[null,null,null,null,null,null,null,null,null,null,{"$f":"IF(J30=\"\",\"\",IF(d10post=\"\",\"Calc D10\",IF(AND(Post_Const_Geometry_Selection=\"Geometry Same as Pre-Construction\",Slope_Pre=\"\"),\"Enter Slope\",IF(AND(Slope_Post=\"\",Post_Const_Geometry_Selection<>\"Geometry Same as Pre-Construction\"),\"Enter Slope\",IF(Post_Const_Geometry_Selection=\"Geometry Same as Pre-Construction\",Slope_Pre*d10post*62.4,Slope_Post*d10post*62.4)))))","v":""},null,null,"% imp Area = ",{"$f":"IF(OR(percent_imp_pre=\"\",percent_imp_post=\"\"),\"\",percent_imp_post-percent_imp_pre)","v":""},null,null,null,null,null,null,null,null,null,null,null,null,null,null,null,null,null,{"$f":"_xlfn.TEXTJOIN(\"\",TRUE,\"OA-\",B1,\"-\",UID_hidden)","v":"OA-0-"}]
[]
[]
[]
["LINER TYPE","Select Liner Type Above To Generate List",null,null,null,null,null,"PRE-CONSTRUCTION OUTLET GEOMETRY"]
[]
["V10 Permissible",{"$f":"IF(I30=\"N/A\",\"N/A\",IF(Soil_Type=\"Permanent Matting Product (stable)\",\"User to Define\",IF(J30<>\"\",\"N/A\",IF(I30=\"Soil\",AD41,IF(I30=\"Non-Soil\",AD43,\"\")))))","v":""},null,{"$f":"IF(Soil_Type='PICK LISTS'!E14,\"N/A\",IF(A34=\"LINER TYPE\",AF62,AD60))","v":""},null,null,null,"POST-CONSTRUCTION OUTLET GEOMETRY"]
["τ10 Permissible",{"$f":"IF(A34=\"SOIL TYPE\",\"N/A\",IF(Soil_Type=\"Grass / Dense Veg. (no bare soil spots)\",\"N/A\",IF(J30<>\"\",AD43,\"\")))","v":""},null,null,null,null,null,null,null,null,null,null,null,null,null,null,null,null,null,null,null,null,null,null,null,null,null,"Hydrology Method:",null,"User Input Method"]
[]
["PRE-CONSTRUCTION OUTLET GEOMETRY",null,null,null,null,null,null,null,"POST-CONSTRUCTION OUTLET GEOMETRY"]
[null,null,null,null,null,null,null,null,null,null,null,null,null,null,null,null,null,null,null,null,null,null,null,null,null,null,null,null,null,null,null,"allowable shear stress",null,{"$f":"AD43","v":""}]
[null,null,null,null,null,null,null,null,null,null,null,null,null,null,null,null,null,null,null,null,null,null,null,null,null,null,null,"v_permissible soil",null,{"$f":"IF(Soil_Type='PICK LISTS'!E2,'PICK LISTS'!F2,IF(Soil_Type='PICK LISTS'!E3,'PICK LISTS'!F3,IF(Soil_Type='PICK LISTS'!E4,'PICK LISTS'!F4, IF(Soil_Type='PICK LISTS'!E5,'PICK LISTS'!F5, IF(Soil_Type='PICK LISTS'!E6,'PICK LISTS'!F6,IF(Soil_Type='PICK LISTS'!E7,'PICK LISTS'!F7,IF(Soil_Type='PICK LISTS'!E8,'PICK LISTS'!F8,IF(Soil_Type='PICK LISTS'!E9,'PICK LISTS'!F9,IF(Soil_Type='PICK LISTS'!E10,'PICK LISTS'!F10,IF(Soil_Type='PICK LISTS'!E11,'PICK LISTS'!F11,IF(Soil_Type='PICK LISTS'!E12,'PICK LISTS'!F12,IF(Soil_Type='PICK LISTS'!E13,'PICK LISTS'!F13,IF(Soil_Type=\"N/A (Pipe System or Non-Channel)\",\"N/A\",\"\")))))))))))))","v":""},null,"riprap permissible velocity",null,null,{"$f":"IF(v10post=\"\",\"\",(1.49/(Roughness_Pre*SQRT(62.4*d10pre)))*(AH18^(0.1666666))*(AH40^0.5))","v":""},null,null,null,"PRE"]
[null,null,null,null,null,null,null,null,null,null,null,null,null,null,null,null,null,null,null,null,null,null,null,null,null,null,null,null,null,null,null,null,null,null,null,null,null,null,null,"Intensity Calcs"]
[null,null,null,null,null,null,null,null,null,null,null,null,null,null,null,null,null,null,null,null,null,null,null,null,null,null,null,"shear/v_perm non-soil",null,{"$f":"IF(Soil_Type='PICK LISTS'!H18,'PICK LISTS'!I18,IF(Soil_Type='PICK LISTS'!H19,'PICK LISTS'!I19,IF(Soil_Type='PICK LISTS'!H20,'PICK LISTS'!I20,IF(Soil_Type='PICK LISTS'!H21,'PICK LISTS'!I21,IF(Soil_Type='PICK LISTS'!H22,'PICK LISTS'!I22,IF(Soil_Type='PICK LISTS'!H23,'PICK LISTS'!I23,\"\"))))))","v":""},null,"Is it riprap lined?",null,{"$f":"IF(OR(Soil_Type=\"CL-A Riprap (d50 = 4 in.)\",Soil_Type=\"CL-B Riprap (d50 = 8 in.)\",Soil_Type=\"CL-I Riprap (d50 = 10 in.)\",Soil_Type=\"CL-II Riprap (d50 = 12 in.)\"),\"YES\",\"NO\")","v":"NO"}]
[null,null,null,null,null,null,null,null,null,null,null,null,null,null,null,null,null,null,null,null,null,null,null,null,null,null,null,null,null,null,null,null,null,null,null,null,null,null,null,null,2,5,10,25,50,100]
[null,null,null,null,null,null,null,null,null,null,null,null,null,null,null,null,null,null,null,null,null,null,null,null,null,null,null,"Increase or Decrease in Velocity",null,null,null,null,null,null,null,null,null,null,null,{"$f":"IF(custom_IDF=\"YES\",INDIRECT(\"Z_CUSTOM_IDF\"),IF(county_for_this_outlet=\"New Hanover\", INDIRECT(\"NewHanover\"),INDIRECT(county_for_this_outlet)))","v":{"$error":"#REF!"}}]
[null,null,null,null,null,null,null,null,null,null,null,null,null,null,null,null,null,null,null,null,null,null,null,null,null,null,null,{"$f":"IF(OR(v10pre=\"\",v10post=\"\",Soil_Type=\"\",Soil_Type=\"Select Liner Type Above To Generate List\"),\"\",IF(v10post>v10pre,\"Increase\",IF(v10post<=v10pre,\"Decrease\",\"\")))","v":""}]
[]
[null,null,null,null,null,null,null,null,null,null,null,null,null,null,null,null,null,null,null,null,null,null,null,null,null,null,null,"Vpost > Vsoil_permissible?"]
[]
[]
[{"$f":"_xlfn.CONCAT(\"SUMMARY - \",_xlnm.sheet_title)","v":"SUMMARY - PSH # OUTLET #"},null,null,null,null,null,null,null,null,null,null,null,null,null,null,null,null,null,null,null,null,null,null,null,null,null,null,{"$f":"IF(I30=\"Soil\",IF(v10post>AD41,\"YES\",\"NO\"),IF(AH43=\"YES\",IF(K30>AD43,\"YES\",\"NO\"),IF(v10post>AD43,\"YES\",\"NO\")))","v":"NO"}]
["Please provide a summary of the outlet analysis here. Directions/guidance are provided by clicking on the \"i\" button above."]
[null,null,null,null,null,null,null,null,null,null,null,null,null,null,null,null,null,null,null,null,null,null,null,null,null,null,null,"Vpost increase > 10%?",null,null,null,null,null,null,null,null,null,null,null,"5-10",{"$f":"_xlfn.FORECAST.LINEAR(Tc_R_Pre,AO45:AO46,$AN45:$AN46)","v":{"$error":"#NAME?"}},{"$f":"_xlfn.FORECAST.LINEAR(Tc_R_Pre,AP45:AP46,$AN45:$AN46)","v":{"$error":"#NAME?"}},{"$error":"#NAME?"},{"$error":"#NAME?"},{"$error":"#NAME?"},{"$error":"#NAME?"}]
[null,null,null,null,null,null,null,null,null,null,null,null,null,null,null,null,null,null,null,null,null,null,null,null,null,null,null,{"$f":"IF(O17>0.1,\"YES\",\"NO\")","v":"YES"},null,null,null,null,null,null,null,null,null,null,null,"10-15",{"$f":"_xlfn.FORECAST.LINEAR(Tc_R_Pre,AO46:AO47,$AN46:$AN47)","v":{"$error":"#NAME?"}},{"$error":"#NAME?"},{"$error":"#NAME?"},{"$error":"#NAME?"},{"$error":"#NAME?"},{"$error":"#NAME?"}]
[null,null,null,null,null,null,null,null,null,null,null,null,null,null,null,null,null,null,null,null,null,null,null,null,null,null,null,null,null,null,null,null,null,null,null,null,null,null,null,"15-30",{"$error":"#NAME?"},{"$error":"#NAME?"},{"$error":"#NAME?"},{"$error":"#NAME?"},{"$error":"#NAME?"},{"$error":"#NAME?"}]
[null,null,null,null,null,null,null,null,null,null,null,null,null,null,null,null,null,null,null,null,null,null,null,null,null,null,null,null,null,null,null,null,null,null,null,null,null,null,null,"30-60",{"$error":"#NAME?"},{"$error":"#NAME?"},{"$error":"#NAME?"},{"$error":"#NAME?"},{"$error":"#NAME?"},{"$error":"#NAME?"}]
[]
[null,null,null,null,null,null,null,null,null,null,null,null,null,null,null,null,null,null,null,null,null,null,null,null,null,null,null,null,null,null,null,null,null,null,null,null,null,null,null,null,{"$f":"IF(OR(Tc_R_Pre>60, Tc_R_Pre<5), \"Error\", IF(AND(Tc_R_Pre>=5,Tc_R_Pre<=10),AO53, IF(AND(Tc_R_Pre>10,Tc_R_Pre<=15), AO54, IF(AND(Tc_R_Pre>15, Tc_R_Pre<=30), AO55, IF(AND(Tc_R_Pre>30, Tc_R_Pre<=60), AO56, VLOOKUP(Tc_R_Pre, INDIRECT(Name_R), 2))))))","v":{"$error":"#NAME?"}},{"$f":"IF(OR(Tc_R_Pre>60, Tc_R_Pre<5), \"Error\", IF(AND(Tc_R_Pre>=5,Tc_R_Pre<=10),AP53, IF(AND(Tc_R_Pre>10,Tc_R_Pre<=15), AP54, IF(AND(Tc_R_Pre>15, Tc_R_Pre<=30), AP55, IF(AND(Tc_R_Pre>30, Tc_R_Pre<=60), AP56, VLOOKUP(Tc_R_Pre, INDIRECT(Name_R), 2))))))","v":{"$error":"#NAME?"}},{"$error":"#NAME?"},{"$error":"#NAME?"},{"$error":"#NAME?"},{"$error":"#NAME?"}]
[null,null,null,null,null,null,null,null,null,null,null,null,null,null,null,null,null,null,"NUMBER OF OUTLET PHOTO PAGES",null,1,null,null,null,null,null,null,null,"Applies?","Which case is it?",null,"non-soil"]
[null,null,null,null,null,null,null,null,null,null,null,null,null,null,null,null,null,null,null,null,null,null,null,null,null,null,null,"Case 1",{"$f":"IF(AND(OR(F30=\"None\",F30=\"Potential\"),AB46=\"Decrease\",AB51=\"NO\"),\"YES\",\"\")","v":""},{"$f":"IF(AC60<>\"\",AB60,IF(AC61<>\"\",AB61,IF(AC62<>\"\",AB62,IF(AC63<>\"\",AB63,IF(AC64<>\"\",AB64,IF(AC65<>\"\",AB65,IF(AC66<>\"\",AB66,IF(AC67<>\"\",AB67,IF(AC68<>\"\",AB68,IF(AC69<>\"\",AB69,\"\"))))))))))","v":""}]
[null,null,null,null,null,null,null,null,null,null,null,null,null,null,null,null,null,null,null,null,null,null,null,null,null,null,null,"Case 1A",{"$f":"IF(AND(OR(F30=\"Existing\",F30=\"Both\"),AB46=\"Decrease\",AB51=\"NO\"),\"YES\",\"\")","v":""}]
[null,null,null,null,null,null,null,null,null,null,null,null,null,null,null,null,null,null,null,null,null,null,null,null,null,null,null,"Case 2",{"$f":"IF(AND(OR(F30=\"None\",F30=\"Potential\"),AB46=\"Decrease\",AB51=\"YES\"),\"YES\",\"\")","v":""},null,null,{"$f":"IF(AD60=\"\",\"\",\"Non-Soil, see Note 1 & 2 of Case Table\")","v":""}]
[null,null,null,null,null,null,null,null,null,null,null,null,null,null,null,null,null,null,null,null,null,null,null,null,null,null,null,"Case 2A",{"$f":"IF(AND(OR(F30=\"Existing\",F30=\"Both\"),AB46=\"Decrease\",AB51=\"YES\"),\"YES\",\"\")","v":""},null,null,null,null,null,null,null,null,null,null,"pre-const geometry type"]
[null,null,null,null,null,null,null,null,null,null,null,null,null,null,null,null,null,null,null,null,null,null,null,null,null,null,null,"Case 3",{"$f":"IF(AND(OR(F30=\"None\",F30=\"Potential\"),AB46=\"Increase\",AB51=\"NO\"),\"YES\",\"\")","v":""}]
[null,null,null,null,null,null,null,null,null,null,null,null,null,null,null,null,null,null,null,null,null,null,null,null,null,null,null,"Case 3A",{"$f":"IF(AND(OR(F30=\"Existing\",F30=\"Both\"),AB46=\"Increase\",AB51=\"NO\"),\"YES\",\"\")","v":""},null,null,null,null,null,null,null,null,null,null,"post-const geometry type",null,null,null,"railroad design?"]
[null,null,null,null,null,null,null,null,null,null,null,null,null,null,null,null,null,null,null,null,null,null,null,null,null,null,null,"Case 4",{"$f":"IF(AND(OR(F30=\"None\",F30=\"Potential\"),AB46=\"Increase\",AB51=\"YES\",O17<=0.1),\"YES\",\"\")","v":""}]
[null,null,null,null,null,null,null,null,null,null,null,null,null,null,null,null,null,null,null,null,null,null,null,null,null,null,null,"Case 4A",{"$f":"IF(AND(OR(F30=\"Existing\",F30=\"Both\"),AB46=\"Increase\",AB51=\"YES\",O17<=0.1),\"YES\",\"\")","v":""}]
[null,null,null,null,null,null,null,null,null,null,null,null,null,null,null,null,null,null,null,null,null,null,null,null,null,null,null,"Case 5",{"$f":"IF(AND(OR(F30=\"None\",F30=\"Potential\"),AB46=\"Increase\",AB51=\"YES\",O17>0.1),\"YES\",\"\")","v":""}]
[null,null,null,null,null,null,null,null,null,null,null,null,null,null,null,null,null,null,null,null,null,null,null,null,null,null,null,"Case 5A",{"$f":"IF(AND(OR(F30=\"Existing\",F30=\"Both\"),AB46=\"Increase\",AB51=\"YES\",O17>0.1),\"YES\",\"\")","v":""},null,null,null,null,null,null,null,null,null,"POST"]
[null,null,null,null,null,null,null,null,null,null,null,null,null,null,null,null,null,null,null,null,null,null,null,null,null,null,null,null,null,null,null,null,null,null,null,null,null,null,null,"Intensity Calcs"]
[]
["OUTLET SITE PHOTOS PAGE 1",null,null,null,null,null,null,null,null,null,null,null,null,null,null,null,null,null,null,null,null,null,null,null,null,null,null,null,null,null,null,null,null,null,null,null,null,null,null,null,2,5,10,25,50,100]
[null,null,null,null,null,null,null,null,null,null,null,null,null,null,null,null,null,null,null,null,null,null,null,null,null,null,null,null,null,null,null,null,null,null,null,null,null,null,null,{"$f":"IF(custom_IDF=\"YES\",INDIRECT(\"Z_CUSTOM_IDF\"),IF(county_for_this_outlet=\"New Hanover\", INDIRECT(\"NewHanover\"),INDIRECT(county_for_this_outlet)))","v":{"$error":"#REF!"}}]
["Photo Description Here",null,null,null,null,null,null,null,"Photo Description Here"]
[]
[]
[]
[]
[]
[]
[null,null,null,null,null,null,null,null,null,null,null,null,null,null,null,null,null,null,null,null,null,null,null,null,null,null,null,null,null,null,null,null,null,null,null,null,null,null,null,"5-10",{"$f":"_xlfn.FORECAST.LINEAR(Tc_R_Post,AO73:AO74,$AN73:$AN74)","v":{"$error":"#NAME?"}},{"$error":"#NAME?"},{"$error":"#NAME?"},{"$error":"#NAME?"},{"$error":"#NAME?"},{"$error":"#NAME?"}]
[null,null,null,null,null,null,null,null,null,null,null,null,null,null,null,null,null,null,null,null,null,null,null,null,null,null,null,null,null,null,null,null,null,null,null,null,null,null,null,"10-15",{"$error":"#NAME?"},{"$error":"#NAME?"},{"$error":"#NAME?"},{"$error":"#NAME?"},{"$error":"#NAME?"},{"$error":"#NAME?"}]
[null,null,null,null,null,null,null,null,null,null,null,null,null,null,null,null,null,null,null,null,null,null,null,null,null,null,null,null,null,null,null,null,null,null,null,null,null,null,null,"15-30",{"$error":"#NAME?"},{"$error":"#NAME?"},{"$error":"#NAME?"},{"$error":"#NAME?"},{"$error":"#NAME?"},{"$error":"#NAME?"}]
[null,null,null,null,null,null,null,null,null,null,null,null,null,null,null,null,null,null,null,null,null,null,null,null,null,null,null,null,null,null,null,null,null,null,null,null,null,null,null,"30-60",{"$error":"#NAME?"},{"$error":"#NAME?"},{"$error":"#NAME?"},{"$error":"#NAME?"},{"$error":"#NAME?"},{"$error":"#NAME?"}]
[]
[null,null,null,null,null,null,null,null,null,null,null,null,null,null,null,null,null,null,null,null,null,null,null,null,null,null,null,null,null,null,null,null,null,null,null,null,null,null,null,null,{"$f":"IF(OR(Tc_R_Post>60, Tc_R_Post<5), \"Error\", IF(AND(Tc_R_Post>=5,Tc_R_Post<=10),AO81, IF(AND(Tc_R_Post>10, Tc_R_Post<=15), AO82, IF(AND(Tc_R_Post>15, Tc_R_Post<=30), AO83, IF(AND(Tc_R_Post>30, Tc_R_Post<=60), AO84, VLOOKUP(Tc_R_Post, INDIRECT(Name_R), 2))))))","v":{"$error":"#NAME?"}},{"$error":"#NAME?"},{"$error":"#NAME?"},{"$error":"#NAME?"},{"$error":"#NAME?"},{"$error":"#NAME?"}]
[]
[]
[null,null,null,null,null,null,null,null,null,null,null,null,null,null,null,null,null,null,null,null,null,null,null,null,null,null,null,null,null,null,null,null,null,null,null,null,null,null,null,null,null,null,null,null,null,null,null,null,null,null,null,null,null,null,"template for 1 page of photos just copies the formatting from this cell below"]
[null,null,null,null,null,null,null,null,null,null,null,null,null,null,null,null,null,null,null,null,null,null,null,null,null,null,null,null,null,null,null,null,null,null,null,null,null,null,null,null,null,null,null,null,null,null,null,null,null,null,null,null,null,"---->"]
[]
[]
[]
[]
[]
[null,null,null,null,null,null,null,null,null,null,null,null,null,null,null,null,null,null,null,null,null,null,null,null,null,null,null,null,null,null,null,null,null,null,null,null,null,null,null,null,null,null,null,null,null,null,null,null,null,null,null,null,null,null,"TEMPLATE FOR 2 PHOTO PAGES",null,null,null,null,null,null,null,null,null,null,null,null,null,null,null,null,null,"TEMPLATE FOR 3 PHOTO PAGES",null,null,null,null,null,null,null,null,null,null,null,null,null,null,null,null,null,"TEMPLATE FOR 4 PHOTO PAGES",null,null,null,null,null,null,null,null,null,null,null,null,null,null,null,null,null,"TEMPLATE FOR 5 PHOTO PAGES"]
[{"$f":"_xlfn.CONCAT( _xlnm.sheet_title,\" SITE PHOTOS - PAGE 2\")","v":"PSH # OUTLET # SITE PHOTOS - PAGE 2"},null,null,null,null,null,null,null,null,null,null,null,null,null,null,null,null,null,null,null,null,null,null,null,null,null,null,null,null,null,null,null,null,null,null,null,null,null,null,null,null,null,null,null,null,null,null,null,null,null,null,null,null,null,"OUTLET SITE PHOTOS PAGE 2",null,null,null,null,null,null,null,null,null,null,null,null,null,null,null,null,null,"OUTLET SITE PHOTOS PAGE 2",null,null,null,null,null,null,null,null,null,null,null,null,null,null,null,null,null,"OUTLET SITE PHOTOS PAGE 2",null,null,null,null,null,null,null,null,null,null,null,null,null,null,null,null,null,"OUTLET SITE PHOTOS PAGE 2"]
["Photo Description Here",null,null,null,null,null,null,null,"Photo Description Here",null,null,null,null,null,null,null,null,null,null,null,null,null,null,null,null,null,null,null,null,null,null,null,null,null,null,null,null,null,null,null,null,null,null,null,null,null,null,null,null,null,null,null,null,null,"Photo Description Here",null,null,null,null,null,null,null,"Photo Description Here",null,null,null,null,null,null,null,null,null,"Photo Description Here",null,null,null,null,null,null,null,"Photo Description Here",null,null,null,null,null,null,null,null,null,"Photo Description Here",null,null,null,null,null,null,null,"Photo Description Here",null,null,null,null,null,null,null,null,null,"Photo Description Here",null,null,null,null,null,null,null,"Photo Description Here"]
[]
[]
[]
[null,null,null,null,null,null,null,null,null,null,null,null,null,null,null,null,null,null,null,null,null,null,null,null,null,null,null,null,null,null,null,null,null,null,null,null,null,null,null,{"$f":"INDIRECT(New_Hanover)","v":{"$error":"#NAME?"}}]
[]
[]
[null,null,null,null,null,null,null,null,null,null,null,null,null,null,null,null,null,null,null,null,null,null,null,null,null,null,null,null,null,null,null,null,null,null,"hidden da and c pre field values for this sheet"]
[null,null,null,null,null,null,null,null,null,null,null,null,null,null,null,null,null,null,null,null,null,null,null,null,null,null,null,null,null,null,null,null,null,null,null,null,"check for non std c-values",null,"hidden da and c post field values for this sheet",null,"check for non std c-values"]
[null,null,null,null,null,null,null,null,null,null,null,null,null,null,null,null,null,null,null,null,null,null,null,null,null,null,null,null,null,null,null,null,null,null,0,"0.9",null,null,0,"0.9"]
[null,null,null,null,null,null,null,null,null,null,null,null,null,null,null,null,null,null,null,null,null,null,null,null,null,null,null,null,null,null,null,null,null,null,0,0.9,null,null,0,0.9]
[null,null,null,null,null,null,null,null,null,null,null,null,null,null,null,null,null,null,null,null,null,null,null,null,null,null,null,null,null,null,null,null,null,null,0,"0.3",null,null,0,"0.3"]
[null,null,null,null,null,null,null,null,null,null,null,null,null,null,null,null,null,null,null,null,null,null,null,null,null,null,null,null,null,null,null,null,null,null,0,0.2,null,null,"0","0.2"]
[null,null,null,null,null,null,null,null,null,null,null,null,null,null,null,null,null,null,null,null,null,null,null,null,null,null,null,null,null,null,null,null,null,null,"0","0",{"$f":"IF(VALUE(da_other2_pre_field)=0,\"no non std area\",IF(AND(VALUE(c_other2_pre_field)>0.3,VALUE(c_other2_pre_field)<0.9),\"non std c values\",\"\"))","v":"no non std area"},null,"0","0",{"$f":"IF(VALUE(da_other2_post_field)=0,\"no non std area\",IF(AND(VALUE(c_other2_post_field)>0.3,VALUE(c_other2_post_field)<0.9),\"non std c values\",\"\"))","v":"no non std area"}]
[null,null,null,null,null,null,null,null,null,null,null,null,null,null,null,null,null,null,null,null,null,null,null,null,null,null,null,null,null,null,null,null,null,null,"0","0",{"$f":"IF(VALUE(da_other3_pre_field)=0,\"no non std area\",IF(AND(VALUE(c_other3_pre_field)>0.3,VALUE(c_other3_pre_field)<0.9),\"non std c values\",\"\"))","v":"no non std area"},null,"0","0",{"$f":"IF(VALUE(da_other3_post_field)=0,\"no non std area\",IF(AND(VALUE(c_other3_post_field)>0.3,VALUE(c_other3_post_field)<0.9),\"non std c values\",\"\"))","v":"no non std area"}]
[null,null,null,null,null,null,null,null,null,null,null,null,null,null,null,null,null,null,null,null,null,null,null,null,null,null,null,null,null,null,null,null,null,null,"0","0",{"$f":"IF(VALUE(da_other4_pre_field)=0,\"no non std area\",IF(AND(VALUE(c_other4_pre_field)>0.3,VALUE(c_other4_pre_field)<0.9),\"non std c values\",\"\"))","v":"no non std area"},null,"0","0",{"$f":"IF(VALUE(da_other4_post_field)=0,\"no non std area\",IF(AND(VALUE(c_other4_post_field)>0.3,VALUE(c_other4_post_field)<0.9),\"non std c values\",\"\"))","v":"no non std area"}]
["Photo Description Here",null,null,null,null,null,null,null,"Photo Description Here",null,null,null,null,null,null,null,null,null,null,null,null,null,null,null,null,null,null,null,null,null,null,null,null,null,null,null,null,null,null,null,null,null,null,null,null,null,null,null,null,null,null,null,null,null,"Photo Description Here",null,null,null,null,null,null,null,"Photo Description Here",null,null,null,null,null,null,null,null,null,"Photo Description Here",null,null,null,null,null,null,null,"Photo Description Here",null,null,null,null,null,null,null,null,null,"Photo Description Here",null,null,null,null,null,null,null,"Photo Description Here",null,null,null,null,null,null,null,null,null,"Photo Description Here",null,null,null,null,null,null,null,"Photo Description Here"]
[null,null,null,null,null,null,null,null,null,null,null,null,null,null,null,null,null,null,null,null,null,null,null,null,null,null,null,null,null,null,null,null,null,null,null,null,{"$f":"IF(OR(AK111=\"non std c values\",AK112=\"non std c values\",AK113=\"non std c values\"),\"non std c values exist\", \"\")","v":""},null,null,null,{"$f":"IF(OR(AO111=\"non std c values\",AO112=\"non std c values\",AO113=\"non std c values\"),\"non std c values exist\", \"\")","v":""}]
[]
[]
[]
[]
[]
[]
[]
[]
[]
[]
[]
[]
[]
[]
[]
[{"$f":"_xlfn.CONCAT( _xlnm.sheet_title,\" SITE PHOTOS - PAGE 3\")","v":"PSH # OUTLET # SITE PHOTOS - PAGE 3"},null,null,null,null,null,null,null,null,null,null,null,null,null,null,null,null,null,null,null,null,null,null,null,null,null,null,null,null,null,null,null,null,null,null,null,null,null,null,null,null,null,null,null,null,null,null,null,null,null,null,null,null,null,null,null,null,null,null,null,null,null,null,null,null,null,null,null,null,null,null,null,"OUTLET SITE PHOTOS PAGE 3",null,null,null,null,null,null,null,null,null,null,null,null,null,null,null,null,null,"OUTLET SITE PHOTOS PAGE 3",null,null,null,null,null,null,null,null,null,null,null,null,null,null,null,null,null,"OUTLET SITE PHOTOS PAGE 3"]
["Photo Description Here",null,null,null,null,null,null,null,"Photo Description Here",null,null,null,null,null,null,null,null,null,null,null,null,null,null,null,null,null,null,null,null,null,null,null,null,null,null,null,null,null,null,null,null,null,null,null,null,null,null,null,null,null,null,null,null,null,null,null,null,null,null,null,null,null,null,null,null,null,null,null,null,null,null,null,"Photo Description Here",null,null,null,null,null,null,null,"Photo Description Here",null,null,null,null,null,null,null,null,null,"Photo Description Here",null,null,null,null,null,null,null,"Photo Description Here",null,null,null,null,null,null,null,null,null,"Photo Description Here",null,null,null,null,null,null,null,"Photo Description Here"]
[]
[]
[]
[]
[]
[]
[]
[]
[]
[]
[]
[]
[]
[]
[]
["Photo Description Here",null,null,null,null,null,null,null,"Photo Description Here",null,null,null,null,null,null,null,null,null,null,null,null,null,null,null,null,null,null,null,null,null,null,null,null,null,null,null,null,null,null,null,null,null,null,null,null,null,null,null,null,null,null,null,null,null,null,null,null,null,null,null,null,null,null,null,null,null,null,null,null,null,null,null,"Photo Description Here",null,null,null,null,null,null,null,"Photo Description Here",null,null,null,null,null,null,null,null,null,"Photo Description Here",null,null,null,null,null,null,null,"Photo Description Here",null,null,null,null,null,null,null,null,null,"Photo Description Here",null,null,null,null,null,null,null,"Photo Description Here"]
[]
[]
[]
[]
[]
[]
[]
[]
[]
[]
[]
[]
[]
[]
[]
[]
[{"$f":"_xlfn.CONCAT( _xlnm.sheet_title,\" SITE PHOTOS - PAGE 4\")","v":"PSH # OUTLET # SITE PHOTOS - PAGE 4"},null,null,null,null,null,null,null,null,null,null,null,null,null,null,null,null,null,null,null,null,null,null,null,null,null,null,null,null,null,null,null,null,null,null,null,null,null,null,null,null,null,null,null,null,null,null,null,null,null,null,null,null,null,null,null,null,null,null,null,null,null,null,null,null,null,null,null,null,null,null,null,null,null,null,null,null,null,null,null,null,null,null,null,null,null,null,null,null,null,"OUTLET SITE PHOTOS PAGE 4",null,null,null,null,null,null,null,null,null,null,null,null,null,null,null,null,null,"OUTLET SITE PHOTOS PAGE 4"]
["Photo Description Here",null,null,null,null,null,null,null,"Photo Description Here",null,null,null,null,null,null,null,null,null,null,null,null,null,null,null,null,null,null,null,null,null,null,null,null,null,null,null,null,null,null,null,null,null,null,null,null,null,null,null,null,null,null,null,null,null,null,null,null,null,null,null,null,null,null,null,null,null,null,null,null,null,null,null,null,null,null,null,null,null,null,null,null,null,null,null,null,null,null,null,null,null,"Photo Description Here",null,null,null,null,null,null,null,"Photo Description Here",null,null,null,null,null,null,null,null,null,"Photo Description Here",null,null,null,null,null,null,null,"Photo Description Here"]
[]
[]
[]
[]
[]
[]
[]
[]
[]
[]
[]
[]
[]
[]
[]
["Photo Description Here",null,null,null,null,null,null,null,"Photo Description Here",null,null,null,null,null,null,null,null,null,null,null,null,null,null,null,null,null,null,null,null,null,null,null,null,null,null,null,null,null,null,null,null,null,null,null,null,null,null,null,null,null,null,null,null,null,null,null,null,null,null,null,null,null,null,null,null,null,null,null,null,null,null,null,null,null,null,null,null,null,null,null,null,null,null,null,null,null,null,null,null,null,"Photo Description Here",null,null,null,null,null,null,null,"Photo Description Here",null,null,null,null,null,null,null,null,null,"Photo Description Here",null,null,null,null,null,null,null,"Photo Description Here"]
[]
[]
[]
[]
[]
[]
[]
[]
[]
[]
[]
[]
[]
[]
[]
[]
[{"$f":"_xlfn.CONCAT( _xlnm.sheet_title,\" SITE PHOTOS - PAGE 5\")","v":"PSH # OUTLET # SITE PHOTOS - PAGE 5"},null,null,null,null,null,null,null,null,null,null,null,null,null,null,null,null,null,null,null,null,null,null,null,null,null,null,null,null,null,null,null,null,null,null,null,null,null,null,null,null,null,null,null,null,null,null,null,null,null,null,null,null,null,null,null,null,null,null,null,null,null,null,null,null,null,null,null,null,null,null,null,null,null,null,null,null,null,null,null,null,null,null,null,null,null,null,null,null,null,null,null,null,null,null,null,null,null,null,null,null,null,null,null,null,null,null,null,"OUTLET SITE PHOTOS PAGE 5"]
["Photo Description Here",null,null,null,null,null,null,null,"Photo Description Here",null,null,null,null,null,null,null,null,null,null,null,null,null,null,null,null,null,null,null,null,null,null,null,null,null,null,null,null,null,null,null,null,null,null,null,null,null,null,null,null,null,null,null,null,null,null,null,null,null,null,null,null,null,null,null,null,null,null,null,null,null,null,null,null,null,null,null,null,null,null,null,null,null,null,null,null,null,null,null,null,null,null,null,null,null,null,null,null,null,null,null,null,null,null,null,null,null,null,null,"Photo Description Here",null,null,null,null,null,null,null,"Photo Description Here"]
[]
[]
[]
[]
[]
[]
[]
[]
[]
[]
[]
[]
[]
[]
[]
["Photo Description Here",null,null,null,null,null,null,null,"Photo Description Here",null,null,null,null,null,null,null,null,null,null,null,null,null,null,null,null,null,null,null,null,null,null,null,null,null,null,null,null,null,null,null,null,null,null,null,null,null,null,null,null,null,null,null,null,null,null,null,null,null,null,null,null,null,null,null,null,null,null,null,null,null,null,null,null,null,null,null,null,null,null,null,null,null,null,null,null,null,null,null,null,null,null,null,null,null,null,null,null,null,null,null,null,null,null,null,null,null,null,null,"Photo Description Here",null,null,null,null,null,null,null,"Photo Description Here"]
[]
[]
[]
[]
[]
[]
[]
[]
[]
[]
[]
[]
[]
[]
[]
[]
[]
[]
[]
[]
[]
[]
[]
[]
[]
[]
[]
[]
[]
[null,null,null,null,null,null,null,null,null,null,null,null,null,null,null,null,null,null,null,null,null,null,null,null,null,null,null,null,null,null,null,null,null,null,"τ10 Post = "]
[]
[]
[]
["ROWS HOLDING CELL DATA BELOW TO BE HIDDEN (CELLS HOLD DATA+FORMATTING FOR MACROS AND CALCULATIONS)"]
[]
[]
["hidden formatting for triangular / trapezoidal macros DO NOT TOUCH",null,null,null,null,null,null,null,"hidden formatting for triangular / trapezoidal macros DO NOT TOUCH"]
["Depth (ft) =",null,null,null,"H:V (Lt) = ",null,null,null,"Depth (ft) =",null,"H:V (Lt) ="]
["Slope (ft/ft) = ",null,null,null,"H:V (Rt) = ",null,null,null,"Slope (ft/ft) = ",null,"H:V (Rt) ="]
["Manning's N =",null,null,null,"Base Width (ft.) =",0,null,null,"Manning's N =",null,"Base Width ="]
["Notes (lining, condition, etc.): ",null,null,null,null,null,null,null,"Notes (lining, condition, etc.): "]
[]
[]
[]
[]
[]
["hidden formatting for irregular channel macro DO NOT TOUCH",null,null,null,null,null,null,null,"hidden formatting for irregular channel macro DO NOT TOUCH"]
[]
[{"$f":"IF(AND($J$30<>\"\",Post_Const_Geometry_Selection=\"Geometry Same as Pre-Construction\"),\"Slope (ft/ft) = \",\"\")","v":""},null,null,null,null,null,null,null,{"$f":"IF($J$30<>\"\",\"Slope (ft/ft) = \",\"\")","v":""}]
["Notes:",null,null,null,null,null,null,null,"Notes:"]
[]
[]
[]
[]
[]
["hidden formatting for pipe macros DO NOT TOUCH",null,null,null,null,null,null,null,"hidden formatting for pipe macros DO NOT TOUCH",null,null,null,null,null,null,null,null,null,null,"hidden formatting for blank DO NOT TOUCH"]
["Diameter (in) =",null,null,null,"QCapacity (cfs) =",{"$f":"IF(OR(B273=\"\",B274=\"\"),\"\",IFERROR(MIN((SQRT(B274)/D275)*((B273/16)^(8/3)),VLOOKUP(B273,'PICK LISTS'!$E$44:$F$54,2,FALSE)),(SQRT(B274)/D275)*((B273/16)^(8/3))))","v":""},null,null,"Diameter (in) =",null,null,"QCapacity (cfs) = ",null,{"$f":"IF(OR(J273=\"\",J274=\"\"),\"\",IFERROR(MIN((SQRT(J274)/K275)*((J273/16)^(8/3)),VLOOKUP(J273,'PICK LISTS'!$E$44:$F$54,2,FALSE)),(SQRT(J274)/K275)*((J273/16)^(8/3))))","v":""},{"$f":"IF(OR(N273=\"\",N274=\"\"),\"\",IF(N274>N273,\"NOTE: Q10 > Qfull\",\"Q10 < Qfull\"))","v":""},null,null,null,null,"Notes:"]
["Slope (ft/ft) = ",null,null,null,"Q10pre (cfs) =",{"$f":"$E$16","v":0},null,null,"Slope (ft/ft) = ",null,null,"Q10 Post (cfs) = ",null,{"$f":"$K$16","v":0}]
["Pipe Material =","RCP",null,{"$f":"VLOOKUP(B275,'PICK LISTS'!$E$29:$F$33, 2, FALSE)","v":1.2E-2},null,null,null,null,"Pipe Material =","RCP",{"$f":"VLOOKUP(J275,'PICK LISTS'!$E$29:$F$33, 2, FALSE)","v":1.2E-2}]
["Notes:",null,null,null,null,null,null,null,"Notes:"]
[]
[]
[]
[]
[null,null,null,null,null,null,null,null,"hidden formatting for same as pre const. ds rec pipe macro DO NOT TOUCH"]
[]
[null,null,null,null,null,null,null,null,null,null,"Qfull (cfs) = ",{"$f":"F282","v":0},null,{"$f":"IF(OR(L283=\"\",L284=\"\"),\"\",IF(L284>L283,\"NOTE: Q10 > Qfull\",\"Q10 < Qfull\"))","v":""}]
[null,null,null,null,null,null,null,null,null,null,"Q10 Post (cfs) = ",{"$f":"IF($K$16=0,\"\",$K$16)","v":""}]
[]
[]
[]
[]
[]
[]
[]
["SOIL TYPE"]
[]
["LINER TYPE"]
[]
[]
[]
[null,{"$f":"IF($I$30=\"N/A\",\"N/A\",IF(Soil_Type=\"Permanent Matting Product (stable)\",\"User to Define\",IF($J$30<>\"\",\"N/A\",IF($I$30=\"Soil\",$AD$41,IF($I$30=\"Non-Soil\",$AD$43,\"\")))))","v":""}]
[null,{"$f":"IF($A$34=\"SOIL TYPE\",\"N/A\",IF(Soil_Type=\"Grass / Dense Veg. (no bare soil spots)\",\"N/A\",IF($J$30<>\"\",$AD$43,\"\")))","v":""}]

{"sheet":"Hidden Summary","index":8,"n_rows":3,"n_cols":28,"rows_kept":3,"cut":false,"hidden":true,"merged":[]}
["outlet","lat","long","loation of analysis","align sta offset","UID Num","hydr method","hyd region (if applicable)","DA total pre","DA total post","TOC pre","TOC post","C pre","C post","geom pre","geom post","q10 pre","q10 post","v10 pre","v10 post","d10 pre","d10 post","Liner/ Soil Type","n val pre","n val post","total % imp pre","total % imp post","case type"]
["PSH 4 OUTLET 2",56.332999999999998,23.332999999999998,"INSIDE R/W","Input Alignment, Station, Offset Here","OA-R-5999-4-2","Rational Method",0,29.92,20.745000000000001,10,10,0.37393048128342199,0.43473608098336902,"Trapezoidal","Triangular",57.506319999999981,46.355603999999992,6.077142386843625,6.5654702128768294,1.7318962141558072,1.8788982800302585,"Select Liner Type Above To Generate List",3.4000000000000002E-2,3.5000000000000003E-2,0.24944903074866309,0.28706067968185101]
["PSH 78 OUTLET 9",0,0,"AT R/W","Input Alignment, Station, Offset Here","OA-R-5999-78-9","TR-55 Method",0,null,null,null,null,null,null,null,null,0,0,0,0,0,0,"Select Liner Type Above To Generate List",0,0,0,0]

{"sheet":"pct imp equation","index":9,"n_rows":45,"n_cols":23,"rows_kept":45,"cut":false,"hidden":true,"merged":[]}
[]
[null,"C=.70",null,null,null,null,null,"C=.5",null,null,null,null,null,null,"C=.65",null,null,null,null,"C=.45"]
[]
[null,"test1",null,null,null,null,null,"test1",null,null,null,null,null,null,"test1",null,null,null,null,"test1"]
[null,"sub imp",3.56,null,null,null,null,"sub imp",45.34,null,null,null,null,null,"sub imp",56.4,null,null,null,"sub imp",0.34566999999999998]
[null,"sub grass",1.7790561797752711,null,null,null,null,"sub grass",90.648828764178788,null,null,null,null,null,"sub grass",40.257643811129824,null,null,null,"sub grass",1.0359158295024464]
[null,"composite c",{"$f":"((C5*0.9)+(C6*0.3))/(C5+C6)","v":0.70007071064195237},null,null,null,null,"composite c",{"$f":"((I5*0.9)+(I6*0.3))/(I5+I6)","v":0.5000458438183556},null,null,null,null,null,"composite c",{"$f":"((P5*0.9)+(P6*0.3))/(P5+P6)","v":0.65010164396437975},null,null,null,"composite c",{"$f":"((U5*0.9)+(U6*0.3))/(U5+U6)","v":0.45011879506225982}]
[null,"% impervious",{"$f":"C5/(C6+C5)*100","v":66.678451773658722},null,null,null,null,"% impervious",{"$f":"I5/(I6+I5)*100","v":33.340973969725923},null,null,null,null,null,"% impervious",{"$f":"P5/(P6+P5)*100","v":58.350273994063286},null,null,null,"% impervious",{"$f":"U5/(U6+U5)*100","v":25.019799177043307}]
[]
[]
[null,"test2",null,null,null,null,null,"test2",null,null,null,null,null,null,"test2",null,null,null,null,"test2"]
[null,"sub imp",113.63943915781363,null,null,null,null,"sub imp",0.7267739864801902,null,null,null,null,null,"sub imp",3.2813312763720317,null,null,null,"sub imp",115.20938736077896]
[null,"sub grass",56.89,null,null,null,null,"sub grass",1.456,null,null,null,null,null,"sub grass",2.3450000000000002,null,null,null,"sub grass",345.78]
[null,"composite c",{"$f":"((C12*0.9)+(C13*0.3))/(C12+C13)","v":0.69983514771070554},null,null,null,null,"composite c",{"$f":"((I12*0.9)+(I13*0.3))/(I12+I13)","v":0.49977532927780827},null,null,null,null,null,"composite c",{"$f":"((P12*0.9)+(P13*0.3))/(P12+P13)","v":0.64992585205411846},null,null,null,"composite c",{"$f":"((U12*0.9)+(U13*0.3))/(U12+U13)","v":0.44995059390026343}]
[null,"% impervious",{"$f":"C12/(C13+C12)*100","v":66.639191285117576},null,null,null,null,"% impervious",{"$f":"I12/(I13+I12)*100","v":33.295888212968038},null,null,null,null,null,"% impervious",{"$f":"P12/(P13+P12)*100","v":58.32097534235308},null,null,null,"% impervious",{"$f":"U12/(U13+U12)*100","v":24.991765650043899},null,{"$f":"AVERAGE(U22,U15,U8)","v":25.007039015469957}]
[null,null,null,null,null,null,null,null,null,null,null,{"$f":"AVERAGE(I8,I15,I22,I29)","v":33.323447795331433},null,null,null,null,null,{"$f":"AVERAGE(P8,P15,P22)","v":58.324892070408957}]
[null,null,null,null,{"$f":"AVERAGE(C8,C15,C22,C29)","v":66.689417159103613}]
[null,"test3",null,null,null,null,null,"test3",null,null,null,null,null,null,"test3",null,null,null,null,"test3"]
[null,"sub imp",567,null,null,null,null,"sub imp",2.8479380530720024,null,null,null,null,null,"sub imp",1104.0808011279737,null,null,null,"sub imp",25.62]
[null,"sub grass",281.99259624645316,null,null,null,null,"sub grass",5.7,null,null,null,null,null,"sub grass",789.6,null,null,null,"sub grass",76.820858498080966]
[null,"composite c",{"$f":"((C19*0.9)+(C20*0.3))/(C19+C20)","v":0.70071020819743846},null,null,null,null,"composite c",{"$f":"((I19*0.9)+(I20*0.3))/(I19+I20)","v":0.49990351137712069},null,null,null,null,null,"composite c",{"$f":"((P19*0.9)+(P20*0.3))/(P19+P20)","v":0.649820561248863},null,null,null,"composite c",{"$f":"((U19*0.9)+(U20*0.3))/(U19+U20)","v":0.45005731331593596}]
[null,"% impervious",{"$f":"C19/(C20+C19)*100","v":66.78503469957306},null,null,null,null,"% impervious",{"$f":"I19/(I20+I19)*100","v":33.317251896186775},null,null,null,null,null,"% impervious",{"$f":"P19/(P20+P19)*100","v":58.303426874810491},null,null,null,"% impervious",{"$f":"U19/(U20+U19)*100","v":25.009552219322668}]
[]
[]
[null,"test 4",null,null,null,null,null,"test 4",null,null,null,null,null,null,"test 4"]
[null,"sub imp",78.456000000000003,null,null,null,null,"sub imp",5.4560000000000004,null,null,null,null,null,"sub imp"]
[null,"sub grass",39.24861441292974,null,null,null,null,"sub grass",10.908885548336283,null,null,null,null,null,"sub grass"]
[null,"composite c",{"$f":"((C26*0.9)+(C27*0.3))/(C26+C27)","v":0.69992994526839047},null,null,null,null,"composite c",{"$f":"((I26*0.9)+(I27*0.3))/(I26+I27)","v":0.50003806261466999},null,null,null,null,null,"composite c",{"$f":"((P26*0.9)+(P27*0.3))/(P26+P27)","v":{"$error":"#DIV/0!"}}]
[null,"% impervious",{"$f":"C26/(C27+C26)*100","v":66.654990878065092},null,null,null,null,"% impervious",{"$f":"I26/(I27+I26)*100","v":33.339677102444988},null,null,null,null,null,"% impervious",{"$f":"P26/(P27+P26)*100","v":{"$error":"#DIV/0!"}}]
[]
[]
[]
[]
[null,null,null,null,null,null,null,null,"ratio of c value to % impervious"]
[null,null,null,null,null,null,null,0.45,{"$f":"W15/100","v":0.25007039015469956}]
[null,null,null,null,null,null,null,0.5,{"$f":"L16/100","v":0.33323447795331435}]
[null,null,null,null,null,null,null,0.65,{"$f":"R16/100","v":0.58324892070408962}]
[null,null,null,null,null,null,null,0.7,{"$f":"E17/100","v":0.66689417159103614}]
[]
[null,null,null,null,null,null,null,null,"c","area"]
[null,null,null,null,null,null,null,{"$f":"166.72*I41-50.025","v":66.679000000000002},0.7,56]
[]
[]
[null,null,null,null,null,null,null,"calc'd imp area",null,{"$f":"H41/100*J41","v":37.340240000000001}]
[null,null,null,null,null,null,null,"calc'd grass area",null,{"$f":"J41-J44","v":18.659759999999999}]

{"sheet":"PICK LISTS","index":10,"n_rows":101,"n_cols":10,"rows_kept":101,"cut":false,"hidden":true,"merged":[]}
["COUNTIES",null,"HYDROLOGY METHOD",null,"SOIL TYPE","Max Velocity For Soil Type",null,"EXIST CHANNEL GEOMETRY OPTIONS",null,"PROP CHANNEL GEOMETRY OPTIONS"]
["ALAMANCE",null,"RATIONAL",null,null,null,null,null,null,"Geometry Same as Pre-Construction"]
["ALEXANDER",null,"TR-55",null,"Coarse sand, sand, fine sand, loamy sand",2.5,null,"Triangular",null,"Triangular"]
["ALLEGHANY",null,"USGS-5030",null,"Sandy loam",2.5,null,"Trapezoidal",null,"Trapezoidal"]
["ANSON",null,"USGS-5158",null,"Silt loam",3,null,"Irregular",null,"Irregular"]
["ASHE",null,"USER INPUT",null,"Loam, clay loam, silty clay loam, sandy clay loam",3.5,null,"Downstream Receiving Pipe",null,"Downstream Receiving Pipe"]
["AVERY",null,null,null,"Silt",3.5,null,"Other (User Specified i.e. Flat Ground, Pond, etc.)",null,"Other (User Specified i.e. Flat Ground, Pond, etc.)"]
["BEAUFORT",null,null,null,"Fine Gravel 2 – 5 mm in size",5]
["BERTIE",null,null,null,"Sandy clay, silty clay, clay, weathered bedrock",5]
["BLADEN",null,null,null,"Cobbles are 76 to 250 mm in size",5]
["BRUNSWICK",null,null,null,"Cobbles are up to 250 mm in size",5.5]
["BUNCOMBE",null,null,null,"Cobbles are 76 to 250 mm in size",5.5]
["BURKE",null,null,null,"Coarse Gravel 20 – 76 mm in size",6]
["CABARRUS",null,null,null,"N/A (Pipe System or Non-Channel)"]
["CALDWELL"]
["CAMDEN"]
["CARTERET",null,null,null,null,null,null,"LINER TYPE","Max Velocity or Shear"]
["CASWELL",null,null,null,"ANALYSIS POINT",null,null,"Grass / Dense Veg. (no bare soil spots)",4.5]
["CATAWBA",null,null,null,"WITHIN R/W",null,null,"CL-A Riprap (d50 = 4 in.)",1.6]
["CHATHAM",null,null,null,"AT R/W",null,null,"CL-B Riprap (d50 = 8 in.)",3.2]
["CHEROKEE",null,null,null,"DOWNSTREAM PAST R/W",null,null,"CL-I Riprap (d50 = 10 in.)",4]
["CHOWAN",null,null,null,null,null,null,"CL-II Riprap (d50 = 12 in.)",4.8]
["CLAY",null,null,null,null,null,null,"Permanent Matting Product (stable)","User to Define"]
["CLEVELAND",null,null,null,null,null,null,"N/A (Pipe System or Non-Channel)"]
["COLUMBUS"]
["CRAVEN"]
["CUMBERLAND"]
["CURRITUCK",null,null,null,"PIPE MATERIAL","MANN_N",null,null,"PHOTO PGS"]
["DARE",null,null,null,"RCP",1.2E-2,null,null,1]
["DAVIDSON",null,null,null,"CMP",2.4E-2,null,null,2]
["DAVIE",null,null,null,"CSP",2.4E-2,null,null,3]
["DUPLIN",null,null,null,"HDPE",1.2E-2,null,null,4]
["DURHAM",null,null,null,"Smooth",1.0999999999999999E-2,null,null,5]
["EDGECOMBE"]
["FORSYTH"]
["FRANKLIN"]
["GASTON",null,null,null,"Soil vs non Soil"]
["GATES",null,null,null,"Soil"]
["GRAHAM",null,null,null,"Non-Soil"]
["GRANVILLE",null,null,null,"N/A"]
["GREENE"]
["GUILFORD"]
["HALIFAX",null,null,null,"PIPE SIZE","MAX CAPACITY "]
["HARNETT",null,null,null,12,6]
["HAYWOOD",null,null,null,15,9]
["HENDERSON",null,null,null,18,13]
["HERTFORD",null,null,null,24,25]
["HOKE",null,null,null,30,43]
["HYDE",null,null,null,36,64]
["IREDELL",null,null,null,42,90]
["JACKSON",null,null,null,48,120]
["JOHNSTON",null,null,null,54,160]
["JONES",null,null,null,60,200]
["LEE",null,null,null,66,250]
["LENOIR"]
["LINCOLN"]
["MACON"]
["MADISON"]
["MARTIN"]
["McDOWELL"]
["MECKLENBURG"]
["MITCHELL"]
["MONTGOMERY"]
["MOORE"]
["NASH"]
["NEW HANOVER"]
["NORTHAMPTON"]
["ONSLOW"]
["ORANGE"]
["PAMLICO"]
["PASQUOTANK"]
["PENDER"]
["PERSON"]
["PITT"]
["POLK"]
["PREQUIMANS"]
["RANDOLPH"]
["RICHMOND"]
["ROBESON"]
["ROCKINGHAM"]
["ROWAN"]
["RUTHERFORD"]
["SAMPSON"]
["SCOTLAND"]
["STANLY"]
["STOKES"]
["SURRY"]
["SWAIN"]
["TRANSYLVANIA"]
["TYRRELL"]
["UNION"]
["VANCE"]
["WAKE"]
["WARREN"]
["WASHINGTON"]
["WATAUGA"]
["WAYNE"]
["WILKES"]
["WILSON"]
["YADKIN"]
["YANCEY"]

{"sheet":"Combined","index":11,"n_rows":607,"n_cols":7,"rows_kept":607,"cut":false,"hidden":true,"merged":[]}
["ALAMANCE"]
[null,2,5,10,25,50,100]
[5,5.59,6.49,7.08,7.72,8.09,8.42]
[10,4.46,5.2,5.66,6.14,6.44,6.7]
[15,3.74,4.38,4.7699999999999996,5.19,5.44,5.64]
[30,2.59,3.11,3.46,3.85,4.0999999999999996,4.32]
[60,1.62,2,2.25,2.56,2.78,2.98]
["ALEXANDER"]
[5,5.22,6.17,6.9,7.8,8.48,9.16]
[10,4.17,4.9400000000000004,5.51,6.22,6.75,7.27]
[15,3.5,4.16,4.6500000000000004,5.26,5.7,6.13]
[30,2.41,2.96,3.37,3.89,4.29,4.6900000000000004]
[60,1.52,1.9,2.19,2.59,2.91,3.23]
["ALLEGHANY"]
[5,5.09,6.02,6.77,7.78,8.56,9.3699999999999992]
[10,4.07,4.82,5.42,6.2,6.81,7.45]
[15,3.41,4.07,4.57,5.24,5.75,6.28]
[30,2.35,2.89,3.31,3.88,4.33,4.8099999999999996]
[60,1.48,1.85,2.15,2.58,2.93,3.31]
["ANSON"]
[5,5.59,6.49,7.08,7.72,8.09,8.42]
[10,4.46,5.2,5.66,6.14,6.44,6.7]
[15,3.74,4.38,4.7699999999999996,5.19,5.44,5.64]
[30,2.59,3.11,3.46,3.85,4.0999999999999996,4.32]
[60,1.62,2,2.25,2.56,2.78,2.98]
["ASHE"]
[5,4.8499999999999996,5.71,6.42,7.39,8.15,8.9499999999999993]
[10,3.88,4.57,5.14,5.89,6.49,7.12]
[15,3.25,3.85,4.33,4.9800000000000004,5.48,6]
[30,2.2400000000000002,2.74,3.14,3.68,4.13,4.59]
[60,1.41,1.76,2.04,2.4500000000000002,2.8,3.16]
["AVERY"]
[5,5.69,6.65,7.42,8.4600000000000009,9.25,10.1]
[10,4.54,5.32,5.93,6.74,7.37,8.01]
[15,3.81,4.49,5,5.69,6.22,6.75]
[30,2.63,3.19,3.62,4.22,4.68,5.17]
[60,1.65,2.04,2.36,2.81,3.17,3.56]
["BEAUFORT"]
[5,6.34,7.25,8.23,9.3000000000000007,10.199999999999999,11.1]
[10,5.0599999999999996,5.8,6.58,7.4,8.1199999999999992,8.7799999999999994]
[15,4.24,4.9000000000000004,5.55,6.26,6.86,7.4]
[30,2.93,3.48,4.0199999999999996,4.6399999999999997,5.16,5.66]
[60,1.84,2.23,2.62,3.09,3.5,3.9]
["BERTIE"]
[5,5.98,6.73,7.74,8.7200000000000006,9.61,10.4]
[10,4.78,5.39,6.19,6.95,7.66,8.27]
[15,4,4.55,5.22,5.88,6.46,6.97]
[30,2.76,3.23,3.78,4.3499999999999996,4.87,5.34]
[60,1.73,2.0699999999999998,2.46,2.9,3.3,3.68]
["BLADEN"]
[5,6.35,7.44,8.2799999999999994,9.34,10.1,10.9]
[10,5.08,5.95,6.62,7.43,8.06,8.68]
[15,4.25,5.0199999999999996,5.58,6.28,6.81,7.32]
[30,2.94,3.57,4.04,4.6500000000000004,5.13,5.6]
[60,1.84,2.29,2.63,3.1,3.47,3.86]
["BRUNSWICK"]
[5,7.36,8.5299999999999994,9.5399999999999991,10.8,11.7,12.6]
[10,5.88,6.83,7.63,8.56,9.31,10]
[15,4.93,5.76,6.43,7.24,7.86,8.4600000000000009]
[30,3.4,4.09,4.66,5.36,5.92,6.48]
[60,2.14,2.62,3.03,3.57,4.01,4.46]
["BUNCOMBE"]
[5,4.76,5.74,6.47,7.44,8.17,8.9]
[10,3.82,4.5999999999999996,5.17,5.93,6.5,7.07]
[15,3.2,3.87,4.3600000000000003,5.01,5.49,5.96]
[30,2.21,2.75,3.16,3.71,4.1399999999999997,4.5599999999999996]
[60,1.39,1.76,2.06,2.4700000000000002,2.8,3.14]
["BURKE"]
[5,5.29,6.29,7.06,8.0500000000000007,8.8000000000000007,9.5500000000000007]
[10,4.2300000000000004,5.03,5.65,6.41,7.01,7.59]
[15,3.55,4.24,4.76,5.42,5.91,6.4]
[30,2.4500000000000002,3.02,3.45,4.01,4.45,4.9000000000000004]
[60,1.54,1.93,2.25,2.67,3.02,3.37]
["CABARRUS"]
[5,5.7,6.64,7.3,8.0299999999999994,8.5299999999999994,8.99]
[10,4.55,5.31,5.83,6.4,6.8,7.14]
[15,3.82,4.4800000000000004,4.92,5.41,5.74,6.02]
[30,2.64,3.18,3.56,4.01,4.32,4.6100000000000003]
[60,1.65,2.04,2.3199999999999998,2.67,2.93,3.17]
["CALDWELL"]
[5,5.12,6.07,6.83,7.81,8.56,9.32]
[10,4.0999999999999996,4.87,5.46,6.22,6.81,7.41]
[15,3.44,4.0999999999999996,4.6100000000000003,5.26,5.75,6.24]
[30,2.37,2.91,3.34,3.89,4.33,4.78]
[60,1.49,1.87,2.17,2.59,2.93,3.29]
["CAMDEN"]
[5,6.11,7,7.96,8.98,9.84,10.6]
[10,4.88,5.6,6.36,7.15,7.83,8.4600000000000009]
[15,4.0999999999999996,4.72,5.36,6.04,6.61,7.13]
[30,2.83,3.36,3.88,4.47,4.9800000000000004,5.46]
[60,1.77,2.15,2.5299999999999998,2.98,3.37,3.76]
["CARTERET"]
[5,6.9,7.96,8.9600000000000009,10.1,11.1,12]
[10,5.51,6.37,7.16,8.0500000000000007,8.8000000000000007,9.5]
[15,4.62,5.37,6.04,6.8,7.43,8]
[30,3.19,3.82,4.38,5.04,5.59,6.13]
[60,2,2.4500000000000002,2.85,3.36,3.79,4.22]
["CASWELL"]
[5,5.36,6.29,6.92,7.66,8.1199999999999992,8.57]
[10,4.28,5.03,5.53,6.1,6.47,6.81]
[15,3.59,4.24,4.67,5.15,5.46,5.74]
[30,2.48,3.02,3.38,3.82,4.1100000000000003,4.4000000000000004]
[60,1.56,1.93,2.2000000000000002,2.54,2.79,3.03]
["CATAWBA"]
[5,5.29,6.25,6.96,7.82,8.4499999999999993,9.0500000000000007]
[10,4.24,5,5.56,6.23,6.73,7.19]
[15,3.55,4.22,4.6900000000000004,5.26,5.68,6.06]
[30,2.4500000000000002,3,3.4,3.9,4.2699999999999996,4.6399999999999997]
[60,1.54,1.92,2.21,2.6,2.9,3.2]
["CHATHAM"]
[5,5.98,6.94,7.6,8.33,8.82,9.26]
[10,4.78,5.55,6.07,6.64,7.02,7.36]
[15,4.01,4.68,5.12,5.61,5.93,6.2]
[30,2.77,3.32,3.71,4.1500000000000004,4.46,4.75]
[60,1.74,2.13,2.42,2.77,3.02,3.27]
["CHEROKEE"]
[5,4.8600000000000003,5.62,6.58,7.56,8.4700000000000006,9.31]
[10,3.88,4.5,5.26,6.02,6.75,7.4]
[15,3.26,3.8,4.43,5.09,5.7,6.24]
[30,2.25,2.7,3.21,3.77,4.29,4.78]
[60,1.41,1.73,2.09,2.5099999999999998,2.91,3.29]
["CHOWAN"]
[5,6.12,6.95,7.94,8.9499999999999993,9.85,10.7]
[10,4.9000000000000004,5.56,6.35,7.13,7.84,8.48]
[15,4.0999999999999996,4.6900000000000004,5.36,6.03,6.62,7.14]
[30,2.83,3.33,3.88,4.47,4.9800000000000004,5.47]
[60,1.78,2.14,2.5299999999999998,2.97,3.38,3.77]
["CLAY"]
[5,4.9000000000000004,5.63,6.62,7.61,8.57,9.42]
[10,3.92,4.51,5.3,6.06,6.82,7.49]
[15,3.28,3.8,4.47,5.12,5.76,6.31]
[30,2.27,2.7,3.24,3.79,4.34,4.83]
[60,1.42,1.73,2.11,2.5299999999999998,2.94,3.33]
["CLEVELAND"]
[5,5.64,6.65,7.43,8.4,9.1199999999999992,9.85]
[10,4.51,5.32,5.94,6.69,7.27,7.82]
[15,3.78,4.49,5.01,5.66,6.13,6.6]
[30,2.61,3.19,3.63,4.1900000000000004,4.62,5.05]
[60,1.64,2.04,2.36,2.79,3.13,3.48]
["COLUMBUS"]
[5,6.55,7.64,8.5299999999999994,9.6199999999999992,10.5,11.3]
[10,5.24,6.11,6.82,7.67,8.32,8.9600000000000009]
[15,4.3899999999999997,5.16,5.75,6.48,7.03,7.55]
[30,3.03,3.66,4.17,4.8,5.29,5.78]
[60,1.9,2.35,2.71,3.19,3.59,3.98]
["CRAVEN"]
[5,6.73,7.73,8.75,9.86,10.8,11.7]
[10,5.38,6.19,6.99,7.86,8.61,9.3000000000000007]
[15,4.51,5.22,5.9,6.64,7.26,7.84]
[30,3.12,3.71,4.2699999999999996,4.92,5.47,6]
[60,1.96,2.38,2.78,3.28,3.71,4.13]
["CUMBERLAND"]
[5,6.11,7.15,7.93,8.9,9.6199999999999992,10.3]
[10,4.88,5.72,6.34,7.1,7.66,8.1999999999999993]
[15,4.0999999999999996,4.83,5.35,6,6.47,6.91]
[30,2.83,3.43,3.88,4.4400000000000004,4.87,5.29]
[60,1.77,2.2000000000000002,2.52,2.96,3.3,3.65]
["CURRITUCK"]
[5,6.12,6.9,7.94,8.94,9.86,10.7]
[10,4.9000000000000004,5.53,6.35,7.13,7.85,8.49]
[15,4.0999999999999996,4.66,5.36,6.02,6.63,7.15]
[30,2.83,3.31,3.88,4.46,4.99,5.48]
[60,1.78,2.12,2.5299999999999998,2.97,3.38,3.77]
["DARE"]
[5,6.46,7.31,8.3800000000000008,9.43,10.4,11.2]
[10,5.17,5.85,6.7,7.51,8.27,8.94]
[15,4.33,4.93,5.65,6.35,6.98,7.53]
[30,2.99,3.5,4.09,4.7,5.26,5.77]
[60,1.88,2.25,2.66,3.13,3.56,3.97]
["DAVIDSON"]
[5,5.51,6.41,7,7.62,8,8.33]
[10,4.4000000000000004,5.13,5.59,6.07,6.37,6.62]
[15,3.69,4.32,4.72,5.13,5.38,5.58]
[30,2.5499999999999998,3.07,3.42,3.8,4.05,4.2699999999999996]
[60,1.6,1.97,2.23,2.5299999999999998,2.75,2.94]
["DAVIE"]
[5,5.26,6.17,6.82,7.56,8.06,8.52]
[10,4.21,4.9400000000000004,5.45,6.02,6.42,6.77]
[15,3.52,4.17,4.5999999999999996,5.09,5.42,5.7]
[30,2.4300000000000002,2.96,3.33,3.77,4.08,4.37]
[60,1.53,1.9,2.17,2.5099999999999998,2.77,3.01]
["DUPLIN"]
[5,6.42,7.45,8.35,9.41,10.199999999999999,11]
[10,5.14,5.97,6.67,7.49,8.14,8.77]
[15,4.3,5.04,5.63,6.33,6.87,7.39]
[30,2.97,3.58,4.08,4.6900000000000004,5.17,5.66]
[60,1.87,2.29,2.66,3.12,3.51,3.9]
["DURHAM"]
[5,5.69,6.5,7.24,7.97,8.51,8.99]
[10,4.54,5.21,5.78,6.35,6.77,7.14]
[15,3.81,4.3899999999999997,4.88,5.36,5.72,6.02]
[30,2.63,3.12,3.53,3.97,4.3099999999999996,4.6100000000000003]
[60,1.65,2,2.2999999999999998,2.64,2.92,3.17]
["EDGECOMBE"]
[5,5.68,6.42,7.33,8.23,9.0399999999999991,9.74]
[10,4.54,5.14,5.86,6.56,7.19,7.75]
[15,3.8,4.34,4.9400000000000004,5.55,6.07,6.53]
[30,2.63,3.08,3.58,4.1100000000000003,4.57,5]
[60,1.65,1.97,2.33,2.74,3.1,3.44]
["FORSYTH"]
[5,5.33,6.24,6.88,7.6,8.08,8.51]
[10,4.26,5,5.5,6.05,6.43,6.76]
[15,3.57,4.22,4.6399999999999997,5.12,5.43,5.7]
[30,2.46,3,3.36,3.79,4.09,4.3600000000000003]
[60,1.55,1.92,2.19,2.52,2.77,3]
["FRANKLIN"]
[5,5.65,6.37,7.24,8.06,8.76,9.3699999999999992]
[10,4.5199999999999996,5.1100000000000003,5.79,6.43,6.98,7.45]
[15,3.78,4.3099999999999996,4.88,5.43,5.89,6.28]
[30,2.61,3.06,3.54,4.0199999999999996,4.43,4.8099999999999996]
[60,1.64,1.96,2.2999999999999998,2.68,3,3.31]
["GASTON"]
[5,5.58,6.53,7.24,8.08,8.68,9.24]
[10,4.46,5.23,5.79,6.43,6.91,7.34]
[15,3.74,4.41,4.88,5.44,5.83,6.19]
[30,2.58,3.13,3.54,4.03,4.3899999999999997,4.74]
[60,1.62,2.0099999999999998,2.2999999999999998,2.68,2.98,3.26]
["GATES"]
[5,6.25,7.18,8.11,9.17,10,10.8]
[10,5,5.75,6.49,7.3,7.98,8.6199999999999992]
[15,4.1900000000000004,4.8499999999999996,5.47,6.17,6.74,7.26]
[30,2.89,3.44,3.96,4.57,5.07,5.56]
[60,1.81,2.21,2.58,3.04,3.44,3.83]
["GRAHAM"]
[5,5,5.65,6.71,7.69,8.7200000000000006,9.6199999999999992]
[10,4,4.5199999999999996,5.36,6.13,6.95,7.65]
[15,3.35,3.82,4.5199999999999996,5.18,5.86,6.45]
[30,2.31,2.71,3.28,3.84,4.41,4.9400000000000004]
[60,1.45,1.74,2.13,2.56,2.99,3.4]
["GRANVILLE"]
[5,5.5,6.29,7.07,7.85,8.4600000000000009,9]
[10,4.3899999999999997,5.03,5.65,6.25,6.73,7.16]
[15,3.68,4.25,4.76,5.28,5.68,6.03]
[30,2.54,3.02,3.45,3.91,4.28,4.62]
[60,1.6,1.93,2.25,2.61,2.9,3.18]
["GREENE"]
[5,6.14,7.02,7.93,8.92,9.73,10.5]
[10,4.91,5.62,6.34,7.1,7.75,8.35]
[15,4.12,4.74,5.35,6,6.54,7.03]
[30,2.84,3.37,3.87,4.45,4.93,5.39]
[60,1.78,2.16,2.52,2.96,3.34,3.71]
["GUILFORD"]
[5,5.45,6.35,6.95,7.6,8,8.34]
[10,4.3600000000000003,5.09,5.56,6.05,6.37,6.63]
[15,3.65,4.29,4.68,5.12,5.38,5.59]
[30,2.52,3.05,3.39,3.79,4.05,4.28]
[60,1.58,1.95,2.21,2.52,2.74,2.95]
["HALIFAX"]
[5,5.57,6.32,7.22,8.1199999999999992,8.89,9.6]
[10,4.45,5.0599999999999996,5.77,6.47,7.09,7.63]
[15,3.73,4.2699999999999996,4.87,5.47,5.98,6.42]
[30,2.58,3.03,3.53,4.05,4.5,4.92]
[60,1.62,1.94,2.2999999999999998,2.7,3.05,3.39]
["HARNETT"]
[5,6.1,7.06,7.82,8.69,9.32,9.92]
[10,4.87,5.65,6.25,6.92,7.43,7.89]
[15,4.08,4.7699999999999996,5.28,5.85,6.27,6.65]
[30,2.82,3.39,3.82,4.33,4.72,5.09]
[60,1.77,2.17,2.4900000000000002,2.89,3.2,3.51]
["HAYWOOD"]
[5,4.76,5.71,6.48,7.45,8.1999999999999993,8.94]
[10,3.8,4.57,5.18,5.93,6.53,7.1]
[15,3.19,3.85,4.37,5.0199999999999996,5.51,5.99]
[30,2.2000000000000002,2.74,3.17,3.71,4.1500000000000004,4.59]
[60,1.38,1.76,2.06,2.4700000000000002,2.81,3.16]
["HENDERSON"]
[5,5.41,6.46,7.26,8.32,9.11,9.91]
[10,4.33,5.17,5.81,6.62,7.25,7.88]
[15,3.62,4.3600000000000003,4.9000000000000004,5.6,6.12,6.64]
[30,2.5,3.1,3.55,4.1500000000000004,4.6100000000000003,5.08]
[60,1.57,1.99,2.31,2.76,3.12,3.5]
["HERTFORD"]
[5,5.98,6.82,7.76,8.75,9.6,10.4]
[10,4.78,5.46,6.2,6.97,7.64,8.25]
[15,4,4.5999999999999996,5.23,5.89,6.45,6.95]
[30,2.77,3.27,3.79,4.3600000000000003,4.8600000000000003,5.32]
[60,1.74,2.1,2.4700000000000002,2.9,3.29,3.67]
["HOKE"]
[5,6.18,7.21,7.98,8.89,9.56,10.199999999999999]
[10,4.9400000000000004,5.77,6.38,7.09,7.61,8.1]
[15,4.1399999999999997,4.87,5.38,5.99,6.42,6.82]
[30,2.86,3.46,3.9,4.4400000000000004,4.84,5.23]
[60,1.8,2.2200000000000002,2.54,2.95,3.28,3.6]
["HYDE"]
[5,6.44,6.95,8.24,9.25,10.4,11.2]
[10,5.15,5.56,6.59,7.37,8.24,8.92]
[15,4.32,4.6900000000000004,5.56,6.23,6.96,7.51]
[30,2.98,3.33,4.03,4.6100000000000003,5.24,5.75]
[60,1.87,2.14,2.62,3.07,3.55,3.96]
["IREDELL"]
[5,5.32,6.24,6.91,7.7,8.26,8.77]
[10,4.25,4.99,5.53,6.13,6.57,6.97]
[15,3.56,4.21,4.66,5.18,5.55,5.88]
[30,2.46,2.99,3.37,3.84,4.18,4.5]
[60,1.54,1.92,2.2000000000000002,2.56,2.83,3.1]
["JACKSON"]
[5,5.17,6.08,6.96,7.96,8.8000000000000007,9.61]
[10,4.13,4.87,5.56,6.34,7.01,7.63]
[15,3.46,4.1100000000000003,4.6900000000000004,5.36,5.91,6.43]
[30,2.39,2.92,3.4,3.97,4.45,4.93]
[60,1.5,1.87,2.21,2.64,3.02,3.39]
["JOHNSTON"]
[5,5.94,6.79,7.63,8.52,9.23,9.8800000000000008]
[10,4.75,5.44,6.1,6.79,7.35,7.85]
[15,3.98,4.58,5.15,5.73,6.2,6.62]
[30,2.75,3.26,3.73,4.25,4.67,5.07]
[60,1.73,2.09,2.4300000000000002,2.83,3.17,3.49]
["JONES"]
[5,6.66,7.66,8.65,9.76,10.7,11.5]
[10,5.33,6.13,6.92,7.77,8.5,9.17]
[15,4.46,5.17,5.84,6.57,7.17,7.73]
[30,3.08,3.67,4.2300000000000004,4.8600000000000003,5.4,5.92]
[60,1.94,2.35,2.75,3.24,3.66,4.08]
["LEE"]
[5,6.1,7.07,7.78,8.58,9.1199999999999992,9.64]
[10,4.87,5.66,6.22,6.83,7.27,7.65]
[15,4.08,4.7699999999999996,5.24,5.77,6.13,6.45]
[30,2.82,3.39,3.8,4.28,4.62,4.9400000000000004]
[60,1.77,2.17,2.4700000000000002,2.85,3.13,3.4]
["LENOIR"]
[5,6.43,7.4,8.34,9.3800000000000008,10.199999999999999,11.1]
[10,5.14,5.93,6.67,7.48,8.16,8.8000000000000007]
[15,4.3099999999999996,5,5.62,6.32,6.88,7.41]
[30,2.97,3.55,4.07,4.68,5.19,5.68]
[60,1.87,2.2799999999999998,2.65,3.12,3.51,3.91]
["LINCOLN"]
[5,5.51,6.48,7.19,8.0500000000000007,8.68,9.2799999999999994]
[10,4.41,5.18,5.75,6.42,6.91,7.37]
[15,3.7,4.37,4.8499999999999996,5.42,5.83,6.21]
[30,2.5499999999999998,3.11,3.51,4.0199999999999996,4.3899999999999997,4.76]
[60,1.6,1.99,2.29,2.68,2.98,3.28]
["MACON"]
[5,4.78,5.57,6.49,7.45,8.34,9.14]
[10,3.82,4.46,5.19,5.94,6.64,7.27]
[15,3.2,3.76,4.38,5.0199999999999996,5.6,6.12]
[30,2.21,2.67,3.17,3.72,4.22,4.6900000000000004]
[60,1.39,1.71,2.0699999999999998,2.48,2.86,3.23]
["MADISON"]
[5,4.51,5.44,6.14,7.07,7.76,8.4600000000000009]
[10,3.61,4.3499999999999996,4.91,5.63,6.19,6.73]
[15,3.02,3.67,4.1399999999999997,4.76,5.22,5.67]
[30,2.09,2.61,3,3.53,3.93,4.34]
[60,1.31,1.67,1.96,2.35,2.66,2.99]
["MARTIN"]
[5,6.07,6.9,7.87,8.8699999999999992,9.74,10.5]
[10,4.8600000000000003,5.52,6.29,7.07,7.76,8.3800000000000008]
[15,4.07,4.66,5.31,5.97,6.55,7.06]
[30,2.81,3.31,3.85,4.42,4.93,5.41]
[60,1.76,2.12,2.5,2.95,3.34,3.72]
["McDOWELL"]
[5,5.33,6.36,7.15,8.1999999999999993,8.99,9.7899999999999991]
[10,4.26,5.09,5.72,6.53,7.16,7.78]
[15,3.57,4.29,4.82,5.52,6.04,6.56]
[30,2.4700000000000002,3.05,3.49,4.09,4.55,5.0199999999999996]
[60,1.55,1.96,2.2799999999999998,2.72,3.08,3.46]
["MECKLENBURG"]
[5,5.66,6.59,7.25,8.02,8.5399999999999991,9.02]
[10,4.53,5.27,5.8,6.39,6.81,7.18]
[15,3.8,4.45,4.8899999999999997,5.4,5.75,6.04]
[30,2.62,3.16,3.54,4,4.33,4.63]
[60,1.64,2.0299999999999998,2.31,2.66,2.93,3.19]
["MITCHELL"]
[5,4.97,5.89,6.61,7.56,8.2899999999999991,9.02]
[10,3.97,4.72,5.29,6.02,6.6,7.16]
[15,3.33,3.98,4.46,5.09,5.57,6.04]
[30,2.2999999999999998,2.83,3.23,3.77,4.1900000000000004,4.62]
[60,1.44,1.81,2.1,2.5099999999999998,2.84,3.19]
["MONTGOMERY"]
[5,5.99,6.95,7.62,8.3800000000000008,8.89,9.35]
[10,4.78,5.56,6.09,6.68,7.08,7.43]
[15,4.01,4.6900000000000004,5.14,5.64,5.98,6.26]
[30,2.77,3.33,3.72,4.18,4.5,4.79]
[60,1.74,2.14,2.42,2.78,3.05,3.3]
["MOORE"]
[5,6.25,7.25,7.97,8.77,9.32,9.82]
[10,5,5.81,6.37,6.99,7.42,7.8]
[15,4.1900000000000004,4.9000000000000004,5.37,5.9,6.26,6.57]
[30,2.89,3.48,3.89,4.37,4.72,5.03]
[60,1.82,2.23,2.5299999999999998,2.91,3.2,3.47]
["NASH"]
[5,5.16,5.6,6.64,7.45,8.32,9.01]
[10,4.13,4.49,5.3,5.93,6.62,7.16]
[15,3.46,3.79,4.47,5.0199999999999996,5.59,6.03]
[30,2.39,2.69,3.24,3.71,4.21,4.62]
[60,1.5,1.73,2.11,2.4700000000000002,2.85,3.18]
["NEW HANOVER"]
[5,7.45,8.7200000000000006,9.7200000000000006,11,11.9,12.9]
[10,5.96,6.98,7.78,8.75,9.49,10.199999999999999]
[15,4.99,5.89,6.56,7.39,8.01,8.64]
[30,3.45,4.18,4.75,5.47,6.03,6.61]
[60,2.16,2.68,3.09,3.65,4.09,4.5599999999999996]
["NORTHAMPTON"]
[5,5.63,6.47,7.32,8.26,9.01,9.7200000000000006]
[10,4.5,5.18,5.86,6.58,7.18,7.73]
[15,3.77,4.37,4.9400000000000004,5.56,6.06,6.51]
[30,2.6,3.1,3.58,4.12,4.5599999999999996,4.99]
[60,1.63,1.99,2.33,2.74,3.09,3.43]
["ONSLOW"]
[5,6.01,6.97,7.64,8.4,8.89,9.34]
[10,4.8099999999999996,5.58,6.11,6.69,7.08,7.42]
[15,4.03,4.71,5.16,5.65,5.98,6.25]
[30,2.78,3.34,3.74,4.1900000000000004,4.5,4.79]
[60,1.75,2.14,2.4300000000000002,2.79,3.05,3.3]
["ORANGE"]
[5,5.69,6.55,7.24,7.93,8.41,8.84]
[10,4.54,5.25,5.78,6.32,6.7,7.03]
[15,3.81,4.43,4.88,5.34,5.66,5.92]
[30,2.63,3.14,3.53,3.96,4.26,4.53]
[60,1.65,2.02,2.2999999999999998,2.63,2.89,3.12]
["PAMLICO"]
[5,6.68,7.73,8.7100000000000009,9.84,10.8,11.6]
[10,5.35,6.19,6.97,7.84,8.56,9.25]
[15,4.4800000000000004,5.22,5.87,6.62,7.23,7.79]
[30,3.1,3.71,4.25,4.91,5.44,5.97]
[60,1.94,2.38,2.77,3.27,3.69,4.1100000000000003]
["PASQUOTANK"]
[5,6.11,7.02,7.96,8.98,9.83,10.6]
[10,4.88,5.62,6.36,7.15,7.83,8.4499999999999993]
[15,4.09,4.74,5.36,6.04,6.61,7.12]
[30,2.83,3.36,3.89,4.4800000000000004,4.9800000000000004,5.46]
[60,1.77,2.16,2.5299999999999998,2.98,3.37,3.76]
["PENDER"]
[5,7.07,8.27,9.19,10.4,11.3,12.2]
[10,5.65,6.62,7.36,8.27,8.98,9.68]
[15,4.74,5.58,6.2,6.99,7.58,8.16]
[30,3.27,3.97,4.49,5.18,5.7,6.25]
[60,2.0499999999999998,2.54,2.93,3.45,3.87,4.3]
["PERSON"]
[5,5.41,6.28,6.98,7.73,8.26,8.74]
[10,4.33,5.03,5.58,6.16,6.57,6.94]
[15,3.63,4.24,4.71,5.2,5.55,5.85]
[30,2.5099999999999998,3.01,3.41,3.85,4.18,4.4800000000000004]
[60,1.57,1.93,2.2200000000000002,2.57,2.83,3.08]
["PITT"]
[5,6.22,7.15,8.09,9.1199999999999992,9.98,10.8]
[10,4.97,5.73,6.46,7.27,7.94,8.57]
[15,4.16,4.83,5.45,6.14,6.71,7.22]
[30,2.88,3.43,3.95,4.55,5.05,5.53]
[60,1.81,2.2000000000000002,2.57,3.03,3.42,3.81]
["POLK"]
[5,5.63,6.71,7.51,8.58,9.3800000000000008,10.199999999999999]
[10,4.5,5.36,6.01,6.84,7.48,8.11]
[15,3.77,4.5199999999999996,5.07,5.78,6.31,6.83]
[30,2.61,3.22,3.67,4.28,4.75,5.23]
[60,1.64,2.06,2.39,2.85,3.22,3.6]
["PREQUIMANS"]
[5,6.11,7.02,7.96,8.98,9.83,10.6]
[10,4.88,5.62,6.36,7.15,7.83,8.4499999999999993]
[15,4.09,4.74,5.36,6.04,6.61,7.12]
[30,2.83,3.36,3.89,4.4800000000000004,4.9800000000000004,5.46]
[60,1.77,2.16,2.5299999999999998,2.98,3.37,3.76]
["RANDOLPH"]
[5,5.72,6.65,7.28,7.97,8.41,8.8000000000000007]
[10,4.58,5.33,5.82,6.35,6.7,6.98]
[15,3.84,4.49,4.91,5.36,5.65,5.89]
[30,2.65,3.19,3.56,3.97,4.26,4.51]
[60,1.66,2.0499999999999998,2.3199999999999998,2.65,2.88,3.11]
["RICHMOND"]
[5,6.25,7.27,8.02,8.8800000000000008,9.5,10.1]
[10,5,5.82,6.41,7.08,7.57,8.01]
[15,4.1900000000000004,4.91,5.4,5.98,6.39,6.75]
[30,2.89,3.49,3.92,4.43,4.8099999999999996,5.17]
[60,1.82,2.2400000000000002,2.5499999999999998,2.95,3.26,3.56]
["ROBESON"]
[5,6.2,7.26,8.06,9.06,9.7899999999999991,10.5]
[10,4.96,5.82,6.45,7.22,7.8,8.35]
[15,4.16,4.9000000000000004,5.44,6.1,6.58,7.04]
[30,2.87,3.49,3.94,4.5199999999999996,4.96,5.39]
[60,1.8,2.23,2.57,3.01,3.36,3.71]
["ROCKINGHAM"]
[5,5.24,6.18,6.83,7.58,8.08,8.5299999999999994]
[10,4.1900000000000004,4.95,5.46,6.04,6.43,6.78]
[15,3.51,4.18,4.6100000000000003,5.0999999999999996,5.42,5.72]
[30,2.42,2.97,3.34,3.78,4.09,4.38]
[60,1.52,1.9,2.17,2.52,2.77,3.01]
["ROWAN"]
[5,5.46,6.38,7.02,7.74,8.2200000000000006,8.65]
[10,4.37,5.1100000000000003,5.62,6.17,6.55,6.87]
[15,3.66,4.3099999999999996,4.7300000000000004,5.21,5.52,5.79]
[30,2.5299999999999998,3.06,3.43,3.86,4.16,4.43]
[60,1.59,1.96,2.23,2.57,2.82,3.05]
["RUTHERFORD"]
[5,5.56,6.61,7.42,8.4700000000000006,9.25,10]
[10,4.45,5.29,5.93,6.74,7.37,7.99]
[15,3.72,4.46,5,5.7,6.22,6.73]
[30,2.57,3.17,3.62,4.22,4.68,5.15]
[60,1.61,2.0299999999999998,2.36,2.81,3.17,3.55]
["SAMPSON"]
[5,6.32,7.38,8.2200000000000006,9.25,10,10.8]
[10,5.0599999999999996,5.91,6.57,7.37,7.97,8.57]
[15,4.24,4.9800000000000004,5.54,6.22,6.73,7.22]
[30,2.93,3.54,4.01,4.6100000000000003,5.07,5.53]
[60,1.84,2.27,2.61,3.07,3.44,3.81]
["SCOTLAND"]
[5,6.11,7.14,7.92,8.89,9.6,10.3]
[10,4.88,5.72,6.34,7.09,7.64,8.18]
[15,4.09,4.82,5.34,5.99,6.46,6.89]
[30,2.83,3.43,3.87,4.43,4.8600000000000003,5.28]
[60,1.77,2.2000000000000002,2.52,2.95,3.29,3.63]
["STANLY"]
[5,5.81,6.76,7.42,8.15,8.65,9.11]
[10,4.6399999999999997,5.41,5.93,6.5,6.89,7.24]
[15,3.89,4.5599999999999996,5,5.49,5.82,6.1]
[30,2.69,3.24,3.62,4.07,4.38,4.67]
[60,1.69,2.08,2.36,2.71,2.97,3.22]
["STOKES"]
[5,5.27,6.23,6.9,7.72,8.27,8.8000000000000007]
[10,4.21,4.99,5.52,6.14,6.58,6.98]
[15,3.53,4.2,4.6500000000000004,5.19,5.56,5.89]
[30,2.44,2.99,3.37,3.85,4.18,4.51]
[60,1.53,1.92,2.19,2.56,2.84,3.11]
["SURRY"]
[5,4.9400000000000004,5.87,6.52,7.32,7.88,8.41]
[10,3.95,4.7,5.21,5.83,6.28,6.68]
[15,3.32,3.96,4.4000000000000004,4.93,5.3,5.63]
[30,2.29,2.81,3.18,3.65,3.99,4.3099999999999996]
[60,1.44,1.8,2.0699999999999998,2.4300000000000002,2.7,2.97]
["SWAIN"]
[5,4.82,5.65,6.52,7.48,8.32,9.1300000000000008]
[10,3.86,4.5199999999999996,5.21,5.96,6.62,7.25]
[15,3.23,3.82,4.4000000000000004,5.04,5.59,6.11]
[30,2.23,2.71,3.18,3.73,4.21,4.68]
[60,1.4,1.74,2.0699999999999998,2.48,2.85,3.22]
["TRANSYLVANIA"]
[5,5.96,7.08,7.94,9.0500000000000007,9.9,10.8]
[10,4.76,5.67,6.35,7.21,7.88,8.56]
[15,3.99,4.78,5.36,6.1,6.66,7.21]
[30,2.76,3.4,3.88,4.51,5.01,5.52]
[60,1.73,2.1800000000000002,2.5299999999999998,3.01,3.4,3.8]
["TYRRELL"]
[5,6.26,7.12,8.14,9.17,10.1,10.9]
[10,5,5.69,6.5,7.31,8.0299999999999994,8.67]
[15,4.2,4.8,5.48,6.17,6.78,7.3]
[30,2.9,3.41,3.97,4.57,5.0999999999999996,5.59]
[60,1.82,2.19,2.59,3.04,3.46,3.85]
["UNION"]
[5,6.05,7.02,7.73,8.5299999999999994,9.08,9.6]
[10,4.84,5.62,6.17,6.8,7.24,7.63]
[15,4.0599999999999996,4.74,5.21,5.74,6.1,6.42]
[30,2.8,3.37,3.77,4.25,4.5999999999999996,4.92]
[60,1.76,2.16,2.46,2.83,3.12,3.39]
["VANCE"]
[5,5.35,6.11,6.92,7.73,8.3800000000000008,8.9499999999999993]
[10,4.28,4.9000000000000004,5.54,6.16,6.67,7.11]
[15,3.58,4.13,4.67,5.2,5.63,5.99]
[30,2.48,2.93,3.38,3.85,4.24,4.59]
[60,1.55,1.88,2.2000000000000002,2.57,2.87,3.16]
["WAKE"]
[5,5.68,6.53,7.25,8,8.57,9.06]
[10,4.54,5.23,5.8,6.38,6.82,7.2]
[15,3.8,4.4000000000000004,4.8899999999999997,5.39,5.76,6.07]
[30,2.63,3.13,3.54,3.99,4.34,4.6500000000000004]
[60,1.65,2.0099999999999998,2.31,2.66,2.94,3.2]
["WARREN"]
[5,5.4,6.04,6.97,7.8,8.5399999999999991,9.17]
[10,4.32,4.84,5.57,6.22,6.8,7.29]
[15,3.62,4.08,4.7,5.25,5.74,6.14]
[30,2.5,2.9,3.41,3.89,4.32,4.7]
[60,1.57,1.86,2.2200000000000002,2.59,2.93,3.24]
["WASHINGTON"]
[5,6.37,7.24,8.26,9.31,10.199999999999999,11.1]
[10,5.09,5.8,6.61,7.42,8.15,8.8000000000000007]
[15,4.2699999999999996,4.8899999999999997,5.57,6.27,6.88,7.42]
[30,2.95,3.47,4.04,4.6399999999999997,5.18,5.68]
[60,1.85,2.23,2.63,3.09,3.51,3.91]
["WATAUGA"]
[5,5.69,6.61,7.38,8.42,9.25,10.1]
[10,4.55,5.3,5.9,6.71,7.37,8.0399999999999991]
[15,3.81,4.47,4.9800000000000004,5.68,6.22,6.78]
[30,2.63,3.17,3.61,4.2,4.68,5.19]
[60,1.65,2.0299999999999998,2.35,2.8,3.17,3.57]
["WAYNE"]
[5,6.25,7.15,8.0500000000000007,9.01,9.8000000000000007,10.6]
[10,5,5.72,6.44,7.19,7.81,8.39]
[15,4.1900000000000004,4.83,5.43,6.07,6.59,7.07]
[30,2.89,3.43,3.93,4.5,4.97,5.41]
[60,1.82,2.2000000000000002,2.56,2.99,3.36,3.73]
["WILKES"]
[5,4.96,5.87,6.59,7.5,8.2100000000000009,8.92]
[10,3.97,4.7,5.26,5.98,6.53,7.08]
[15,3.32,3.96,4.4400000000000004,5.05,5.51,5.97]
[30,2.29,2.82,3.22,3.74,4.1500000000000004,4.57]
[60,1.44,1.81,2.09,2.4900000000000002,2.81,3.15]
["WILSON"]
[5,5.83,6.67,7.54,8.48,9.26,10]
[10,4.66,5.34,6.03,6.76,7.37,7.95]
[15,3.9,4.5,5.08,5.71,6.23,6.7]
[30,2.7,3.2,3.68,4.2300000000000004,4.6900000000000004,5.13]
[60,1.69,2.0499999999999998,2.4,2.82,3.18,3.53]
["YADKIN"]
[5,5.05,5.98,6.64,7.43,7.98,8.5]
[10,4.04,4.78,5.3,5.92,6.35,6.75]
[15,3.39,4.04,4.47,5,5.36,5.69]
[30,2.34,2.87,3.24,3.7,4.04,4.3600000000000003]
[60,1.47,1.84,2.11,2.4700000000000002,2.74,3]
["YANCEY"]
[5,4.92,5.87,6.59,7.55,8.27,8.99]
[10,3.94,4.7,5.27,6.01,6.58,7.15]
[15,3.3,3.96,4.4400000000000004,5.08,5.56,6.02]
[30,2.2799999999999998,2.81,3.22,3.76,4.18,4.6100000000000003]
[60,1.43,1.8,2.1,2.5099999999999998,2.84,3.18]
["Z_CUSTOM_IDF"]
[5]
[10]
[15]
[30]
[60]